{
  "info": {
    "version": "0.0.2",
    "license": {
      "name": "MIT"
    },
    "title": "eval_perf"
  },
  "paths": {
    "/eval_perf/status": {
      "get": {
        "operationId": "status",
        "summary": "get information about the status of a job",
        "responses": {
          "default": {
            "description": "unexpected error",
            "schema": {
              "$ref": "#/definitions/Error"
            }
          },
          "200": {
            "description": "returns a string that describe the status",
            "schema": {
              "type": "string",
              "description": "The status of the evaluation job.",
              "example": "A_string_reporting_the_status"
            }
          }
        },
        "parameters": [
          {
            "required": true,
            "type": "string",
            "description": "The job id you want know the status",
            "name": "job_id",
            "in": "query"
          }
        ],
        "tags": null
      }
    },
    "/power_performance_evaluations": {
      "post": {
        "responses": {
          "200": {
            "description": "DNN model power/execution time evaluation result",
            "schema": {
              "$ref": "#/definitions/Offloaded_job"
            }
          }
        },
        "parameters": [
          {
            "schema": {
              "$ref": "#/definitions/Power_perf_job"
            },
            "required": true,
            "description": "parameters for the evaluation",
            "name": "power_perf_job",
            "in": "body"
          },
          {
            "required": true,
            "type": "string",
            "description": "Id to identify the callback",
            "name": "callback_id",
            "in": "query"
          }
        ],
        "tags": [
          "eval_perf"
        ],
        "default": {
          "description": "unexpected error",
          "schema": {
            "$ref": "#/definitions/Error"
          }
        },
        "summary": "Offload an energy/execution_time evaluation",
        "operationId": "powerperfeval"
      },
      "get": {
        "responses": {
          "200": {
            "description": "DNN model power/execution time evaluation result",
            "schema": {
              "$ref": "#/definitions/Evaluation_case"
            }
          }
        },
        "parameters": [
          {
            "required": true,
            "type": "string",
            "description": "The project id",
            "name": "project_id",
            "in": "query"
          },
          {
            "required": true,
            "type": "string",
            "description": "Id of a DNN model to evaluate",
            "name": "algorithm_configuration_id",
            "in": "query"
          },
          {
            "required": true,
            "type": "string",
            "description": "Target hardware architecture id",
            "name": "architecture_id",
            "in": "query"
          }
        ],
        "tags": [
          "eval_perf"
        ],
        "default": {
          "description": "unexpected error",
          "schema": {
            "$ref": "#/definitions/Error"
          }
        },
        "summary": "Result of energy/execution_time evaluation",
        "operationId": "evalPerf_results"
      }
    }
  },
  "produces": [
    "application/json"
  ],
  "basePath": "/api",
  "definitions": {
    "Offloaded_job": {
      "required": [
        "message",
        "job_id"
      ],
      "properties": {
        "message": {
          "type": "string"
        },
        "job_id": {
          "type": "string"
        }
      }
    },
    "Power_perf_job": {
      "required": [
        "project_id",
        "algorithm_id",
        "architecture_id"
      ],
      "properties": {
        "project_id": {
          "type": "string"
        },
        "architecture_id": {
          "type": "string"
        },
        "method": {
          "type": "string"
        },
        "algorithm_id": {
          "type": "string"
        }
      }
    },
    "Evaluation_case": {
      "required": [
        "performance",
        "energy",
        "processors",
        "memory"
      ],
      "properties": {
        "performance": {
          "type": "number",
          "format": "float"
        },
        "energy": {
          "type": "number",
          "format": "float"
        },
        "processors": {
          "type": "integer",
          "format": "float"
        },
        "memory": {
          "type": "number",
          "format": "float"
        }
      }
    },
    "Error": {
      "required": [
        "code",
        "message"
      ],
      "properties": {
        "message": {
          "type": "string"
        },
        "code": {
          "type": "integer",
          "format": "int32"
        }
      }
    }
  },
  "swagger": "2.0",
  "consumes": [
    "application/json"
  ]
}