{
        "CH":1,
        "H":32,
        "W":24,
        "CL":13,
        "KS":"5x5",
        "softmax": false,
        "yolo":false,
        "double_conv": false,
        "batch_norm": true,
        "convLayers":[2],
        "fcLayers":[2],
        "Mvalues":[8],
        "Jvalues":[32]}
