{
	"id": 1,
	"title": "Name of the pipeline",
	"version": 123,
	"project_id": "0011je02",
	"user_id": "dfsdasd",
	"config": [{
			"column": "sample_transforms",
			"plugins": [{
					"name": "Load audio from wav",
					"module": "plugins.Transform.load_audio_from_wav.load_audio_from_wav",
					"class": "LoadAudioFromWav",
					"version": 123,
					"validation": true,
					"parameters": {
						"mono": true,
						"signal_rate": 16000
					}
				},
				{
					"name": "Cut or pad to length",
					"module": "plugins.Transform.cut_or_pad_to_length.cut_or_pad_to_length",
					"validation": true,
					"version": 123,
					"class": "CutOrPadToLength",
					"parameters": {
						"target_length": 16000
					}
				}
			]
		},
		{
			"column": "dataset_transforms",
			"plugins": []
		},
		{
			"column": "batch_transforms",
			"plugins": [
				{
					"name": "Random speed",
					"module": "plugins.Transform.random_speed.random_speed",
					"validation": false,
					"version": 123,
					"class": "RandomSpeed",
					"parameters": {
						"probability": 0.3,
						"top_db": 30
					}
				},
				{
					"name": "Random pitch",
					"module": "plugins.Transform.random_pitch.random_pitch",
					"validation": false,
					"version": 123,
					"class": "RandomPitch",
					"parameters": {
						"probability": 0.3
					}
				},
				{
					"name": "Random time shift",
					"module": "plugins.Transform.random_time_shift.random_time_shift",
					"validation": false,
					"version": 123,
					"class": "RandomTimeShift",
					"parameters": {
						"probability": 0.3,
						"top_db": 30
					}
				},
				{
					"name": "Random sum noise",
					"module": "plugins.Transform.random_sum_noise.random_sum_noise",
					"validation": false,
					"version": 123,
					"class": "RandomSumNoise",
					"parameters": {
						"probability": 0.3,
						"noise_folder": "/opt/www/shared_data/usecases/REPLY_KWS/_background_noise_",
						"min_noise_coef": 0.2,
						"max_noise_coef": 0.7
					}
				},
				{
					"name": "Audio to MFCC",
					"module": "plugins.Transform.audio_to_mfcc.audio_to_mfcc",
					"validation": true,
					"version": 123,
					"class": "AudioToMFCC",
					"parameters": {
						"signal_rate": 16000,
						"num_frames": 32,
						"n_mfcc": 12
					}
				},
				{
					"name": "To tensor",
					"module": "torchvision.transforms",
					"class": "ToTensor",
					"version": 123,
					"validation": true,
					"parameters": {}
				}
			]
		}
	]
}
