{
        "CH":1,
        "H":24,
        "W":24,
        "CL":6,
        "KS":"3x3",
        "softmax": false,
        "yolo":false,
        "double_conv": false,
        "batch_norm": true,
        "convLayers":[2],
        "fcLayers":[2],
        "Mvalues":[8],
        "Jvalues":[32]}
