{
	"id": 1,
	"title": "Name of the pipeline",
	"version": 123,
	"project_id": "0011je02",
	"user_id": "dfsdasd",
	"config": [{
			"column": "sample_transforms",
			"plugins": [{
					"name": "Load audio from wav",
					"module": "plugins.Transform.load_audio_from_wav.load_audio_from_wav",
					"class": "LoadAudioFromWav",
					"version": 123,
					"validation": true,
					"parameters": {
						"mono": true,
						"signal_rate": 16000
					}
				},
				{
					"name": "Cut or pad to length",
					"module": "plugins.Transform.cut_or_pad_to_length.cut_or_pad_to_length",
					"validation": true,
					"version": 123,
					"class": "CutOrPadToLength",
					"parameters": {
						"target_length": 16000
					}
				},
				{
					"name": "Audio to Mel",
					"module": "plugins.Transform.audio_to_mel.audio_to_mel",
					"validation": true,
					"version": 123,
					"class": "AudioToMel",
					"parameters": {
						"signal_rate": 16000,
						"num_frames": 32,
						"n_mels": 16
					}
				}
			]
		},
		{
			"column": "dataset_transforms",
			"plugins": []
		},
		{
			"column": "batch_transforms",
			"plugins": [
				{
					"name": "To tensor",
					"module": "torchvision.transforms",
					"class": "ToTensor",
					"version": 123,
					"validation": true,
					"parameters": {}
				}
			]
		}
	]
}
