{
        "CH":1,
        "H":32,
        "W":12,
        "CL":13,
        "KS":"3x3",
        "softmax": false,
        "yolo":false,
        "double_conv": false,
        "batch_norm": true,
        "convLayers":[1, 2],
        "fcLayers":[2],
        "Mvalues":[8],
        "Jvalues":[32,64]}
