{
  "type": "sdf",
  "name": "CNTKGraph_LB",
  "node_number": 13,
  "edge_number": 14,
    "nodes": [
      {
        "id": 0,
        "name": "Input3",
        "function": "null",
        "group": "null",
        "length": 28,
        "port_number": 1,
        "wcet":[1,1,1,1,1,1,1,1,1,1,1,1,1,1,1,1,1,1,1,1,1,1,1,1,1,1,1,1], 
        "ports": [

          {
            "id": 0,
            "name": "OP0",
            "rate": [28,28,28,28,28,28,28,28,28,28,28,28,28,28,28,28,28,28,28,28,28,28,28,28,28,28,28,28],
            "type": "out"
          }
        ]
      }
      ,
      {
        "id": 1,
        "name": "Convolution28",
        "function": "CONV(25)",
        "group": "null",
        "length": 28,
        "port_number": 4,
        "wcet":[1,1,1,1,1,1,1,1,1,1,1,1,1,1,1,1,1,1,1,1,1,1,1,1,1,1,1,1], 
        "ports": [

          {
            "id": 0,
            "name": "IP0",
            "rate": [140,28,28,28,28,28,28,28,28,28,28,28,28,28,28,28,28,28,28,28,28,28,28,28,0,0,0,0],
            "type": "in"
          },
          {
            "id": 1,
            "name": "OP0",
            "rate": [0,112,112,112,112,112,112,112,112,112,112,112,112,112,112,112,112,112,112,112,112,112,112,112,112,112,112,112],
            "type": "out"
          },
          {
            "id": 2,
            "name": "IP1",
            "rate": [0,112,112,112,112,112,112,112,112,112,112,112,112,112,112,112,112,112,112,112,112,112,112,112,112,112,112,112],
            "type": "in"
          },
          {
            "id": 3,
            "name": "OP1",
            "rate": [224,224,224,224,224,224,224,224,224,224,224,224,224,224,224,224,224,224,224,224,224,224,224,224,224,224,224,224],
            "type": "out"
          }
        ]
      }
      ,
      {
        "id": 2,
        "name": "Plus30",
        "function": "AddConst(1)",
        "group": "null",
        "length": 28,
        "port_number": 2,
        "wcet":[1,1,1,1,1,1,1,1,1,1,1,1,1,1,1,1,1,1,1,1,1,1,1,1,1,1,1,1], 
        "ports": [

          {
            "id": 0,
            "name": "IP0",
            "rate": [224,224,224,224,224,224,224,224,224,224,224,224,224,224,224,224,224,224,224,224,224,224,224,224,224,224,224,224],
            "type": "in"
          },
          {
            "id": 1,
            "name": "OP0",
            "rate": [224,224,224,224,224,224,224,224,224,224,224,224,224,224,224,224,224,224,224,224,224,224,224,224,224,224,224,224],
            "type": "out"
          }
        ]
      }
      ,
      {
        "id": 3,
        "name": "ReLU32",
        "function": "ReLU(1)",
        "group": "null",
        "length": 28,
        "port_number": 2,
        "wcet":[1,1,1,1,1,1,1,1,1,1,1,1,1,1,1,1,1,1,1,1,1,1,1,1,1,1,1,1], 
        "ports": [

          {
            "id": 0,
            "name": "IP0",
            "rate": [224,224,224,224,224,224,224,224,224,224,224,224,224,224,224,224,224,224,224,224,224,224,224,224,224,224,224,224],
            "type": "in"
          },
          {
            "id": 1,
            "name": "OP0",
            "rate": [224,224,224,224,224,224,224,224,224,224,224,224,224,224,224,224,224,224,224,224,224,224,224,224,224,224,224,224],
            "type": "out"
          }
        ]
      }
      ,
      {
        "id": 4,
        "name": "Pooling66",
        "function": "MAXPOOL(4)",
        "group": "null",
        "length": 14,
        "port_number": 2,
        "wcet":[1,1,1,1,1,1,1,1,1,1,1,1,1,1], 
        "ports": [

          {
            "id": 0,
            "name": "IP0",
            "rate": [448,448,448,448,448,448,448,448,448,448,448,448,448,448],
            "type": "in"
          },
          {
            "id": 1,
            "name": "OP0",
            "rate": [112,112,112,112,112,112,112,112,112,112,112,112,112,112],
            "type": "out"
          }
        ]
      }
      ,
      {
        "id": 5,
        "name": "Convolution110",
        "function": "CONV(200)",
        "group": "null",
        "length": 14,
        "port_number": 4,
        "wcet":[1,1,1,1,1,1,1,1,1,1,1,1,1,1], 
        "ports": [

          {
            "id": 0,
            "name": "IP0",
            "rate": [560,112,112,112,112,112,112,112,112,112,0,0,0,0],
            "type": "in"
          },
          {
            "id": 1,
            "name": "OP0",
            "rate": [0,56,56,56,56,56,56,56,56,56,56,56,56,56],
            "type": "out"
          },
          {
            "id": 2,
            "name": "IP1",
            "rate": [0,56,56,56,56,56,56,56,56,56,56,56,56,56],
            "type": "in"
          },
          {
            "id": 3,
            "name": "OP1",
            "rate": [224,224,224,224,224,224,224,224,224,224,224,224,224,224],
            "type": "out"
          }
        ]
      }
      ,
      {
        "id": 6,
        "name": "Plus112",
        "function": "AddConst(1)",
        "group": "null",
        "length": 14,
        "port_number": 2,
        "wcet":[1,1,1,1,1,1,1,1,1,1,1,1,1,1], 
        "ports": [

          {
            "id": 0,
            "name": "IP0",
            "rate": [224,224,224,224,224,224,224,224,224,224,224,224,224,224],
            "type": "in"
          },
          {
            "id": 1,
            "name": "OP0",
            "rate": [224,224,224,224,224,224,224,224,224,224,224,224,224,224],
            "type": "out"
          }
        ]
      }
      ,
      {
        "id": 7,
        "name": "ReLU114",
        "function": "ReLU(1)",
        "group": "null",
        "length": 14,
        "port_number": 2,
        "wcet":[1,1,1,1,1,1,1,1,1,1,1,1,1,1], 
        "ports": [

          {
            "id": 0,
            "name": "IP0",
            "rate": [224,224,224,224,224,224,224,224,224,224,224,224,224,224],
            "type": "in"
          },
          {
            "id": 1,
            "name": "OP0",
            "rate": [224,224,224,224,224,224,224,224,224,224,224,224,224,224],
            "type": "out"
          }
        ]
      }
      ,
      {
        "id": 8,
        "name": "Pooling160",
        "function": "MAXPOOL(9)",
        "group": "null",
        "length": 5,
        "port_number": 2,
        "wcet":[1,1,1,1,1], 
        "ports": [

          {
            "id": 0,
            "name": "IP0",
            "rate": [672,672,672,672,448],
            "type": "in"
          },
          {
            "id": 1,
            "name": "OP0",
            "rate": [80,80,80,80,80],
            "type": "out"
          }
        ]
      }
      ,
      {
        "id": 9,
        "name": "Times212_reshape0",
        "function": "RESHAPE(6400)",
        "group": "null",
        "length": 5,
        "port_number": 2,
        "wcet":[1,1,1,1,1], 
        "ports": [

          {
            "id": 0,
            "name": "IP0",
            "rate": [80,80,80,80,80],
            "type": "in"
          },
          {
            "id": 1,
            "name": "OP0",
            "rate": [0,0,0,0,256],
            "type": "out"
          }
        ]
      }
      ,
      {
        "id": 10,
        "name": "Times212",
        "function": "MATMUL(400)",
        "group": "null",
        "length": 1,
        "port_number": 2,
        "wcet":[1], 
        "ports": [

          {
            "id": 0,
            "name": "IP0",
            "rate": [400],
            "type": "in"
          },
          {
            "id": 1,
            "name": "OP0",
            "rate": [10],
            "type": "out"
          }
        ]
      }
      ,
      {
        "id": 11,
        "name": "Plus214",
        "function": "AddConst(1)",
        "group": "null",
        "length": 1,
        "port_number": 2,
        "wcet":[1], 
        "ports": [

          {
            "id": 0,
            "name": "IP0",
            "rate": [10],
            "type": "in"
          },
          {
            "id": 1,
            "name": "OP0",
            "rate": [10],
            "type": "out"
          }
        ]
      }
      ,
      {
        "id": 12,
        "name": "Plus214_Output_0",
        "function": "WRITE",
        "group": "null",
        "length": 1,
        "port_number": 1,
        "wcet":[1], 
        "ports": [

          {
            "id": 0,
            "name": "IP0",
            "rate": [10],
            "type": "in"
          }
        ]
      }

    ],
    "edges": [
      {
        "id": 0,
        "name": "Input3toConvolution28",
        "src": [0,0],
        "dst": [1,0]
      }
      ,
      {
        "id": 1,
        "name": "Convolution28toConvolution28_1",
        "src": [1,1],
        "dst": [1,2]
      }
      ,
      {
        "id": 2,
        "name": "Convolution28toPlus30",
        "src": [1,3],
        "dst": [2,0]
      }
      ,
      {
        "id": 3,
        "name": "Plus30toReLU32",
        "src": [2,1],
        "dst": [3,0]
      }
      ,
      {
        "id": 4,
        "name": "ReLU32toPooling66",
        "src": [3,1],
        "dst": [4,0]
      }
      ,
      {
        "id": 5,
        "name": "Pooling66toConvolution110",
        "src": [4,1],
        "dst": [5,0]
      }
      ,
      {
        "id": 6,
        "name": "Convolution110toConvolution110_6",
        "src": [5,1],
        "dst": [5,2]
      }
      ,
      {
        "id": 7,
        "name": "Convolution110toPlus112",
        "src": [5,3],
        "dst": [6,0]
      }
      ,
      {
        "id": 8,
        "name": "Plus112toReLU114",
        "src": [6,1],
        "dst": [7,0]
      }
      ,
      {
        "id": 9,
        "name": "ReLU114toPooling160",
        "src": [7,1],
        "dst": [8,0]
      }
      ,
      {
        "id": 10,
        "name": "Pooling160toTimes212_reshape0",
        "src": [8,1],
        "dst": [9,0]
      }
      ,
      {
        "id": 11,
        "name": "Times212_reshape0toTimes212",
        "src": [9,1],
        "dst": [10,0]
      }
      ,
      {
        "id": 12,
        "name": "Times212toPlus214",
        "src": [10,1],
        "dst": [11,0]
      }
      ,
      {
        "id": 13,
        "name": "Plus214toPlus214_Output_0",
        "src": [11,1],
        "dst": [12,0]
      }

    ]
}
