{
  "type": "sdf",
  "name": "bvlc_alexnet_LB",
  "node_number": 25,
  "edge_number": 32,
    "nodes": [
      {
        "id": 0,
        "name": "data_0",
        "function": "null",
        "group": "null",
        "length": 224,
        "port_number": 1,
        "wcet":[1,1,1,1,1,1,1,1,1,1,1,1,1,1,1,1,1,1,1,1,1,1,1,1,1,1,1,1,1,1,1,1,1,1,1,1,1,1,1,1,1,1,1,1,1,1,1,1,1,1,1,1,1,1,1,1,1,1,1,1,1,1,1,1,1,1,1,1,1,1,1,1,1,1,1,1,1,1,1,1,1,1,1,1,1,1,1,1,1,1,1,1,1,1,1,1,1,1,1,1,1,1,1,1,1,1,1,1,1,1,1,1,1,1,1,1,1,1,1,1,1,1,1,1,1,1,1,1,1,1,1,1,1,1,1,1,1,1,1,1,1,1,1,1,1,1,1,1,1,1,1,1,1,1,1,1,1,1,1,1,1,1,1,1,1,1,1,1,1,1,1,1,1,1,1,1,1,1,1,1,1,1,1,1,1,1,1,1,1,1,1,1,1,1,1,1,1,1,1,1,1,1,1,1,1,1,1,1,1,1,1,1,1,1,1,1,1,1,1,1,1,1,1,1], 
        "ports": [

          {
            "id": 0,
            "name": "OP0",
            "rate": [672,672,672,672,672,672,672,672,672,672,672,672,672,672,672,672,672,672,672,672,672,672,672,672,672,672,672,672,672,672,672,672,672,672,672,672,672,672,672,672,672,672,672,672,672,672,672,672,672,672,672,672,672,672,672,672,672,672,672,672,672,672,672,672,672,672,672,672,672,672,672,672,672,672,672,672,672,672,672,672,672,672,672,672,672,672,672,672,672,672,672,672,672,672,672,672,672,672,672,672,672,672,672,672,672,672,672,672,672,672,672,672,672,672,672,672,672,672,672,672,672,672,672,672,672,672,672,672,672,672,672,672,672,672,672,672,672,672,672,672,672,672,672,672,672,672,672,672,672,672,672,672,672,672,672,672,672,672,672,672,672,672,672,672,672,672,672,672,672,672,672,672,672,672,672,672,672,672,672,672,672,672,672,672,672,672,672,672,672,672,672,672,672,672,672,672,672,672,672,672,672,672,672,672,672,672,672,672,672,672,672,672,672,672,672,672,672,672,672,672,672,672,672,672],
            "type": "out"
          }
        ]
      }
      ,
      {
        "id": 1,
        "name": "node_Conv0",
        "function": "CONV(121)",
        "group": "null",
        "length": 55,
        "port_number": 4,
        "wcet":[1,1,1,1,1,1,1,1,1,1,1,1,1,1,1,1,1,1,1,1,1,1,1,1,1,1,1,1,1,1,1,1,1,1,1,1,1,1,1,1,1,1,1,1,1,1,1,1,1,1,1,1,1,1,1], 
        "ports": [

          {
            "id": 0,
            "name": "IP0",
            "rate": [7392,2688,2688,2688,2688,2688,2688,2688,2688,2688,2688,2688,2688,2688,2688,2688,2688,2688,2688,2688,2688,2688,2688,2688,2688,2688,2688,2688,2688,2688,2688,2688,2688,2688,2688,2688,2688,2688,2688,2688,2688,2688,2688,2688,2688,2688,2688,2688,2688,2688,2688,2688,2688,2688,672],
            "type": "in"
          },
          {
            "id": 1,
            "name": "OP0",
            "rate": [0,4704,4704,4704,4704,4704,4704,4704,4704,4704,4704,4704,4704,4704,4704,4704,4704,4704,4704,4704,4704,4704,4704,4704,4704,4704,4704,4704,4704,4704,4704,4704,4704,4704,4704,4704,4704,4704,4704,4704,4704,4704,4704,4704,4704,4704,4704,4704,4704,4704,4704,4704,4704,4704,4704],
            "type": "out"
          },
          {
            "id": 2,
            "name": "IP1",
            "rate": [0,4704,4704,4704,4704,4704,4704,4704,4704,4704,4704,4704,4704,4704,4704,4704,4704,4704,4704,4704,4704,4704,4704,4704,4704,4704,4704,4704,4704,4704,4704,4704,4704,4704,4704,4704,4704,4704,4704,4704,4704,4704,4704,4704,4704,4704,4704,4704,4704,4704,4704,4704,4704,4704,4704],
            "type": "in"
          },
          {
            "id": 3,
            "name": "OP1",
            "rate": [5280,5280,5280,5280,5280,5280,5280,5280,5280,5280,5280,5280,5280,5280,5280,5280,5280,5280,5280,5280,5280,5280,5280,5280,5280,5280,5280,5280,5280,5280,5280,5280,5280,5280,5280,5280,5280,5280,5280,5280,5280,5280,5280,5280,5280,5280,5280,5280,5280,5280,5280,5280,5280,5280,5280],
            "type": "out"
          }
        ]
      }
      ,
      {
        "id": 2,
        "name": "node_Relu1",
        "function": "ReLU(1)",
        "group": "null",
        "length": 55,
        "port_number": 2,
        "wcet":[1,1,1,1,1,1,1,1,1,1,1,1,1,1,1,1,1,1,1,1,1,1,1,1,1,1,1,1,1,1,1,1,1,1,1,1,1,1,1,1,1,1,1,1,1,1,1,1,1,1,1,1,1,1,1], 
        "ports": [

          {
            "id": 0,
            "name": "IP0",
            "rate": [5280,5280,5280,5280,5280,5280,5280,5280,5280,5280,5280,5280,5280,5280,5280,5280,5280,5280,5280,5280,5280,5280,5280,5280,5280,5280,5280,5280,5280,5280,5280,5280,5280,5280,5280,5280,5280,5280,5280,5280,5280,5280,5280,5280,5280,5280,5280,5280,5280,5280,5280,5280,5280,5280,5280],
            "type": "in"
          },
          {
            "id": 1,
            "name": "OP0",
            "rate": [5280,5280,5280,5280,5280,5280,5280,5280,5280,5280,5280,5280,5280,5280,5280,5280,5280,5280,5280,5280,5280,5280,5280,5280,5280,5280,5280,5280,5280,5280,5280,5280,5280,5280,5280,5280,5280,5280,5280,5280,5280,5280,5280,5280,5280,5280,5280,5280,5280,5280,5280,5280,5280,5280,5280],
            "type": "out"
          }
        ]
      }
      ,
      {
        "id": 3,
        "name": "node_LRN2",
        "function": "LRN(253440)",
        "group": "null",
        "length": 55,
        "port_number": 2,
        "wcet":[1,1,1,1,1,1,1,1,1,1,1,1,1,1,1,1,1,1,1,1,1,1,1,1,1,1,1,1,1,1,1,1,1,1,1,1,1,1,1,1,1,1,1,1,1,1,1,1,1,1,1,1,1,1,1], 
        "ports": [

          {
            "id": 0,
            "name": "IP0",
            "rate": [5280,5280,5280,5280,5280,5280,5280,5280,5280,5280,5280,5280,5280,5280,5280,5280,5280,5280,5280,5280,5280,5280,5280,5280,5280,5280,5280,5280,5280,5280,5280,5280,5280,5280,5280,5280,5280,5280,5280,5280,5280,5280,5280,5280,5280,5280,5280,5280,5280,5280,5280,5280,5280,5280,5280],
            "type": "in"
          },
          {
            "id": 1,
            "name": "OP0",
            "rate": [5280,5280,5280,5280,5280,5280,5280,5280,5280,5280,5280,5280,5280,5280,5280,5280,5280,5280,5280,5280,5280,5280,5280,5280,5280,5280,5280,5280,5280,5280,5280,5280,5280,5280,5280,5280,5280,5280,5280,5280,5280,5280,5280,5280,5280,5280,5280,5280,5280,5280,5280,5280,5280,5280,5280],
            "type": "out"
          }
        ]
      }
      ,
      {
        "id": 4,
        "name": "node_MaxPool3",
        "function": "MAXPOOL(9)",
        "group": "null",
        "length": 27,
        "port_number": 4,
        "wcet":[1,1,1,1,1,1,1,1,1,1,1,1,1,1,1,1,1,1,1,1,1,1,1,1,1,1,1], 
        "ports": [

          {
            "id": 0,
            "name": "IP0",
            "rate": [15840,10560,10560,10560,10560,10560,10560,10560,10560,10560,10560,10560,10560,10560,10560,10560,10560,10560,10560,10560,10560,10560,10560,10560,10560,10560,10560],
            "type": "in"
          },
          {
            "id": 1,
            "name": "OP0",
            "rate": [0,55,55,55,55,55,55,55,55,55,55,55,55,55,55,55,55,55,55,55,55,55,55,55,55,55,55],
            "type": "out"
          },
          {
            "id": 2,
            "name": "IP1",
            "rate": [0,55,55,55,55,55,55,55,55,55,55,55,55,55,55,55,55,55,55,55,55,55,55,55,55,55,55],
            "type": "in"
          },
          {
            "id": 3,
            "name": "OP1",
            "rate": [2592,2592,2592,2592,2592,2592,2592,2592,2592,2592,2592,2592,2592,2592,2592,2592,2592,2592,2592,2592,2592,2592,2592,2592,2592,2592,2592],
            "type": "out"
          }
        ]
      }
      ,
      {
        "id": 5,
        "name": "node_Conv4",
        "function": "CONV(2400)",
        "group": "null",
        "length": 27,
        "port_number": 4,
        "wcet":[1,1,1,1,1,1,1,1,1,1,1,1,1,1,1,1,1,1,1,1,1,1,1,1,1,1,1], 
        "ports": [

          {
            "id": 0,
            "name": "IP0",
            "rate": [12960,2592,2592,2592,2592,2592,2592,2592,2592,2592,2592,2592,2592,2592,2592,2592,2592,2592,2592,2592,2592,2592,2592,0,0,0,0],
            "type": "in"
          },
          {
            "id": 1,
            "name": "OP0",
            "rate": [0,108,108,108,108,108,108,108,108,108,108,108,108,108,108,108,108,108,108,108,108,108,108,108,108,108,108],
            "type": "out"
          },
          {
            "id": 2,
            "name": "IP1",
            "rate": [0,108,108,108,108,108,108,108,108,108,108,108,108,108,108,108,108,108,108,108,108,108,108,108,108,108,108],
            "type": "in"
          },
          {
            "id": 3,
            "name": "OP1",
            "rate": [6912,6912,6912,6912,6912,6912,6912,6912,6912,6912,6912,6912,6912,6912,6912,6912,6912,6912,6912,6912,6912,6912,6912,6912,6912,6912,6912],
            "type": "out"
          }
        ]
      }
      ,
      {
        "id": 6,
        "name": "node_Relu5",
        "function": "ReLU(1)",
        "group": "null",
        "length": 27,
        "port_number": 2,
        "wcet":[1,1,1,1,1,1,1,1,1,1,1,1,1,1,1,1,1,1,1,1,1,1,1,1,1,1,1], 
        "ports": [

          {
            "id": 0,
            "name": "IP0",
            "rate": [6912,6912,6912,6912,6912,6912,6912,6912,6912,6912,6912,6912,6912,6912,6912,6912,6912,6912,6912,6912,6912,6912,6912,6912,6912,6912,6912],
            "type": "in"
          },
          {
            "id": 1,
            "name": "OP0",
            "rate": [6912,6912,6912,6912,6912,6912,6912,6912,6912,6912,6912,6912,6912,6912,6912,6912,6912,6912,6912,6912,6912,6912,6912,6912,6912,6912,6912],
            "type": "out"
          }
        ]
      }
      ,
      {
        "id": 7,
        "name": "node_LRN6",
        "function": "LRN(884736)",
        "group": "null",
        "length": 27,
        "port_number": 2,
        "wcet":[1,1,1,1,1,1,1,1,1,1,1,1,1,1,1,1,1,1,1,1,1,1,1,1,1,1,1], 
        "ports": [

          {
            "id": 0,
            "name": "IP0",
            "rate": [6912,6912,6912,6912,6912,6912,6912,6912,6912,6912,6912,6912,6912,6912,6912,6912,6912,6912,6912,6912,6912,6912,6912,6912,6912,6912,6912],
            "type": "in"
          },
          {
            "id": 1,
            "name": "OP0",
            "rate": [6912,6912,6912,6912,6912,6912,6912,6912,6912,6912,6912,6912,6912,6912,6912,6912,6912,6912,6912,6912,6912,6912,6912,6912,6912,6912,6912],
            "type": "out"
          }
        ]
      }
      ,
      {
        "id": 8,
        "name": "node_MaxPool7",
        "function": "MAXPOOL(9)",
        "group": "null",
        "length": 13,
        "port_number": 4,
        "wcet":[1,1,1,1,1,1,1,1,1,1,1,1,1], 
        "ports": [

          {
            "id": 0,
            "name": "IP0",
            "rate": [20736,13824,13824,13824,13824,13824,13824,13824,13824,13824,13824,13824,13824],
            "type": "in"
          },
          {
            "id": 1,
            "name": "OP0",
            "rate": [0,27,27,27,27,27,27,27,27,27,27,27,27],
            "type": "out"
          },
          {
            "id": 2,
            "name": "IP1",
            "rate": [0,27,27,27,27,27,27,27,27,27,27,27,27],
            "type": "in"
          },
          {
            "id": 3,
            "name": "OP1",
            "rate": [3328,3328,3328,3328,3328,3328,3328,3328,3328,3328,3328,3328,3328],
            "type": "out"
          }
        ]
      }
      ,
      {
        "id": 9,
        "name": "node_Conv8",
        "function": "CONV(2304)",
        "group": "null",
        "length": 13,
        "port_number": 4,
        "wcet":[1,1,1,1,1,1,1,1,1,1,1,1,1], 
        "ports": [

          {
            "id": 0,
            "name": "IP0",
            "rate": [9984,3328,3328,3328,3328,3328,3328,3328,3328,3328,3328,0,0],
            "type": "in"
          },
          {
            "id": 1,
            "name": "OP0",
            "rate": [0,26,26,26,26,26,26,26,26,26,26,26,26],
            "type": "out"
          },
          {
            "id": 2,
            "name": "IP1",
            "rate": [0,26,26,26,26,26,26,26,26,26,26,26,26],
            "type": "in"
          },
          {
            "id": 3,
            "name": "OP1",
            "rate": [4992,4992,4992,4992,4992,4992,4992,4992,4992,4992,4992,4992,4992],
            "type": "out"
          }
        ]
      }
      ,
      {
        "id": 10,
        "name": "node_Relu9",
        "function": "ReLU(1)",
        "group": "null",
        "length": 13,
        "port_number": 2,
        "wcet":[1,1,1,1,1,1,1,1,1,1,1,1,1], 
        "ports": [

          {
            "id": 0,
            "name": "IP0",
            "rate": [4992,4992,4992,4992,4992,4992,4992,4992,4992,4992,4992,4992,4992],
            "type": "in"
          },
          {
            "id": 1,
            "name": "OP0",
            "rate": [4992,4992,4992,4992,4992,4992,4992,4992,4992,4992,4992,4992,4992],
            "type": "out"
          }
        ]
      }
      ,
      {
        "id": 11,
        "name": "node_Conv10",
        "function": "CONV(3456)",
        "group": "null",
        "length": 13,
        "port_number": 4,
        "wcet":[1,1,1,1,1,1,1,1,1,1,1,1,1], 
        "ports": [

          {
            "id": 0,
            "name": "IP0",
            "rate": [14976,4992,4992,4992,4992,4992,4992,4992,4992,4992,4992,0,0],
            "type": "in"
          },
          {
            "id": 1,
            "name": "OP0",
            "rate": [0,26,26,26,26,26,26,26,26,26,26,26,26],
            "type": "out"
          },
          {
            "id": 2,
            "name": "IP1",
            "rate": [0,26,26,26,26,26,26,26,26,26,26,26,26],
            "type": "in"
          },
          {
            "id": 3,
            "name": "OP1",
            "rate": [4992,4992,4992,4992,4992,4992,4992,4992,4992,4992,4992,4992,4992],
            "type": "out"
          }
        ]
      }
      ,
      {
        "id": 12,
        "name": "node_Relu11",
        "function": "ReLU(1)",
        "group": "null",
        "length": 13,
        "port_number": 2,
        "wcet":[1,1,1,1,1,1,1,1,1,1,1,1,1], 
        "ports": [

          {
            "id": 0,
            "name": "IP0",
            "rate": [4992,4992,4992,4992,4992,4992,4992,4992,4992,4992,4992,4992,4992],
            "type": "in"
          },
          {
            "id": 1,
            "name": "OP0",
            "rate": [4992,4992,4992,4992,4992,4992,4992,4992,4992,4992,4992,4992,4992],
            "type": "out"
          }
        ]
      }
      ,
      {
        "id": 13,
        "name": "node_Conv12",
        "function": "CONV(3456)",
        "group": "null",
        "length": 13,
        "port_number": 4,
        "wcet":[1,1,1,1,1,1,1,1,1,1,1,1,1], 
        "ports": [

          {
            "id": 0,
            "name": "IP0",
            "rate": [14976,4992,4992,4992,4992,4992,4992,4992,4992,4992,4992,0,0],
            "type": "in"
          },
          {
            "id": 1,
            "name": "OP0",
            "rate": [0,26,26,26,26,26,26,26,26,26,26,26,26],
            "type": "out"
          },
          {
            "id": 2,
            "name": "IP1",
            "rate": [0,26,26,26,26,26,26,26,26,26,26,26,26],
            "type": "in"
          },
          {
            "id": 3,
            "name": "OP1",
            "rate": [3328,3328,3328,3328,3328,3328,3328,3328,3328,3328,3328,3328,3328],
            "type": "out"
          }
        ]
      }
      ,
      {
        "id": 14,
        "name": "node_Relu13",
        "function": "ReLU(1)",
        "group": "null",
        "length": 13,
        "port_number": 2,
        "wcet":[1,1,1,1,1,1,1,1,1,1,1,1,1], 
        "ports": [

          {
            "id": 0,
            "name": "IP0",
            "rate": [3328,3328,3328,3328,3328,3328,3328,3328,3328,3328,3328,3328,3328],
            "type": "in"
          },
          {
            "id": 1,
            "name": "OP0",
            "rate": [3328,3328,3328,3328,3328,3328,3328,3328,3328,3328,3328,3328,3328],
            "type": "out"
          }
        ]
      }
      ,
      {
        "id": 15,
        "name": "node_MaxPool14",
        "function": "MAXPOOL(9)",
        "group": "null",
        "length": 6,
        "port_number": 4,
        "wcet":[1,1,1,1,1,1], 
        "ports": [

          {
            "id": 0,
            "name": "IP0",
            "rate": [9984,6656,6656,6656,6656,6656],
            "type": "in"
          },
          {
            "id": 1,
            "name": "OP0",
            "rate": [0,13,13,13,13,13],
            "type": "out"
          },
          {
            "id": 2,
            "name": "IP1",
            "rate": [0,13,13,13,13,13],
            "type": "in"
          },
          {
            "id": 3,
            "name": "OP1",
            "rate": [1792,1792,1792,1792,1792,1792],
            "type": "out"
          }
        ]
      }
      ,
      {
        "id": 16,
        "name": "node_Gemm15",
        "function": "GEMM(10752)",
        "group": "null",
        "length": 1,
        "port_number": 2,
        "wcet":[1], 
        "ports": [

          {
            "id": 0,
            "name": "IP0",
            "rate": [10752],
            "type": "in"
          },
          {
            "id": 1,
            "name": "OP0",
            "rate": [4096],
            "type": "out"
          }
        ]
      }
      ,
      {
        "id": 17,
        "name": "node_Relu16",
        "function": "ReLU(1)",
        "group": "null",
        "length": 1,
        "port_number": 2,
        "wcet":[1], 
        "ports": [

          {
            "id": 0,
            "name": "IP0",
            "rate": [4096],
            "type": "in"
          },
          {
            "id": 1,
            "name": "OP0",
            "rate": [4096],
            "type": "out"
          }
        ]
      }
      ,
      {
        "id": 18,
        "name": "node_Dropout17",
        "function": "DROPOUT(1)",
        "group": "null",
        "length": 1,
        "port_number": 2,
        "wcet":[1], 
        "ports": [

          {
            "id": 0,
            "name": "IP0",
            "rate": [4096],
            "type": "in"
          },
          {
            "id": 1,
            "name": "OP0",
            "rate": [4096],
            "type": "out"
          }
        ]
      }
      ,
      {
        "id": 19,
        "name": "node_Gemm18",
        "function": "GEMM(4096)",
        "group": "null",
        "length": 1,
        "port_number": 2,
        "wcet":[1], 
        "ports": [

          {
            "id": 0,
            "name": "IP0",
            "rate": [4096],
            "type": "in"
          },
          {
            "id": 1,
            "name": "OP0",
            "rate": [4096],
            "type": "out"
          }
        ]
      }
      ,
      {
        "id": 20,
        "name": "node_Relu19",
        "function": "ReLU(1)",
        "group": "null",
        "length": 1,
        "port_number": 2,
        "wcet":[1], 
        "ports": [

          {
            "id": 0,
            "name": "IP0",
            "rate": [4096],
            "type": "in"
          },
          {
            "id": 1,
            "name": "OP0",
            "rate": [4096],
            "type": "out"
          }
        ]
      }
      ,
      {
        "id": 21,
        "name": "node_Dropout20",
        "function": "DROPOUT(1)",
        "group": "null",
        "length": 1,
        "port_number": 2,
        "wcet":[1], 
        "ports": [

          {
            "id": 0,
            "name": "IP0",
            "rate": [4096],
            "type": "in"
          },
          {
            "id": 1,
            "name": "OP0",
            "rate": [4096],
            "type": "out"
          }
        ]
      }
      ,
      {
        "id": 22,
        "name": "node_Gemm21",
        "function": "GEMM(4096)",
        "group": "null",
        "length": 1,
        "port_number": 2,
        "wcet":[1], 
        "ports": [

          {
            "id": 0,
            "name": "IP0",
            "rate": [4096],
            "type": "in"
          },
          {
            "id": 1,
            "name": "OP0",
            "rate": [1000],
            "type": "out"
          }
        ]
      }
      ,
      {
        "id": 23,
        "name": "node_Softmax22",
        "function": "SOFTMAX(1)",
        "group": "null",
        "length": 1,
        "port_number": 2,
        "wcet":[1], 
        "ports": [

          {
            "id": 0,
            "name": "IP0",
            "rate": [1000],
            "type": "in"
          },
          {
            "id": 1,
            "name": "OP0",
            "rate": [1000],
            "type": "out"
          }
        ]
      }
      ,
      {
        "id": 24,
        "name": "prob_1",
        "function": "WRITE",
        "group": "null",
        "length": 1,
        "port_number": 1,
        "wcet":[1], 
        "ports": [

          {
            "id": 0,
            "name": "IP0",
            "rate": [1000],
            "type": "in"
          }
        ]
      }

    ],
    "edges": [
      {
        "id": 0,
        "name": "data_0tonode_Conv0",
        "src": [0,0],
        "dst": [1,0]
      }
      ,
      {
        "id": 1,
        "name": "node_Conv0tonode_Conv0_1",
        "src": [1,1],
        "dst": [1,2]
      }
      ,
      {
        "id": 2,
        "name": "node_Conv0tonode_Relu1",
        "src": [1,3],
        "dst": [2,0]
      }
      ,
      {
        "id": 3,
        "name": "node_Relu1tonode_LRN2",
        "src": [2,1],
        "dst": [3,0]
      }
      ,
      {
        "id": 4,
        "name": "node_LRN2tonode_MaxPool3",
        "src": [3,1],
        "dst": [4,0]
      }
      ,
      {
        "id": 5,
        "name": "node_MaxPool3tonode_MaxPool3_5",
        "src": [4,1],
        "dst": [4,2]
      }
      ,
      {
        "id": 6,
        "name": "node_MaxPool3tonode_Conv4",
        "src": [4,3],
        "dst": [5,0]
      }
      ,
      {
        "id": 7,
        "name": "node_Conv4tonode_Conv4_7",
        "src": [5,1],
        "dst": [5,2]
      }
      ,
      {
        "id": 8,
        "name": "node_Conv4tonode_Relu5",
        "src": [5,3],
        "dst": [6,0]
      }
      ,
      {
        "id": 9,
        "name": "node_Relu5tonode_LRN6",
        "src": [6,1],
        "dst": [7,0]
      }
      ,
      {
        "id": 10,
        "name": "node_LRN6tonode_MaxPool7",
        "src": [7,1],
        "dst": [8,0]
      }
      ,
      {
        "id": 11,
        "name": "node_MaxPool7tonode_MaxPool7_11",
        "src": [8,1],
        "dst": [8,2]
      }
      ,
      {
        "id": 12,
        "name": "node_MaxPool7tonode_Conv8",
        "src": [8,3],
        "dst": [9,0]
      }
      ,
      {
        "id": 13,
        "name": "node_Conv8tonode_Conv8_13",
        "src": [9,1],
        "dst": [9,2]
      }
      ,
      {
        "id": 14,
        "name": "node_Conv8tonode_Relu9",
        "src": [9,3],
        "dst": [10,0]
      }
      ,
      {
        "id": 15,
        "name": "node_Relu9tonode_Conv10",
        "src": [10,1],
        "dst": [11,0]
      }
      ,
      {
        "id": 16,
        "name": "node_Conv10tonode_Conv10_16",
        "src": [11,1],
        "dst": [11,2]
      }
      ,
      {
        "id": 17,
        "name": "node_Conv10tonode_Relu11",
        "src": [11,3],
        "dst": [12,0]
      }
      ,
      {
        "id": 18,
        "name": "node_Relu11tonode_Conv12",
        "src": [12,1],
        "dst": [13,0]
      }
      ,
      {
        "id": 19,
        "name": "node_Conv12tonode_Conv12_19",
        "src": [13,1],
        "dst": [13,2]
      }
      ,
      {
        "id": 20,
        "name": "node_Conv12tonode_Relu13",
        "src": [13,3],
        "dst": [14,0]
      }
      ,
      {
        "id": 21,
        "name": "node_Relu13tonode_MaxPool14",
        "src": [14,1],
        "dst": [15,0]
      }
      ,
      {
        "id": 22,
        "name": "node_MaxPool14tonode_MaxPool14_22",
        "src": [15,1],
        "dst": [15,2]
      }
      ,
      {
        "id": 23,
        "name": "node_MaxPool14tonode_Gemm15",
        "src": [15,3],
        "dst": [16,0]
      }
      ,
      {
        "id": 24,
        "name": "node_Gemm15tonode_Relu16",
        "src": [16,1],
        "dst": [17,0]
      }
      ,
      {
        "id": 25,
        "name": "node_Relu16tonode_Dropout17",
        "src": [17,1],
        "dst": [18,0]
      }
      ,
      {
        "id": 26,
        "name": "node_Dropout17tonode_Gemm18",
        "src": [18,1],
        "dst": [19,0]
      }
      ,
      {
        "id": 27,
        "name": "node_Gemm18tonode_Relu19",
        "src": [19,1],
        "dst": [20,0]
      }
      ,
      {
        "id": 28,
        "name": "node_Relu19tonode_Dropout20",
        "src": [20,1],
        "dst": [21,0]
      }
      ,
      {
        "id": 29,
        "name": "node_Dropout20tonode_Gemm21",
        "src": [21,1],
        "dst": [22,0]
      }
      ,
      {
        "id": 30,
        "name": "node_Gemm21tonode_Softmax22",
        "src": [22,1],
        "dst": [23,0]
      }
      ,
      {
        "id": 31,
        "name": "node_Softmax22toprob_1",
        "src": [23,1],
        "dst": [24,0]
      }

    ]
}
