{
  "type": "csdf",
  "name": "todorsNet_LB",
  "node_number": 7,
  "edge_number": 10,
    "nodes": [
      {
        "id": 0,
        "name": "input",
        "function": "READ",
        "length": 32,
        "port_number": 2,
        "wcet":[1, 1, 1, 1, 1, 1, 1, 1, 1, 1, 1, 1, 1, 1, 1, 1, 1, 1, 1, 1, 1, 1, 1, 1, 1, 1, 1, 1, 1, 1, 1, 1], 
        "ports": [

          {
            "id": 0,
            "name": "OP0",
            "rate": [32,32,32,32,32,32,32,32,32,32,32,32,32,32,32,32,32,32,32,32,32,32,32,32,32,32,32,32,32,32,32,32],
            "type": "out"
          },
          {
            "id": 1,
            "name": "OP1",
            "rate": [32,32,32,32,32,32,32,32,32,32,32,32,32,32,32,32,32,32,32,32,32,32,32,32,32,32,32,32,32,32,32,32],
            "type": "out"
          }
        ]
      }
      ,
      {
        "id": 1,
        "name": "C1",
        "function": "CONV(17_17)",
        "length": 16,
        "port_number": 4,
        "wcet":[27744, 27744, 27744, 27744, 27744, 27744, 27744, 27744, 27744, 27744, 27744, 27744, 27744, 27744, 27744, 27744], 
        "ports": [

          {
            "id": 0,
            "name": "IP0",
            "rate": [544,32,32,32,32,32,32,32,32,32,32,32,32,32,32,32],
            "type": "in"
          },
          {
            "id": 1,
            "name": "OP0",
            "rate": [512,512,512,512,512,512,512,512,512,512,512,512,512,512,512,0],
            "type": "out"
          },
          {
            "id": 2,
            "name": "IP1",
            "rate": [0,512,512,512,512,512,512,512,512,512,512,512,512,512,512,512],
            "type": "in"
          },
          {
            "id": 3,
            "name": "OP1",
            "rate": [32,32,32,32,32,32,32,32,32,32,32,32,32,32,32,32],
            "type": "out"
          }
        ]
      }
      ,
      {
        "id": 2,
        "name": "C1_split_0_0",
        "function": "CONV(17_17)",
        "length": 16,
        "port_number": 4,
        "wcet":[27744, 27744, 27744, 27744, 27744, 27744, 27744, 27744, 27744, 27744, 27744, 27744, 27744, 27744, 27744, 27744], 
        "ports": [

          {
            "id": 0,
            "name": "IP0",
            "rate": [544,32,32,32,32,32,32,32,32,32,32,32,32,32,32,32],
            "type": "in"
          },
          {
            "id": 1,
            "name": "OP0",
            "rate": [512,512,512,512,512,512,512,512,512,512,512,512,512,512,512,0],
            "type": "out"
          },
          {
            "id": 2,
            "name": "IP1",
            "rate": [0,512,512,512,512,512,512,512,512,512,512,512,512,512,512,512],
            "type": "in"
          },
          {
            "id": 3,
            "name": "OP1",
            "rate": [32,32,32,32,32,32,32,32,32,32,32,32,32,32,32,32],
            "type": "out"
          }
        ]
      }
      ,
      {
        "id": 3,
        "name": "C1_output_concat_0",
        "function": "CONCAT",
        "length": 16,
        "port_number": 3,
        "wcet":[4], 
        "ports": [

          {
            "id": 0,
            "name": "IP0",
            "rate": [32,32,32,32,32,32,32,32,32,32,32,32,32,32,32,32],
            "type": "in"
          },
          {
            "id": 1,
            "name": "IP1",
            "rate": [32,32,32,32,32,32,32,32,32,32,32,32,32,32,32,32],
            "type": "in"
          },
          {
            "id": 2,
            "name": "OP0",
            "rate": [0,0,0,0,0,0,0,0,0,0,0,0,0,0,0,1024],
            "type": "out"
          }
        ]
      }
      ,
      {
        "id": 4,
        "name": "C2",
        "function": "CONV(5_5_4)",
        "length": 5,
        "port_number": 4,
        "wcet":[3600, 3600, 3600, 3600], 
        "ports": [

          {
            "id": 0,
            "name": "IP0",
            "rate": [320,192,192,192,128],
            "type": "in"
          },
          {
            "id": 1,
            "name": "OP0",
            "rate": [128,128,128,128,0],
            "type": "out"
          },
          {
            "id": 2,
            "name": "IP1",
            "rate": [0,128,128,128,128],
            "type": "in"
          },
          {
            "id": 3,
            "name": "OP1",
            "rate": [0,12,12,12,12],
            "type": "out"
          }
        ]
      }
      ,
      {
        "id": 5,
        "name": "SM",
        "function": "DENSEBLOCK_SOFTMAX(1_48,48_2)",
        "length": 1,
        "port_number": 2,
        "wcet":[288], 
        "ports": [

          {
            "id": 0,
            "name": "IP0",
            "rate": [48],
            "type": "in"
          },
          {
            "id": 1,
            "name": "OP0",
            "rate": [2],
            "type": "out"
          }
        ]
      }
      ,
      {
        "id": 6,
        "name": "output",
        "function": "WRITE",
        "length": 1,
        "port_number": 1,
        "wcet":[1], 
        "ports": [

          {
            "id": 0,
            "name": "IP0",
            "rate": [2],
            "type": "in"
          }
        ]
      }

    ],
    "edges": [
      {
        "id": 0,
        "name": "0to1",
        "src": [0,0],
        "dst": [1,0]      }
      ,
      {
        "id": 1,
        "name": "1to1_1",
        "src": [1,1],
        "dst": [1,2],
        "initial_tokens": 512
      }
      ,
      {
        "id": 2,
        "name": "0to5",
        "src": [0,1],
        "dst": [2,0]      }
      ,
      {
        "id": 3,
        "name": "5to5_3",
        "src": [2,1],
        "dst": [2,2],
        "initial_tokens": 512
      }
      ,
      {
        "id": 4,
        "name": "1to6",
        "src": [1,3],
        "dst": [3,0]      }
      ,
      {
        "id": 5,
        "name": "5to6",
        "src": [2,3],
        "dst": [3,1]      }
      ,
      {
        "id": 6,
        "name": "6to2",
        "src": [3,2],
        "dst": [4,0]      }
      ,
      {
        "id": 7,
        "name": "2to2_7",
        "src": [4,1],
        "dst": [4,2],
        "initial_tokens": 128
      }
      ,
      {
        "id": 8,
        "name": "2to3",
        "src": [4,3],
        "dst": [5,0]      }
      ,
      {
        "id": 9,
        "name": "3to4",
        "src": [5,1],
        "dst": [6,0]      }

    ]
}
