{
	"name": "Filter annotations",
	"version": 1,
	"description": "Filter out the object smaller than the filter size specified",
	"module": "plugins.installed.filter_annotations.filter_annotations",
	"class": "FilterAnnotations",
	"type": "transform",
	"transforms": ["sample_transforms", "batch_transforms"],
	"author": {
		"name": "Gianfranco Deriu",
		"email": "gianfranco.deriu@unica.it",
		"url": "https://author.website"
	},
	"license": "MIT",
	"homepage": "https://gitlab.com/aloha.eu/plugins",
	"parameters": [{
			"name": "minSize",
			"dtype": "int",
			"default": 10
		}]
}
