{
	"name": "Detection Random Scale Annotations",
	"version": 0,
	"description": "Scale the bounding boxes of a sample image",
	"module": "plugins.installed.detection_random_scale_annotations.detection_random_scale_annotations",
	"class": "DetectionRandomScaleAnnotations",
	"type": "transform",
	"transforms": ["sample_transforms", "batch_transforms"],
	"author": {
		"name": "Gianfranco Deriu",
		"email": "gianfranco.deriu@unica.it",
		"url": "https://author.website"
	},
	"license": "MIT",
	"homepage": "https://gitlab.com/aloha.eu/plugins",
	"parameters": [
		{
			"name": "width",
			"dtype": "int",
			"default": 416
		},
		
		{
			"name": "height",
			"dtype": "int",
			"default": 416
		},
		{
			"name": "probability",
			"dtype": "float",
			"default": 0.5,
			"range": [0, 1, 0.01]
		},
		{
			"name": "max_scale_perc",
			"dtype": "float",
			"default": 0.5,
			"range": [0, 1, 0.01]
		},
		{
			"name": "sync_code",
			"dtype": "float",
			"default": 0.0
		}
	]
}
