{
	"name": "Random Image scale",
	"version": 1,
	"description": "Scale the image of a random percentage",
	"module": "plugins.installed.random_image_scale.random_image_scale",
	"class": "RandomImageScale",
	"type": "transform",
	"transforms": ["batch_transforms"],
	"author": {
		"name": "Gianfranco Deriu",
		"email": "gianfranco.deriu@unica.it",
		"url": "https://author.website"
	},
	"license": "MIT",
	"homepage": "https://gitlab.com/aloha.eu/plugins",
	"parameters": [{
			"name": "pad_value",
			"dtype": "int",
			"default": 128
		},
		{
			"name": "probability",
			"dtype": "float",
			"default": 0.5,
			"range": [0, 1, 0.01]
		},
		{
			"name": "max_scale_perc",
			"dtype": "float",
			"default": 0.5,
			"range": [0, 1, 0.01]
		},
		{
			"name": "sync_code",
			"dtype": "float",
			"default": 0.0
		}
	]
}
