{
	"name": "Random horizVert shift",
	"version": 0,
	"description": "Apply a random horizontal and vertical shift to an image.",
	"module": "plugins.installed.random_horiz_vert_shift.random_horiz_vert_shift",
	"class": "RandomHorizVertShift",
	"type": "transform",
	"transforms": ["sample_transforms", "batch_transforms"],
	"author": {
		"name": "Gianfranco Deriu",
		"email": "gianfranco.deriu@unica.it",
		"url": "https://author.website"
	},
	"license": "MIT",
	"homepage": "https://gitlab.com/aloha.eu/plugins",
	"parameters": [
	{
			"name": "pad_value",
			"dtype": "int",
			"default": 128
		},
		{
			"name": "maxShift",
			"dtype": "float",
			"default": 0.2
		},
		{
			"name": "horizontal",
			"dtype": "boolean",
			"default": true
		},
		{
			"name": "vertical",
			"dtype": "boolean",
			"default": false
		},
		{
			"name": "maxShift",
			"dtype": "float",
			"default": 0.2
		},
	{
			"name": "probability",
			"dtype": "float",
			"default": 0.5,
			"range": [0, 1, 0.01]
		},
		{
			"name": "sync_code",
			"dtype": "int",
			"default": 0
		}
	]
}
