{
	"name": "Pad to square",
	"version": 1,
	"description": "Takes a rectangular image and inscribe it into a square of side equal to the long side of the image. The square is filled with pixel of value pad_value.",
	"module": "plugins.installed.pad_to_square.pad_to_square",
	"class": "PadToSquare",
	"type": "transform",
	"transforms": ["sample_transforms", "batch_transforms"],
	"author": {
		"name": "Gianfranco Deriu",
		"email": "gianfranco.deriu@unica.it",
		"url": "https://author.website"
	},
	"license": "MIT",
	"homepage": "https://gitlab.com/aloha.eu/plugins",
	"parameters": [{
			"name": "pad_value",
			"dtype": "int",
			"default": 128
		}
	]
}
