{
	"name": "Load audio from wav",
	"version": 123,
	"description": "Load audio signal from a wav file",
	"module": "plugins.installed.load_audio_from_wav.load_audio_from_wav",
	"class": "LoadAudioFromWav",
	"type": "transform",
	"transforms": ["sample_transforms", "batch_transforms"],
	"author": {
		"name": "Luca Rinelli",
		"email": "l.rinelli@reply.it",
		"url": "https://author.website"
	},
	"license": "MIT",
	"homepage": "https://gitlab.com/aloha.eu/plugins",
	"parameters": [{
			"name": "mono",
			"dtype": "bool",
			"default": true
		},
		{
			"name": "signal_rate",
			"dtype": "int",
			"default": 16000,
			"range": [100, 24000, 100]
		}
	]
}
