{
	"name": "Expand dimensions",
	"version": 0,
	"description": "Expands the dimensions of a tensor",
	"module": "plugins.installed.expand_dims.expand_dims",
	"class": "ExpandDims",
	"type": "transform",
	"transforms": ["sample_transforms", "batch_transforms"],
	"author": {
		"name": "Gianfranco Deriu",
		"email": "gianfranco.deriu@unica.it",
		"url": "https://author.website"
	},
	"license": "MIT",
	"homepage": "https://gitlab.com/aloha.eu/plugins",
	"parameters": [{
			"name": "dims",
			"dtype": "int",
			"default": 3,
			"range": [1, 5, 1]
		}
	]
}
