{
	"name": "Scale by factor",
	"version": 0,
	"description": "Scales the input by a custom factor",
	"module": "plugins.installed.scale_by_factor.scale_by_factor",
	"class": "ScaleByFactor",
	"type": "transform",
	"transforms": ["sample_transforms", "batch_transforms"],
	"author": {
		"name": "Gianfranco Deriu",
		"email": "gianfranco.deriu@unica.it",
		"url": "https://author.website"
	},
	"license": "MIT",
	"homepage": "https://gitlab.com/aloha.eu/plugins",
	"parameters": [
		{
			"name": "factor",
			"dtype": "float",
			"default": 1.0
		}
	]
}
