{
	"name": "To tensor",
	"version": 123,
	"description": "Convert array to tensor",
	"module": "torchvision.transforms",
	"class": "ToTensor",
	"type": "transform",
	"transforms": ["sample_transforms", "batch_transforms"],
	"author": {
		"name": "Luca Rinelli",
		"email": "l.rinelli@reply.it",
		"url": "https://author.website"
	},
	"license": "MIT",
	"homepage": "https://gitlab.com/aloha.eu/plugins",
	"parameters": [
	]
}
