{
	"name": "Audio to MFCC",
	"version": 123,
	"description": "This is the description of what the plugin does",
	"module": "plugins.installed.audio_to_mfcc.audio_to_mfcc",
	"class": "AudioToMFCC",
	"type": "transform",
	"transforms": ["sample_transforms", "batch_transforms"],
	"author": {
		"name": "Luca Rinelli",
		"email": "l.rinelli@reply.it",
		"url": "https://author.website"
	},
	"license": "MIT",
	"homepage": "https://gitlab.com/aloha.eu/plugins",
	"parameters": [{
			"name": "signal_rate",
			"dtype": "uint",
			"default": 16000
		},
		{
			"name": "num_frames",
			"dtype": "uint",
			"default": 32
        },
        {
			"name": "n_mfcc",
			"dtype": "uint",
			"default": 16
		},
		{
			"name": "frame_overlap_ratio",
			"dtype": "float",
			"default": 0.5,
			"range": [0.0, 1.0, 0.01]
		},
		{
			"name": "n_fft",
			"dtype": "int",
			"default": null
		},
		{
			"name": "power",
			"dtype": "float",
			"default": 2
		},
		{
			"name": "htk",
			"dtype": "boolean",
			"default": false
		},
		{
			"name": "norm",
			"dtype": "int",
			"default": 1
		}
	]
}
