{
	"name": "Name of the plugin",
	"version": 123,
	"description": "This is the description of what the plugin does",
	"main": "route/to/access/file/__init__.py",
	"class": "LoadAudioFromWav",
	"type": "transform",
	"transforms": ["sample_transforms", "dataset_transforms", "batch_transforms"],
	"author": {
		"name": "Author name",
		"email": "author@email.com",
		"url": "https://author.website"
	},
	"license": "MIT",
	"homepage": "https://repository",
	"parameters": [{
			"name": "mono",
			"dtype": "bool",
			"default": true
		},
		{
			"name": "signal_rate",
			"dtype": "int",
			"default": 1600,
			"range": [400, 2400, 100]
		},
		{
			"name": "accuracy",
			"dtype": "float",
			"default": 1.0,
			"range": [0.0, 1.0, 0.01]
		},
		{
			"name": "string_type",
			"dtype": "str",
			"default": ""
		}
	]
}
