{
	"name": "Torch from numpy",
	"version": 0,
	"description": "Converts a numpy array to a torch tensor. It is an alternative to ToTensor transform. It doesn't perform any scaling and works with arrays of any shape.",
	"module": "plugins.installed.torch_from_numpy.torch_from_numpy",
	"class": "TorchFromNumpy",
	"type": "transform",
	"transforms": ["sample_transforms", "batch_transforms"],
	"author": {
		"name": "Gianfranco Deriu",
		"email": "gianfranco.deriu@unica.it",
		"url": "https://author.website"
	},
	"license": "MIT",
	"homepage": "https://gitlab.com/aloha.eu/plugins",
	"parameters": [
	]
}
