{
	"name": "Cut or pad to length",
	"version": 123,
	"description": "Cut or pad a numpy array to a given lenght",
	"module": "plugins.installed.cut_or_pad_to_length.cut_or_pad_to_length",
	"class": "CutOrPadToLength",
	"type": "transform",
	"transforms": ["sample_transforms", "batch_transforms"],
	"author": {
		"name": "Luca Rinelli",
		"email": "l.rinelli@reply.it",
		"url": "https://author.website"
	},
	"license": "MIT",
	"homepage": "https://gitlab.com/aloha.eu/plugins",
	"parameters": [{
			"name": "target_length",
			"dtype": "int",
			"default": 16000,
			"range": [1, 1000000, 1]
		}
	]
}
