[{"op": "pool", "ih": 4, "iw": 4, "ch": 48, "kh": 2, "kw": 2,"oh":2, "ow": 2, "ofm": 48, , "hpad": 0, "wpad": 0, "time": 0.012672}
,
{"op": "pool", "ih": 4, "iw": 4, "ch": 64, "kh": 2, "kw": 2,"oh":2, "ow": 2, "ofm": 64, , "hpad": 0, "wpad": 0, "time": 0.068}
,
{"op": "pool", "ih": 4, "iw": 4, "ch": 96, "kh": 2, "kw": 2,"oh":2, "ow": 2, "ofm": 96, , "hpad": 0, "wpad": 0, "time": 0.05664}
,
{"op": "pool", "ih": 4, "iw": 4, "ch": 128, "kh": 2, "kw": 2,"oh":2, "ow": 2, "ofm": 128, , "hpad": 0, "wpad": 0, "time": 0.062976}
,
{"op": "pool", "ih": 4, "iw": 4, "ch": 192, "kh": 2, "kw": 2,"oh":2, "ow": 2, "ofm": 192, , "hpad": 0, "wpad": 0, "time": 0.17408}
,
{"op": "pool", "ih": 4, "iw": 4, "ch": 256, "kh": 2, "kw": 2,"oh":2, "ow": 2, "ofm": 256, , "hpad": 0, "wpad": 0, "time": 0.06768}
,
{"op": "pool", "ih": 4, "iw": 4, "ch": 384, "kh": 2, "kw": 2,"oh":2, "ow": 2, "ofm": 384, , "hpad": 0, "wpad": 0, "time": 0.0648}
,
{"op": "pool", "ih": 4, "iw": 4, "ch": 512, "kh": 2, "kw": 2,"oh":2, "ow": 2, "ofm": 512, , "hpad": 0, "wpad": 0, "time": 0.068704}
,
{"op": "pool", "ih": 8, "iw": 8, "ch": 48, "kh": 2, "kw": 2,"oh":4, "ow": 4, "ofm": 48, , "hpad": 0, "wpad": 0, "time": 0.05952}
,
{"op": "pool", "ih": 8, "iw": 8, "ch": 64, "kh": 2, "kw": 2,"oh":4, "ow": 4, "ofm": 64, , "hpad": 0, "wpad": 0, "time": 0.06912}
,
{"op": "pool", "ih": 8, "iw": 8, "ch": 96, "kh": 2, "kw": 2,"oh":4, "ow": 4, "ofm": 96, , "hpad": 0, "wpad": 0, "time": 0.0656}
,
{"op": "pool", "ih": 8, "iw": 8, "ch": 128, "kh": 2, "kw": 2,"oh":4, "ow": 4, "ofm": 128, , "hpad": 0, "wpad": 0, "time": 0.0688}
,
{"op": "pool", "ih": 8, "iw": 8, "ch": 192, "kh": 2, "kw": 2,"oh":4, "ow": 4, "ofm": 192, , "hpad": 0, "wpad": 0, "time": 0.06928}
,
{"op": "pool", "ih": 8, "iw": 8, "ch": 256, "kh": 2, "kw": 2,"oh":4, "ow": 4, "ofm": 256, , "hpad": 0, "wpad": 0, "time": 0.06544}
,
{"op": "pool", "ih": 8, "iw": 8, "ch": 384, "kh": 2, "kw": 2,"oh":4, "ow": 4, "ofm": 384, , "hpad": 0, "wpad": 0, "time": 0.175072}
,
{"op": "pool", "ih": 8, "iw": 8, "ch": 512, "kh": 2, "kw": 2,"oh":4, "ow": 4, "ofm": 512, , "hpad": 0, "wpad": 0, "time": 0.0704}
,
{"op": "pool", "ih": 16, "iw": 16, "ch": 48, "kh": 2, "kw": 2,"oh":8, "ow": 8, "ofm": 48, , "hpad": 0, "wpad": 0, "time": 0.064928}
,
{"op": "pool", "ih": 16, "iw": 16, "ch": 64, "kh": 2, "kw": 2,"oh":8, "ow": 8, "ofm": 64, , "hpad": 0, "wpad": 0, "time": 0.075552}
,
{"op": "pool", "ih": 16, "iw": 16, "ch": 96, "kh": 2, "kw": 2,"oh":8, "ow": 8, "ofm": 96, , "hpad": 0, "wpad": 0, "time": 0.06624}
,
{"op": "pool", "ih": 16, "iw": 16, "ch": 128, "kh": 2, "kw": 2,"oh":8, "ow": 8, "ofm": 128, , "hpad": 0, "wpad": 0, "time": 0.064832}
,
{"op": "pool", "ih": 16, "iw": 16, "ch": 192, "kh": 2, "kw": 2,"oh":8, "ow": 8, "ofm": 192, , "hpad": 0, "wpad": 0, "time": 0.07056}
,
{"op": "pool", "ih": 16, "iw": 16, "ch": 256, "kh": 2, "kw": 2,"oh":8, "ow": 8, "ofm": 256, , "hpad": 0, "wpad": 0, "time": 0.179712}
,
{"op": "pool", "ih": 16, "iw": 16, "ch": 384, "kh": 2, "kw": 2,"oh":8, "ow": 8, "ofm": 384, , "hpad": 0, "wpad": 0, "time": 0.07824}
,
{"op": "pool", "ih": 16, "iw": 16, "ch": 512, "kh": 2, "kw": 2,"oh":8, "ow": 8, "ofm": 512, , "hpad": 0, "wpad": 0, "time": 0.086272}
,
{"op": "pool", "ih": 32, "iw": 32, "ch": 48, "kh": 2, "kw": 2,"oh":16, "ow": 16, "ofm": 48, , "hpad": 0, "wpad": 0, "time": 0.057248}
,
{"op": "pool", "ih": 32, "iw": 32, "ch": 64, "kh": 2, "kw": 2,"oh":16, "ow": 16, "ofm": 64, , "hpad": 0, "wpad": 0, "time": 0.176}
,
{"op": "pool", "ih": 32, "iw": 32, "ch": 96, "kh": 2, "kw": 2,"oh":16, "ow": 16, "ofm": 96, , "hpad": 0, "wpad": 0, "time": 0.06464}
,
{"op": "pool", "ih": 32, "iw": 32, "ch": 128, "kh": 2, "kw": 2,"oh":16, "ow": 16, "ofm": 128, , "hpad": 0, "wpad": 0, "time": 0.03184}
,
{"op": "pool", "ih": 32, "iw": 32, "ch": 192, "kh": 2, "kw": 2,"oh":16, "ow": 16, "ofm": 192, , "hpad": 0, "wpad": 0, "time": 0.0792}
,
{"op": "pool", "ih": 32, "iw": 32, "ch": 256, "kh": 2, "kw": 2,"oh":16, "ow": 16, "ofm": 256, , "hpad": 0, "wpad": 0, "time": 0.12336}
,
{"op": "pool", "ih": 32, "iw": 32, "ch": 384, "kh": 2, "kw": 2,"oh":16, "ow": 16, "ofm": 384, , "hpad": 0, "wpad": 0, "time": 0.107072}
,
{"op": "pool", "ih": 32, "iw": 32, "ch": 512, "kh": 2, "kw": 2,"oh":16, "ow": 16, "ofm": 512, , "hpad": 0, "wpad": 0, "time": 0.12384}
]
