[{"op": "conv", "kh": 3, "stride": 1, "ch": 3, "ofm": 48, "iw": 32, "oh": 32, "wpad": 1, "hpad": 1, "time": 0.765905},
{"op": "conv", "kh": 3, "stride": 1, "ch": 48, "ofm": 64, "iw": 32, "oh": 32, "wpad": 1, "hpad": 1, "time": 2.88968},
{"op": "conv", "kh": 3, "stride": 1, "ch": 64, "ofm": 64, "iw": 32, "oh": 32, "wpad": 1, "hpad": 1, "time": 3.52983},
{"op": "conv", "kh": 3, "stride": 1, "ch": 64, "ofm": 48, "iw": 32, "oh": 32, "wpad": 1, "hpad": 1, "time": 2.85742},
{"op": "conv", "kh": 3, "stride": 1, "ch": 48, "ofm": 48, "iw": 32, "oh": 32, "wpad": 1, "hpad": 1, "time": 2.21703},
{"op": "conv", "kh": 3, "stride": 1, "ch": 48, "ofm": 3, "iw": 32, "oh": 32, "wpad": 1, "hpad": 1, "time": 1.14551},
{"op": "conv", "kh": 3, "stride": 1, "ch": 3, "ofm": 64, "iw": 32, "oh": 32, "wpad": 1, "hpad": 1, "time": 0.800772},
{"op": "conv", "kh": 3, "stride": 1, "ch": 64, "ofm": 96, "iw": 16, "oh": 16, "wpad": 1, "hpad": 1, "time": 1.15432},
{"op": "conv", "kh": 3, "stride": 1, "ch": 96, "ofm": 96, "iw": 16, "oh": 16, "wpad": 1, "hpad": 1, "time": 1.58947},
{"op": "conv", "kh": 3, "stride": 1, "ch": 96, "ofm": 128, "iw": 16, "oh": 16, "wpad": 1, "hpad": 1, "time": 2.07497},
{"op": "conv", "kh": 3, "stride": 1, "ch": 128, "ofm": 128, "iw": 16, "oh": 16, "wpad": 1, "hpad": 1, "time": 2.49847},
{"op": "conv", "kh": 3, "stride": 1, "ch": 128, "ofm": 96, "iw": 16, "oh": 16, "wpad": 1, "hpad": 1, "time": 2.02453},
{"op": "conv", "kh": 3, "stride": 1, "ch": 96, "ofm": 48, "iw": 16, "oh": 16, "wpad": 1, "hpad": 1, "time": 0.883128},
{"op": "conv", "kh": 3, "stride": 1, "ch": 48, "ofm": 128, "iw": 16, "oh": 16, "wpad": 1, "hpad": 1, "time": 1.24542},
{"op": "conv", "kh": 3, "stride": 1, "ch": 128, "ofm": 64, "iw": 16, "oh": 16, "wpad": 1, "hpad": 1, "time": 1.48218},
{"op": "conv", "kh": 3, "stride": 1, "ch": 64, "ofm": 96, "iw": 16, "oh": 16, "wpad": 1, "hpad": 1, "time": 1.1587},
{"op": "conv", "kh": 3, "stride": 1, "ch": 96, "ofm": 64, "iw": 16, "oh": 16, "wpad": 1, "hpad": 1, "time": 1.14779},
{"op": "conv", "kh": 3, "stride": 1, "ch": 64, "ofm": 128, "iw": 16, "oh": 16, "wpad": 1, "hpad": 1, "time": 1.54657},
{"op": "conv", "kh": 3, "stride": 1, "ch": 128, "ofm": 192, "iw": 8, "oh": 8, "wpad": 1, "hpad": 1, "time": 1.06729},
{"op": "conv", "kh": 3, "stride": 1, "ch": 192, "ofm": 256, "iw": 8, "oh": 8, "wpad": 1, "hpad": 1, "time": 1.94582},
{"op": "conv", "kh": 3, "stride": 1, "ch": 256, "ofm": 256, "iw": 8, "oh": 8, "wpad": 1, "hpad": 1, "time": 2.3175},
{"op": "conv", "kh": 3, "stride": 1, "ch": 256, "ofm": 192, "iw": 8, "oh": 8, "wpad": 1, "hpad": 1, "time": 1.78629},
{"op": "conv", "kh": 3, "stride": 1, "ch": 192, "ofm": 192, "iw": 8, "oh": 8, "wpad": 1, "hpad": 1, "time": 1.37875},
{"op": "conv", "kh": 3, "stride": 1, "ch": 192, "ofm": 96, "iw": 8, "oh": 8, "wpad": 1, "hpad": 1, "time": 0.873112},
{"op": "conv", "kh": 3, "stride": 1, "ch": 96, "ofm": 256, "iw": 8, "oh": 8, "wpad": 1, "hpad": 1, "time": 1.12665},
{"op": "conv", "kh": 3, "stride": 1, "ch": 256, "ofm": 128, "iw": 8, "oh": 8, "wpad": 1, "hpad": 1, "time": 1.33528},
{"op": "conv", "kh": 3, "stride": 1, "ch": 128, "ofm": 256, "iw": 8, "oh": 8, "wpad": 1, "hpad": 1, "time": 1.40264},
{"op": "conv", "kh": 3, "stride": 1, "ch": 256, "ofm": 128, "iw": 8, "oh": 8, "wpad": 1, "hpad": 1, "time": 1.35056},
{"op": "conv", "kh": 3, "stride": 1, "ch": 128, "ofm": 192, "iw": 8, "oh": 8, "wpad": 1, "hpad": 1, "time": 1.11962},
{"op": "conv", "kh": 3, "stride": 1, "ch": 192, "ofm": 384, "iw": 4, "oh": 4, "wpad": 1, "hpad": 1, "time": 1.28794},
{"op": "conv", "kh": 3, "stride": 1, "ch": 384, "ofm": 384, "iw": 4, "oh": 4, "wpad": 1, "hpad": 1, "time": 2.3727},
{"op": "conv", "kh": 3, "stride": 1, "ch": 384, "ofm": 512, "iw": 4, "oh": 4, "wpad": 1, "hpad": 1, "time": 3.08912},
{"op": "conv", "kh": 3, "stride": 1, "ch": 512, "ofm": 384, "iw": 4, "oh": 4, "wpad": 1, "hpad": 1, "time": 3.10908},
{"op": "conv", "kh": 3, "stride": 1, "ch": 384, "ofm": 192, "iw": 4, "oh": 4, "wpad": 1, "hpad": 1, "time": 1.38732},
{"op": "conv", "kh": 3, "stride": 1, "ch": 192, "ofm": 512, "iw": 4, "oh": 4, "wpad": 1, "hpad": 1, "time": 1.64011},
{"op": "conv", "kh": 3, "stride": 1, "ch": 512, "ofm": 512, "iw": 4, "oh": 4, "wpad": 1, "hpad": 1, "time": 4.00374},
{"op": "conv", "kh": 3, "stride": 1, "ch": 512, "ofm": 256, "iw": 4, "oh": 4, "wpad": 1, "hpad": 1, "time": 2.10749},
{"op": "conv", "kh": 3, "stride": 1, "ch": 256, "ofm": 512, "iw": 4, "oh": 4, "wpad": 1, "hpad": 1, "time": 2.13997},
{"op": "conv", "kh": 3, "stride": 1, "ch": 512, "ofm": 256, "iw": 4, "oh": 4, "wpad": 1, "hpad": 1, "time": 2.09918},
{"op": "conv", "kh": 3, "stride": 1, "ch": 256, "ofm": 384, "iw": 4, "oh": 4, "wpad": 1, "hpad": 1, "time": 1.56567},
{"op": "conv", "kh": 3, "stride": 1, "ch": 384, "ofm": 384, "iw": 2, "oh": 2, "wpad": 1, "hpad": 1, "time": 1.27715},
{"op": "conv", "kh": 3, "stride": 1, "ch": 384, "ofm": 384, "iw": 2, "oh": 2, "wpad": 1, "hpad": 1, "time": 1.28366},
{"op": "conv", "kh": 3, "stride": 1, "ch": 384, "ofm": 512, "iw": 2, "oh": 2, "wpad": 1, "hpad": 1, "time": 1.82312},
{"op": "conv", "kh": 3, "stride": 1, "ch": 512, "ofm": 512, "iw": 2, "oh": 2, "wpad": 1, "hpad": 1, "time": 2.30107}]