[{"op": "conv", "kh": 3, "stride": 1, "ch": 3, "ofm": 48.0, "iw": 32, "oh": 32, "wpad": 1.0, "hpad": 1.0, "time": 0.714875},
{"op": "conv", "kh": 3, "stride": 1, "ch": 48.0, "ofm": 64.0, "iw": 32, "oh": 32, "wpad": 1.0, "hpad": 1.0, "time": 2.8128},
{"op": "conv", "kh": 3, "stride": 1, "ch": 64.0, "ofm": 64.0, "iw": 32, "oh": 32, "wpad": 1.0, "hpad": 1.0, "time": 3.49166},
{"op": "conv", "kh": 3, "stride": 1, "ch": 64.0, "ofm": 48.0, "iw": 32, "oh": 32, "wpad": 1.0, "hpad": 1.0, "time": 2.77719},
{"op": "conv", "kh": 3, "stride": 1, "ch": 48.0, "ofm": 48.0, "iw": 32, "oh": 32, "wpad": 1.0, "hpad": 1.0, "time": 2.18242},
{"op": "conv", "kh": 3, "stride": 1, "ch": 48.0, "ofm": 3, "iw": 32, "oh": 32, "wpad": 1.0, "hpad": 1.0, "time": 1.09913},
{"op": "conv", "kh": 3, "stride": 1, "ch": 3, "ofm": 64.0, "iw": 32, "oh": 32, "wpad": 1.0, "hpad": 1.0, "time": 0.767245},
{"op": "conv", "kh": 3, "stride": 1, "ch": 48.0, "ofm": 96.0, "iw": 16, "oh": 16, "wpad": 1.0, "hpad": 1.0, "time": 2.11505},
{"op": "conv", "kh": 3, "stride": 1, "ch": 96.0, "ofm": 96.0, "iw": 16, "oh": 16, "wpad": 1.0, "hpad": 1.0, "time": 1.15317},
{"op": "conv", "kh": 3, "stride": 1, "ch": 96.0, "ofm": 128.0, "iw": 16, "oh": 16, "wpad": 1.0, "hpad": 1.0, "time": 1.57786},
{"op": "conv", "kh": 3, "stride": 1, "ch": 128.0, "ofm": 128.0, "iw": 16, "oh": 16, "wpad": 1.0, "hpad": 1.0, "time": 2.04962},
{"op": "conv", "kh": 3, "stride": 1, "ch": 128.0, "ofm": 96.0, "iw": 16, "oh": 16, "wpad": 1.0, "hpad": 1.0, "time": 2.53382},
{"op": "conv", "kh": 3, "stride": 1, "ch": 96.0, "ofm": 48.0, "iw": 16, "oh": 16, "wpad": 1.0, "hpad": 1.0, "time": 2.02049},
{"op": "conv", "kh": 3, "stride": 1, "ch": 48.0, "ofm": 128.0, "iw": 16, "oh": 16, "wpad": 1.0, "hpad": 1.0, "time": 0.85919},
{"op": "conv", "kh": 3, "stride": 1, "ch": 128.0, "ofm": 64.0, "iw": 16, "oh": 16, "wpad": 1.0, "hpad": 1.0, "time": 1.23001},
{"op": "conv", "kh": 3, "stride": 1, "ch": 64.0, "ofm": 96.0, "iw": 16, "oh": 16, "wpad": 1.0, "hpad": 1.0, "time": 1.47418},
{"op": "conv", "kh": 3, "stride": 1, "ch": 96.0, "ofm": 64.0, "iw": 16, "oh": 16, "wpad": 1.0, "hpad": 1.0, "time": 1.14668},
{"op": "conv", "kh": 3, "stride": 1, "ch": 64.0, "ofm": 128.0, "iw": 16, "oh": 16, "wpad": 1.0, "hpad": 1.0, "time": 1.10997},
{"op": "conv", "kh": 3, "stride": 1, "ch": 96.0, "ofm": 192.0, "iw": 8, "oh": 8, "wpad": 1.0, "hpad": 1.0, "time": 1.5139},
{"op": "conv", "kh": 3, "stride": 1, "ch": 192.0, "ofm": 256.0, "iw": 8, "oh": 8, "wpad": 1.0, "hpad": 1.0, "time": 1.02459},
{"op": "conv", "kh": 3, "stride": 1, "ch": 256.0, "ofm": 256.0, "iw": 8, "oh": 8, "wpad": 1.0, "hpad": 1.0, "time": 1.02468},
{"op": "conv", "kh": 3, "stride": 1, "ch": 256.0, "ofm": 192.0, "iw": 8, "oh": 8, "wpad": 1.0, "hpad": 1.0, "time": 1.75541},
{"op": "conv", "kh": 3, "stride": 1, "ch": 192.0, "ofm": 192.0, "iw": 8, "oh": 8, "wpad": 1.0, "hpad": 1.0, "time": 2.17112},
{"op": "conv", "kh": 3, "stride": 1, "ch": 192.0, "ofm": 96.0, "iw": 8, "oh": 8, "wpad": 1.0, "hpad": 1.0, "time": 1.68486},
{"op": "conv", "kh": 3, "stride": 1, "ch": 96.0, "ofm": 256.0, "iw": 8, "oh": 8, "wpad": 1.0, "hpad": 1.0, "time": 1.34637},
{"op": "conv", "kh": 3, "stride": 1, "ch": 256.0, "ofm": 128.0, "iw": 8, "oh": 8, "wpad": 1.0, "hpad": 1.0, "time": 0.843148},
{"op": "conv", "kh": 3, "stride": 1, "ch": 128.0, "ofm": 256.0, "iw": 8, "oh": 8, "wpad": 1.0, "hpad": 1.0, "time": 1.08728},
{"op": "conv", "kh": 3, "stride": 1, "ch": 256.0, "ofm": 128.0, "iw": 8, "oh": 8, "wpad": 1.0, "hpad": 1.0, "time": 1.29468},
{"op": "conv", "kh": 3, "stride": 1, "ch": 128.0, "ofm": 192.0, "iw": 8, "oh": 8, "wpad": 1.0, "hpad": 1.0, "time": 1.3455},
{"op": "conv", "kh": 3, "stride": 1, "ch": 192.0, "ofm": 384.0, "iw": 4, "oh": 4, "wpad": 1.0, "hpad": 1.0, "time": 1.28554},
{"op": "conv", "kh": 3, "stride": 1, "ch": 384.0, "ofm": 384.0, "iw": 4, "oh": 4, "wpad": 1.0, "hpad": 1.0, "time": 1.0083},
{"op": "conv", "kh": 3, "stride": 1, "ch": 384.0, "ofm": 512.0, "iw": 4, "oh": 4, "wpad": 1.0, "hpad": 1.0, "time": 0.388054},
{"op": "conv", "kh": 3, "stride": 1, "ch": 512.0, "ofm": 384.0, "iw": 4, "oh": 4, "wpad": 1.0, "hpad": 1.0, "time": 1.17099},
{"op": "conv", "kh": 3, "stride": 1, "ch": 384.0, "ofm": 192.0, "iw": 4, "oh": 4, "wpad": 1.0, "hpad": 1.0, "time": 2.23518},
{"op": "conv", "kh": 3, "stride": 1, "ch": 192.0, "ofm": 512.0, "iw": 4, "oh": 4, "wpad": 1.0, "hpad": 1.0, "time": 3.00341},
{"op": "conv", "kh": 3, "stride": 1, "ch": 512.0, "ofm": 512.0, "iw": 4, "oh": 4, "wpad": 1.0, "hpad": 1.0, "time": 3.13447},
{"op": "conv", "kh": 3, "stride": 1, "ch": 512.0, "ofm": 256.0, "iw": 4, "oh": 4, "wpad": 1.0, "hpad": 1.0, "time": 1.34506},
{"op": "conv", "kh": 3, "stride": 1, "ch": 256.0, "ofm": 512.0, "iw": 4, "oh": 4, "wpad": 1.0, "hpad": 1.0, "time": 1.54632},
{"op": "conv", "kh": 3, "stride": 1, "ch": 512.0, "ofm": 256.0, "iw": 4, "oh": 4, "wpad": 1.0, "hpad": 1.0, "time": 4.06259},
{"op": "conv", "kh": 3, "stride": 1, "ch": 256.0, "ofm": 384.0, "iw": 4, "oh": 4, "wpad": 1.0, "hpad": 1.0, "time": 2.16906},
{"op": "conv", "kh": 3, "stride": 1, "ch": 512.0, "ofm": 384.0, "iw": 2, "oh": 2, "wpad": 1.0, "hpad": 1.0, "time": 1.96308},
{"op": "conv", "kh": 3, "stride": 1, "ch": 384.0, "ofm": 384.0, "iw": 2, "oh": 2, "wpad": 1.0, "hpad": 1.0, "time": 2.13558},
{"op": "conv", "kh": 3, "stride": 1, "ch": 384.0, "ofm": 512.0, "iw": 2, "oh": 2, "wpad": 1.0, "hpad": 1.0, "time": 1.47366},
{"op": "conv", "kh": 3, "stride": 1, "ch": 512.0, "ofm": 512.0, "iw": 2, "oh": 2, "wpad": 1.0, "hpad": 1.0, "time": 0.204835}]