{
    "title" : "Detection_graypad_416",
    "version" : 1,
    "preset" : true,
    "config" : [ 
        {
            "column" : "sample_transforms",
            "plugins" : [ 
                {
                    "name" : "Load image from file",
                    "module" : "plugins.installed.load_image_from_file.load_image_from_file",
                    "class" : "LoadImageFromFile",
                    "version" : 0,
                    "validation" : true,
                    "parameters" : {
                        "grayscale" : false
                    }
                }, 
                {
                    "name" : "Pad to square",
                    "module" : "plugins.installed.pad_to_square.pad_to_square",
                    "class" : "PadToSquare",
                    "version" : 1,
                    "validation" : true,
                    "parameters" : {
                        "pad_value" : 128
                    }
                }, 
                {
                    "name" : "Image resize",
                    "module" : "plugins.installed.image_resize.image_resize",
                    "class" : "ImageResize",
                    "version" : 0,
                    "validation" : true,
                    "parameters" : {
                        "H" : 416,
                        "W" : 416
                    }
                }
            ]
        }, 
        {
            "column" : "sample_transforms_lbl",
            "plugins" : [ 
                {
                    "name" : "Change annotations format",
                    "module" : "plugins.installed.change_format_annotations.change_format_annotations",
                    "class" : "ChangeFormatAnnotations",
                    "version" : 0,
                    "validation" : true,
                    "parameters" : {
                        "conversion" : "x1y1x2y2c_to_x1y1whc"
                    }
                }, 
                {
                    "name" : "Pad to square the annotations",
                    "module" : "plugins.installed.pad_to_square_annotations.pad_to_square_annotations",
                    "class" : "PadToSquareAnnotations",
                    "version" : 0,
                    "validation" : true,
                    "parameters" : {}
                }, 
                {
                    "name" : "Resize boxes",
                    "module" : "plugins.installed.resize_annotations.resize_annotations",
                    "class" : "ResizeAnnotations",
                    "version" : 0,
                    "validation" : true,
                    "parameters" : {
                        "H" : 416,
                        "W" : 416
                    }
                }
            ]
        }, 
        {
            "column" : "dataset_transforms",
            "plugins" : []
        }, 
        {
            "column" : "batch_transforms",
            "plugins" : [ 
                {
                    "name" : "Random HSL",
                    "module" : "plugins.installed.random_HSL.random_HSL",
                    "class" : "RandomHSL",
                    "version" : 1,
                    "validation" : false,
                    "parameters" : {
                        "brightness_max" : 60,
                        "saturation_max" : 40,
                        "hue_max" : 5,
                        "probability" : 0.7
                    }
                }, 
                {
                    "name" : "Random Erase",
                    "module" : "plugins.installed.random_erase.random_erase",
                    "class" : "RandomErase",
                    "version" : 1,
                    "validation" : false,
                    "parameters" : {
                        "color" : -1,
                        "probability" : 0.7,
                        "form_factor_min" : 0.4,
                        "form_factor_max" : 3,
                        "max_erase_perc" : 0.2
                    }
                }, 
                {
                    "name" : "Random scale",
                    "module" : "plugins.installed.random_image_scale.random_image_scale",
                    "class" : "RandomImageScale",
                    "version" : 1,
                    "validation" : false,
                    "parameters" : {
                        "pad_value" : -1,
                        "probability" : 0.7,
                        "max_scale_perc" : 0.05,
                        "sync_code" : 10
                    }
                }, 
                {
                    "name" : "Horizontal flip",
                    "module" : "plugins.installed.horizontal_flip.horizontal_flip",
                    "class" : "HorizontalFlip",
                    "version" : 1,
                    "validation" : false,
                    "parameters" : {
                        "probability" : 0.7,
                        "sync_code" : 12
                    }
                }, 
                {
                    "name" : "Random image rotation",
                    "module" : "plugins.installed.random_image_rotation.random_image_rotation",
                    "class" : "RandomImageRotation",
                    "version" : 1,
                    "validation" : false,
                    "parameters" : {
                        "pad_value" : -1,
                        "probability" : 0.7,
                        "sync_code" : 20,
                        "max_angle" : 10
                    }
                }, 
                {
                    "name" : "To tensor",
                    "module" : "torchvision.transforms",
                    "class" : "ToTensor",
                    "version" : 123,
                    "validation" : true,
                    "parameters" : {}
                }
            ]
        }, 
        {
            "column" : "batch_transforms_lbl",
            "plugins" : [ 
                {
                    "name" : "Detection Random Scale Annotations",
                    "module" : "plugins.installed.detection_random_scale_annotations.detection_random_scale_annotations",
                    "class" : "DetectionRandomScaleAnnotations",
                    "version" : 0,
                    "validation" : false,
                    "parameters" : {
                        "probability" : 0.7,
                        "sync_code" : 10,
                        "max_scale_perc" : 0.05,
                        "height" : 416,
                        "width" : 416
                    }
                }, 
                {
                    "name" : "Horizontal flip",
                    "module" : "plugins.installed.detection_horizflip_annotations.detection_horizflip_annotations",
                    "class" : "DetectionHorizflipAnnotations",
                    "version" : 1,
                    "validation" : false,
                    "parameters" : {
                        "probability" : 0.7,
                        "sync_code" : 12,
                        "width" : 416
                    }
                }, 
                {
                    "name" : "Detection Random Rotate Annotations",
                    "module" : "plugins.installed.detection_random_rotate_annotations.detection_random_rotate_annotations",
                    "class" : "DetectionRandomRotateAnnotations",
                    "version" : 1,
                    "validation" : false,
                    "parameters" : {
                        "max_angle" : 10,
                        "probability" : 0.7,
                        "sync_code" : 20,
                        "height" : 416,
                        "width" : 416
                    }
                }
            ]
        }
    ]
}
