<?xml version="1.0" encoding="utf-8"?>
<!-- Generator: Adobe Illustrator 26.0.3, SVG Export Plug-In . SVG Version: 6.00 Build 0)  -->
<svg version="1.1" id="Capa_1" xmlns="http://www.w3.org/2000/svg" xmlns:xlink="http://www.w3.org/1999/xlink" x="0px" y="0px"
	 viewBox="0 0 416 259.3" style="enable-background:new 0 0 416 259.3;" xml:space="preserve">
<style type="text/css">
	.st0{fill:#E9B541;}
	.st1{fill:#C74E30;}
	.st2{fill:#DAACAB;}
	.st3{fill:#08090A;}
	.st4{fill:#2E3369;}
	.st5{fill:#F2EFEA;}
	.st6{fill:#C63C6B;}
	.st7{clip-path:url(#SVGID_00000064351879869750484130000017489008638633469070_);fill:#94AEDB;}
	.st8{fill:#94AEDB;}
</style>
<path class="st0" d="M42.4,164.5h94.4c0,0-3.1-124.2-41-130.9c0,0-5-0.9-10.8,2.7c-8.3,5.1-14.8,21-17.3,41.2v0
	c-2.1,17-6.8,31.1-13.2,39.3l-3.2,4.2c-4.9,6.3-8.1,18.5-8.5,32.2L42.4,164.5z"/>
<path class="st1" d="M264.4,84.7l-36.8,6.5c-6.9,1.2-13.4-3.3-14.7-10.1l0,0c-0.9-4.8,1-9.7,4.8-12.6l0,0c1-0.7,1.5-2,1.2-3.2
	l-0.3-1.8c-1.2-6.3,1.6-12.8,7.1-16.2l0.7-0.4c4.1-2.6,9.1-3.5,13.8-2.6l0,0c6.8,1.3,12.3,6.1,14.6,12.6l1.5,4.2l7.3,0.8
	c5.9,0.6,10.5,5.6,10.5,11.6l0,0C274.1,78.9,270,83.8,264.4,84.7z"/>
<path class="st2" d="M207.2,122.3l-7.4,7.3l1.1,1.7c2.3,3.6,1.7,8.3-1.5,11.1l-2.1,1.9l27,22.6l9.3-11.2L207.2,122.3z"/>
<path class="st3" d="M130.6,88h66c0,0-2.1-35-28.7-36.9c0,0-3.5-0.2-7.5,0.8c-5.8,1.4-10.4,5.9-12.1,11.6v0
	c-1.5,4.8-4.8,8.8-9.2,11.1l-2.3,1.2c-3.4,1.8-5.7,5.2-6,9.1L130.6,88z"/>
<path class="st4" d="M114.7,90.9l28.8,7.2l28.5-5c0,0,17.6,3.7,27.1,7.9c2.3,1,4.1,2.9,4.9,5.2l1.9,5.1c0.8,2-0.5,4.3-2.7,4.7l0,0
	c-1.4,0.3-2.9-0.3-3.7-1.4l-5.9-6.4l-0.9,1.1c-0.8,0.6-2,0.2-2.3-0.8l-1.1-4.1l-11-2.1l-28.7,20l-35-1.4V90.9z"/>
<path class="st3" d="M207,111.3l-1.9-5.1c-0.8-2.3-2.6-4.2-4.8-5.2c-4.8-2.2-11.8-4.3-17.4-5.8v7.6l7.9,1.6l1.1,4.1
	c0.3,1,1.4,1.4,2.2,0.8l0.9-1.1l5.7,6.4c0.8,1.1,2.2,1.7,3.6,1.4C206.5,115.6,207.7,113.4,207,111.3z"/>
<path class="st2" d="M51.7,87.7l-15-1.4c-2.3-0.2-4.6-1.1-6.6-2.5c-7.8-5.3-10.2-15.8-5.7-24.2L35.2,39l8.3-2.5
	c0.4-0.1,0.5-0.7,0.1-0.9l-3.5-1.9l1.9-5.3c0.6-1.7-0.3-3.6-2-4.1l0,0c-1-0.3-2.1-0.1-3,0.6L22.1,37.6c-9.7,8.2-16.6,19.4-19,31.9
	c-0.1,0.6-0.2,1.1-0.3,1.7l0,0c-2.6,16.2,7.7,31.6,23.6,35.5l25.3,6.2V87.7z"/>
<path class="st4" d="M37.9,86c-2.4-0.2-4.8-1.2-7.1-2.6c-8.3-5.5-10.8-16.3-6.1-25l7.5-13.8l-9.9-8.9C12,44.2,4.7,55.8,2.2,68.7
	c-0.1,0.6-0.2,1.1-0.3,1.7l0,0C-0.9,87.1,10,103,26.9,107.1l26.9,6.4V87.4L37.9,86z"/>
<path class="st3" d="M83.8,175.6L83.8,175.6L83.8,175.6c-6.3,12.1-16.9,21.4-29.7,26.1l-3.4,1.3v56.4h30.1v-46.7
	c0-2,1.4-3.7,3.4-3.9c2.2-0.2,4.1,1.5,4.1,3.7v46.9h30.2V203l-8.6-2.8C98.1,196.3,88.5,187.3,83.8,175.6z"/>
<path class="st5" d="M155.1,78.6v21.4l-9,0.7c-2.3,0.2-4.4,1.1-6,2.8l-25.6,21.7v29.7l22.3-19.6l12.3,47.6l-4.6,9.4
	c-8,16.5-12,34.6-11.6,52.9l0.3,14h81.3l-19.6-80.9v-32l4.5-4c3.2-2.8,3.8-7.6,1.5-11.1l-1.1-1.7l7.4-7.3l-16.3-18.8
	c-1.3-1.5-3.2-2.5-5.3-2.6l-11.6-0.8V81.7L155.1,78.6z"/>
<path class="st6" d="M164.3,116.1c7.4,0,13.5-7,13.5-15.6c0-0.1,0-0.2,0-0.2l-3.7-0.3V89.8c-2.5-3-5.9-4.8-9.7-4.8
	c-3.5,0-6.8,1.6-9.2,4.2v10.9l-4.3,0.3c0,0.1,0,0.1,0,0.2C150.8,109.2,156.9,116.1,164.3,116.1z"/>
<g>
	<defs>
		<path id="SVGID_1_" d="M334.8,98.2L289,90.6c-8.3-1.4-16.7-1.3-25,0.3l-40.4,7.6c-8.7,1.6-16.8,5.5-23.5,11.3l-7,6l8.7,23.5
			l16.1-13.7l-2.7,4.9c-2.8,5.1-1.7,11.5,2.7,15.4l3.8,3.4l-4.9,41.5l70.7-0.8l-9.7-73.1h50.2L334.8,98.2z"/>
	</defs>
	<use xlink:href="#SVGID_1_"  style="overflow:visible;fill:#94AEDB;"/>
	<clipPath id="SVGID_00000165219645431761905680000001769213924028354187_">
		<use xlink:href="#SVGID_1_"  style="overflow:visible;"/>
	</clipPath>
	
		<rect x="263.4" y="66.6" style="clip-path:url(#SVGID_00000165219645431761905680000001769213924028354187_);fill:#94AEDB;" width="2.9" height="168.3"/>
	
		<rect x="255.6" y="66.6" style="clip-path:url(#SVGID_00000165219645431761905680000001769213924028354187_);fill:#94AEDB;" width="2.9" height="168.3"/>
	
		<rect x="247.8" y="66.6" style="clip-path:url(#SVGID_00000165219645431761905680000001769213924028354187_);fill:#94AEDB;" width="2.9" height="168.3"/>
	
		<rect x="240" y="66.6" style="clip-path:url(#SVGID_00000165219645431761905680000001769213924028354187_);fill:#94AEDB;" width="2.9" height="168.3"/>
	
		<rect x="232.1" y="66.6" style="clip-path:url(#SVGID_00000165219645431761905680000001769213924028354187_);fill:#94AEDB;" width="2.9" height="168.3"/>
	
		<rect x="224.3" y="66.6" style="clip-path:url(#SVGID_00000165219645431761905680000001769213924028354187_);fill:#94AEDB;" width="2.9" height="168.3"/>
	
		<rect x="216.5" y="66.6" style="clip-path:url(#SVGID_00000165219645431761905680000001769213924028354187_);fill:#94AEDB;" width="2.9" height="168.3"/>
	
		<rect x="208.7" y="66.6" style="clip-path:url(#SVGID_00000165219645431761905680000001769213924028354187_);fill:#94AEDB;" width="2.9" height="168.3"/>
	
		<rect x="200.8" y="66.6" style="clip-path:url(#SVGID_00000165219645431761905680000001769213924028354187_);fill:#94AEDB;" width="2.9" height="168.3"/>
	
		<rect x="193" y="66.6" style="clip-path:url(#SVGID_00000165219645431761905680000001769213924028354187_);fill:#94AEDB;" width="2.9" height="168.3"/>
	
		<rect x="185.2" y="66.6" style="clip-path:url(#SVGID_00000165219645431761905680000001769213924028354187_);fill:#94AEDB;" width="2.9" height="168.3"/>
	
		<rect x="177.4" y="66.6" style="clip-path:url(#SVGID_00000165219645431761905680000001769213924028354187_);fill:#94AEDB;" width="2.9" height="168.3"/>
	
		<rect x="169.5" y="66.6" style="clip-path:url(#SVGID_00000165219645431761905680000001769213924028354187_);fill:#94AEDB;" width="2.9" height="168.3"/>
	
		<rect x="161.7" y="66.6" style="clip-path:url(#SVGID_00000165219645431761905680000001769213924028354187_);fill:#94AEDB;" width="2.9" height="168.3"/>
</g>
<polygon class="st3" points="216.9,189.9 219.4,259.3 249.1,259.3 252.5,229.6 255.2,259.3 282.1,259.3 287.6,189.1 "/>
<path class="st6" d="M336.2,193.5l-9.6-11.8l-6.1,11.8l-21.9-7.1v73h30V202c0-1,0.7-1.8,1.6-1.8c0.9,0,1.6,0.8,1.6,1.8v57.3h30
	v-77.7L336.2,193.5z"/>
<path class="st2" d="M302.7,84.6c-1.7,0.3-3.2,1.2-4.1,2.4l-21.7,27.7l4.2,27.4l23.6-30.6"/>
<g>
	<path class="st2" d="M371.5,29.8l-5-10.5L359,15c-0.5-0.3-0.3-0.9,0.3-0.9h5.2L361.3,6c-0.7-2,0-4.1,1.9-5.3l0,0
		c2.1-1.3,5-0.8,6.4,1.2l13.5,23.9L371.5,29.8z"/>
	<path class="st2" d="M380.4,21c6.8,8.8,25.6,63.8-40.7,84.7V79.6c0,0,47.1-9.8,31-51.4"/>
</g>
<path class="st5" d="M408.9,70.2l-13.1,7.9c0.8,2.2,1.5,4.3,2,6.3l14-6C410.4,73.3,408.9,70.2,408.9,70.2z"/>
<path class="st3" d="M91.2,75.3c2.9,6.2,11.1,5.3,11.1,5.3l0,0l0.8-8C97.3,71.7,89.4,71.3,91.2,75.3z"/>
<polygon class="st3" points="22.2,33.8 15.2,40.8 31,47.9 32.8,44.2 "/>
<path class="st2" d="M174,100.1V81.7l-18.9-3.1v21.4h0c0.1,5.4,4.3,9.8,9.5,9.8C169.8,109.9,174,105.5,174,100.1L174,100.1z"/>
<path class="st3" d="M162.9,85.4c2.7,6,11.2,4.6,11.2,4.6v-7.2C169.1,81.9,160.8,80.9,162.9,85.4z"/>
<path class="st2" d="M168,88L168,88c-7,0-12.8-5.8-12.8-12.8v-3.4c0-7,5.8-12.8,12.8-12.8l0,0c7,0,12.8,5.8,12.8,12.8v3.4
	C180.7,82.3,175,88,168,88z"/>
<path class="st3" d="M155.2,75l1-0.4c4.2-1.8,7.1-5.7,7.8-10.2l0.4-2.4c0,0,8.4,5.6,17.4,1.2S168,55.7,168,55.7l-12.8,0.8l-2.5,7
	l2.5,12.3"/>
<path class="st2" d="M156.7,78.7c-2.1,1.2-4.8,0.2-6.2-2.2c-1.4-2.4-0.8-5.3,1.2-6.5c2.1-1.2,4.8-0.2,6.2,2.2
	C159.3,74.6,158.7,77.5,156.7,78.7z"/>
<path class="st2" d="M207,111.3l-1.9-5.1c-0.8-2.3-2.6-4.2-4.8-5.2c-3.6-1.7-8.5-3.3-13-4.6l1.5,5.3l2.1,2.7l1.1,4.1
	c0.3,1,1.4,1.4,2.2,0.8l0.9-1.1l5.7,6.4c0.8,1.1,2.2,1.7,3.6,1.4C206.5,115.6,207.7,113.4,207,111.3z"/>
<polygon class="st3" points="194.9,149.9 194.9,146.5 189.2,149.9 "/>
<polygon class="st3" points="136.8,135.3 135,126.6 134,138.4 "/>
<polygon class="st3" points="149.2,183 152.7,192.4 146.9,187.7 "/>
<path class="st2" d="M232.2,79.6l1.7,18.7c0.5,5.5,5.3,9.5,10.8,9.1l0,0c5.6-0.4,9.7-5.4,9.2-10.9L251.5,70"/>
<path class="st3" d="M232.6,83.7c3.5-0.1,9.3-0.9,12.1-4.1c2-2.3-1.8-2.9-6.4-3l-6.1,3L232.6,83.7z"/>
<path class="st2" d="M240,81.2L240,81.2c7-0.8,12-7.2,11.2-14.2l-0.4-3.4c-0.8-7-7.2-12-14.2-11.2h0c-7,0.8-12,7.2-11.2,14.2
	l0.4,3.4C226.6,77,233,82.1,240,81.2z"/>
<path class="st1" d="M221.6,60.7c0,0,11.1,2.5,14.2-7.1c0,0,3.6,7.3,11.6,5.9c0,0-0.8,8.6,6.5,10.1L252.1,56l-8.7-7.8h-11.6l-9,6.7
	L221.6,60.7z"/>
<path class="st2" d="M250.1,70.7c2.2,0.9,4.8-0.4,5.9-2.9c1.1-2.5,0.2-5.4-2-6.3c-2.2-0.9-4.8,0.4-5.9,2.9
	C247.1,66.9,247.9,69.7,250.1,70.7z"/>
<polygon class="st3" points="221.8,148.4 221.6,150.5 228.6,152.4 "/>
<polygon class="st6" points="233.5,95.7 244.7,107.4 232.2,114.4 "/>
<polygon class="st6" points="253.8,91.9 244.7,107.4 259.5,113.2 "/>
<path class="st3" d="M246.7,117.6c0,0.8-0.6,1.5-1.5,1.5c-0.8,0-1.5-0.6-1.5-1.5c0-0.8,0.6-1.5,1.5-1.5
	C246.1,116.1,246.7,116.8,246.7,117.6z"/>
<path class="st3" d="M246.7,136.4c0,0.8-0.6,1.5-1.5,1.5c-0.8,0-1.5-0.6-1.5-1.5s0.6-1.5,1.5-1.5
	C246.1,134.9,246.7,135.6,246.7,136.4z"/>
<path class="st3" d="M246.7,155.2c0,0.8-0.6,1.5-1.5,1.5c-0.8,0-1.5-0.6-1.5-1.5c0-0.8,0.6-1.5,1.5-1.5
	C246.1,153.8,246.7,154.4,246.7,155.2z"/>
<path class="st3" d="M246.7,174c0,0.8-0.6,1.5-1.5,1.5c-0.8,0-1.5-0.7-1.5-1.5c0-0.8,0.6-1.5,1.5-1.5
	C246.1,172.6,246.7,173.2,246.7,174z"/>
<polygon class="st3" points="240.5,194.5 245.3,183 252.3,194.5 "/>
<path class="st8" d="M340.6,49.6c0.2-3-1.9-5.6-4.9-6.3c0.2-0.4,0.3-0.9,0.3-1.3c0.1-2.5-1.9-4.6-4.5-4.8c-0.1,0-0.2,0-0.2,0
	c0.4-1.1,0.5-2.3,0-3.7c-0.7-2.3-2.8-4-5.3-4.3c-2.3-0.3-4.4,0.5-5.7,1.9c-0.7-2.8-3.2-5-6.4-5.1c-3.2-0.2-6,1.8-7,4.6
	c-0.8-0.6-1.7-1-2.7-1c-2.6-0.1-4.9,1.8-5,4.2c0,0,0,0.1,0,0.1c-1.2-0.3-2.5-0.3-3.9,0.3c-2.3,0.9-4,3-4.1,5.4
	c-0.2,3.4,2.6,6.2,6.1,6.4c1,0.1,2-0.1,2.9-0.5l16.1-2.7c1.9-0.3,3.9,0.1,5.5,1.3l0,0c1.8,1.3,2.9,3.5,2.7,5.6l-0.3,5.2l2.7,0.7
	l1.2,8.3l0,0l0.7,6l8.5-15.4C339.3,53.5,340.5,51.7,340.6,49.6z"/>
<path class="st2" d="M329.9,57.5c2.1,1.1,4.8,0,6.1-2.4c1.3-2.4,0.6-5.3-1.5-6.4c-2.1-1.1-4.8,0-6.1,2.4
	C327.2,53.5,327.8,56.4,329.9,57.5z"/>
<path class="st2" d="M216.2,170.3l3.6-3.8l-0.6,5.2l8,4.5c1.5,0.8,2.2,2.6,1.7,4.2l0,0c-0.5,1.7-2.2,2.7-3.9,2.5l-9.5-1.2
	c-2.7-0.3-4.7-2.6-4.7-5.3v-0.8C210.9,172.6,213.3,170.3,216.2,170.3L216.2,170.3z"/>
<path class="st2" d="M143.7,172.5l1.9-4.8l1.3,5.1l9.1,1.2c1.7,0.2,3,1.6,3.1,3.3l0,0c0.1,1.8-1,3.3-2.7,3.8l-9.2,2.4
	c-2.6,0.7-5.3-0.7-6.3-3.2l-0.3-0.7C139.6,176.7,141,173.6,143.7,172.5L143.7,172.5z"/>
<g>
	<path class="st5" d="M206.4,39.4h-9.7c-0.2,0-0.4-0.2-0.4-0.4c0-0.2,0.2-0.4,0.4-0.4h9.7c0.2,0,0.4,0.2,0.4,0.4
		C206.8,39.3,206.6,39.4,206.4,39.4z"/>
	<path class="st5" d="M201.5,44.3c-0.2,0-0.4-0.2-0.4-0.4v-9.7c0-0.2,0.2-0.4,0.4-0.4c0.2,0,0.4,0.2,0.4,0.4v9.7
		C201.9,44.1,201.8,44.3,201.5,44.3z"/>
</g>
<g>
	<path class="st5" d="M28.8,159.1c-0.1,0-0.2,0-0.3-0.1l-6.9-6.9c-0.2-0.2-0.2-0.4,0-0.6c0.2-0.2,0.4-0.2,0.6,0l6.9,6.9
		c0.2,0.2,0.2,0.4,0,0.6C29,159,28.9,159.1,28.8,159.1z"/>
	<path class="st5" d="M21.9,159.1c-0.1,0-0.2,0-0.3-0.1c-0.2-0.2-0.2-0.4,0-0.6l6.9-6.9c0.2-0.2,0.4-0.2,0.6,0
		c0.2,0.2,0.2,0.4,0,0.6l-6.9,6.9C22.1,159,22,159.1,21.9,159.1z"/>
</g>
<g>
	<path class="st5" d="M379.6,209.6c-0.1,0-0.2,0-0.3-0.1l-6.9-6.9c-0.2-0.2-0.2-0.4,0-0.6c0.2-0.2,0.4-0.2,0.6,0l6.9,6.9
		c0.2,0.2,0.2,0.4,0,0.6C379.8,209.5,379.7,209.6,379.6,209.6z"/>
	<path class="st5" d="M372.7,209.6c-0.1,0-0.2,0-0.3-0.1c-0.2-0.2-0.2-0.4,0-0.6l6.9-6.9c0.2-0.2,0.4-0.2,0.6,0
		c0.2,0.2,0.2,0.4,0,0.6l-6.9,6.9C373,209.5,372.8,209.6,372.7,209.6z"/>
</g>
<path class="st5" d="M136.8,63c-2.2,0-4-1.8-4-4c0-2.2,1.8-4,4-4c2.2,0,4,1.8,4,4C140.8,61.2,139,63,136.8,63z M136.8,55.9
	c-1.7,0-3.2,1.4-3.2,3.2c0,1.7,1.4,3.2,3.2,3.2c1.7,0,3.2-1.4,3.2-3.2C140,57.3,138.6,55.9,136.8,55.9z"/>
<path class="st5" d="M376.2,128.4c-2.2,0-4-1.8-4-4c0-2.2,1.8-4,4-4s4,1.8,4,4C380.2,126.6,378.4,128.4,376.2,128.4z M376.2,121.3
	c-1.7,0-3.2,1.4-3.2,3.2c0,1.7,1.4,3.2,3.2,3.2c1.7,0,3.2-1.4,3.2-3.2C379.4,122.7,377.9,121.3,376.2,121.3z"/>
<path class="st5" d="M69.8,34.2c0,2-1.6,3.6-3.6,3.6c-2,0-3.6-1.6-3.6-3.6c0-2,1.6-3.6,3.6-3.6C68.2,30.6,69.8,32.2,69.8,34.2z"/>
<path class="st5" d="M209.7,32.8c0,1-0.8,1.7-1.7,1.7c-1,0-1.7-0.8-1.7-1.7c0-1,0.8-1.7,1.7-1.7C209,31.1,209.7,31.9,209.7,32.8z"/>
<path class="st5" d="M87.3,24.2c0,4.5-3.7,8.2-8.2,8.2c-4.5,0-8.2-3.7-8.2-8.2c0-4.5,3.7-8.2,8.2-8.2C83.6,16,87.3,19.7,87.3,24.2z"
	/>
<ellipse transform="matrix(0.118 -0.993 0.993 0.118 156.8999 556.3884)" class="st5" cx="391.6" cy="189.9" rx="8.2" ry="8.2"/>
<path class="st5" d="M382.1,191.9c-5.5,0-10-4.5-10-10c0-5.5,4.5-10,10-10c5.5,0,10,4.5,10,10C392.1,187.4,387.6,191.9,382.1,191.9z
	 M382.1,172.7c-5.1,0-9.2,4.1-9.2,9.2c0,5.1,4.1,9.2,9.2,9.2c5.1,0,9.2-4.1,9.2-9.2C391.2,176.8,387.1,172.7,382.1,172.7z"/>
<polygon class="st5" points="390.7,103.5 391,112.1 391.3,120.7 383.8,116.6 376.2,112.6 383.5,108.1 "/>
<polygon class="st5" points="43.6,210.2 38.1,215.3 32.6,220.3 31,213 29.4,205.7 36.5,208 "/>
<polygon class="st5" points="279.7,20 269,29.9 258.2,39.7 255,25.4 251.9,11.2 265.8,15.6 "/>
<rect x="3.2" y="124.4" class="st5" width="8.7" height="8.5"/>
<polygon class="st5" points="342.8,38.5 336.7,32.5 342.8,26.5 349,32.5 "/>
<path class="st2" d="M83.3,67.5c-2.1,1.2-4.8,0.2-6.2-2.2c-1.4-2.4-0.8-5.3,1.2-6.5c2.1-1.2,4.8-0.2,6.2,2.2
	C85.9,63.4,85.4,66.3,83.3,67.5z"/>
<path class="st4" d="M50.7,105.4c2.2,10.6,3.9,22.7,4.6,36.1c1.2,24.2-1.3,45.1-4.6,61.4c1.1-0.4,2.3-0.8,3.4-1.3
	c12.8-4.7,23.4-14,29.7-26.1c4.7,11.6,14.2,20.6,26.2,24.6l8.6,2.8c-1.5-17.7-2.3-37-2.3-57.5c0-19.4,1.3-36.6,2.6-53.5
	c-5.7-1-11.7-3-17.3-3.9l-20-3.4l-30.8,3V105.4z"/>
<path class="st5" d="M117.3,202.6l-7.3-2.4c-11.9-3.9-21.5-12.9-26.2-24.6c-6.3,12.1-16.9,21.4-29.7,26.1l-2.3,0.8H117.3z"/>
<polygon class="st5" points="89.6,104.4 82.6,84.5 76.9,85.1 75.6,110.1 "/>
<polygon class="st5" points="101.5,88 89.6,104.4 101.5,112.1 106.6,88.9 "/>
<path class="st5" d="M87.2,133.7c0,0.8-0.7,1.5-1.5,1.5c-0.8,0-1.5-0.6-1.5-1.5c0-0.8,0.6-1.5,1.5-1.5
	C86.5,132.3,87.2,132.9,87.2,133.7z"/>
<path class="st5" d="M88.6,117.6c0,0.8-0.6,1.5-1.5,1.5c-0.8,0-1.5-0.6-1.5-1.5c0-0.8,0.6-1.5,1.5-1.5
	C88,116.1,88.6,116.8,88.6,117.6z"/>
<path class="st5" d="M86.1,149.9c0,0.8-0.6,1.5-1.5,1.5c-0.8,0-1.5-0.6-1.5-1.5c0-0.8,0.7-1.5,1.5-1.5
	C85.4,148.4,86.1,149.1,86.1,149.9z"/>
<path class="st5" d="M85.3,166.9c0,0.8-0.6,1.5-1.5,1.5c-0.8,0-1.5-0.7-1.5-1.5c0-0.8,0.7-1.5,1.5-1.5
	C84.6,165.5,85.3,166.1,85.3,166.9z"/>
<path class="st2" d="M84.8,66.4l-3.4,26.5c-0.7,5.7,3.4,10.9,9.2,11.5l0,0c5.6,0.6,10.6-3.5,11.2-9.1l2.4-23.3L84.8,66.4z"/>
<path class="st3" d="M91.6,75.9c2.7,6,11.2,4.6,11.2,4.6v-7.2C97.9,72.3,89.6,71.4,91.6,75.9z"/>
<path class="st2" d="M101.6,77.7H89.4c-4.3,0-7.9-3.5-7.9-7.9V54.6c0-4.3,3.5-7.9,7.9-7.9h12.2c4.3,0,7.9,3.5,7.9,7.9v15.3
	C109.5,74.2,106,77.7,101.6,77.7z"/>
<path class="st0" d="M82.4,60.3l1-0.4c4.2-1.8,7.1-5.7,7.8-10.2l0.4-2.4c0,0,8.4,5.6,17.4,1.2S95.2,41,95.2,41l-12.8,0.8l-2.5,7
	l2.5,12.3"/>
<path class="st5" d="M354.7,102.6c2.9,13.5,3.8,24,4.4,46.9c0.5,17.6,2.9,33,5.7,45.4c-8.6,2.6-17.2,5.2-25.8,7.8l-9.7-12.7l-5,12.7
	l-27-11.4c0-22.9,8.2-58.7,2.9-66.7c-9.1-13.6,1.6-24.1,1.6-40.4c21.7-0.3,21.2-14.4,42.2-10C346.6,74.6,354.7,99.9,354.7,102.6z"/>
<path class="st2" d="M332.7,75.8l-3.4,3.9l5.1-1.1l5.2,7.6c1,1.4,2.8,2,4.3,1.3l0,0c1.6-0.7,2.5-2.4,2.2-4.1l-2.1-9.3
	c-0.6-2.6-3-4.4-5.7-4.2l-0.8,0.1C334.6,70.2,332.5,72.8,332.7,75.8L332.7,75.8z"/>
<polygon class="st3" points="301.5,125.7 301.2,127.8 308.2,129.7 "/>
<path class="st2" d="M328.4,59.7l4.4,26.4c1,5.7-3,11-8.7,11.8l0,0c-5.6,0.8-10.7-3.1-11.6-8.7l-3.3-23.2L328.4,59.7z"/>
<path class="st3" d="M308.8,63.1l1.1,7.5c3.1,0,8-0.6,11.6-4.5C325.8,61.5,313.9,62.5,308.8,63.1z"/>
<path class="st2" d="M316.2,69.3L316.2,69.3c7.5-0.3,13.4-6.7,13.1-14.2l-0.1-3.7c-0.3-7.5-6.7-13.4-14.2-13.1l0,0
	c-7.5,0.3-13.4,6.7-13.1,14.2l0.1,3.7C302.3,63.7,308.7,69.6,316.2,69.3z"/>
<path class="st3" d="M307.2,59.1h-7.4c-1.1,0-2.1-0.9-2.1-2.1v-5.1c0-1.1,0.9-2.1,2.1-2.1h7.4c1.1,0,2.1,0.9,2.1,2.1V57
	C309.2,58.2,308.3,59.1,307.2,59.1z M299.8,50.7c-0.7,0-1.2,0.6-1.2,1.2V57c0,0.7,0.6,1.2,1.2,1.2h7.4c0.7,0,1.2-0.6,1.2-1.2v-5.1
	c0-0.7-0.6-1.2-1.2-1.2H299.8z"/>
<path class="st3" d="M322.3,59.1H315c-1.1,0-2.1-0.9-2.1-2.1v-5.1c0-1.1,0.9-2.1,2.1-2.1h7.4c1.1,0,2.1,0.9,2.1,2.1V57
	C324.4,58.2,323.4,59.1,322.3,59.1z M315,50.7c-0.7,0-1.2,0.6-1.2,1.2V57c0,0.7,0.6,1.2,1.2,1.2h7.4c0.7,0,1.2-0.6,1.2-1.2v-5.1
	c0-0.7-0.6-1.2-1.2-1.2H315z"/>
</svg>
