{
  "reportName" : "Allure Report",
  "testRuns" : [ ],
  "statistic" : {
    "failed" : 0,
    "broken" : 0,
    "skipped" : 0,
    "passed" : 2,
    "unknown" : 0,
    "total" : 2
  },
  "time" : {
    "start" : 1653261971731,
    "stop" : 1653262056511,
    "duration" : 84780,
    "minDuration" : 37343,
    "maxDuration" : 47186,
    "sumDuration" : 84529
  }
}