{
	"business_key_prefix": "",
	"business_key_short": "KATID",
	"column_ids": [
		{
			"column_id": "STAGING.WEB_R_HR_WEB_PRODUCT_CATEGORY.KATID",
			"column_order": 1
		}
	],
	"datavault_category_id": "raw_vault",
	"hub_id": "H_PARENT_PRODUCT_CATEGORY",
	"hub_load_display_name": "web: HR WEB PRODUCT CATEGORY (KATID)",
	"hub_load_id": "H_PARENT_PRODUCT_CATEGORY_S_WEB_R_HR_WEB_PRODUCT_CATEGORY",
	"keys_are_prehashed": false,
	"keys_are_unique": true,
	"staging_table_id": "STAGING.WEB_R_HR_WEB_PRODUCT_CATEGORY",
	"system_id": "WEB",
	"system_name": "web"
}