{
	"business_key_prefix": "",
	"business_key_short": "BESTELLUNGID, VEREINSPARTNERID, KUNDEID, KREDITKARTE, GUELTIGBIS, KKFIRMA",
	"column_ids": [
		{
			"column_id": "STAGING.ROAD_R_HR_RS_ORDER_MK.BESTELLUNGID",
			"column_order": 1
		},
		{
			"column_id": "STAGING.ROAD_R_HR_RS_ORDER_MK.VEREINSPARTNERID",
			"column_order": 2
		},
		{
			"column_id": "STAGING.ROAD_R_HR_RS_ORDER_MK.KUNDEID",
			"column_order": 3
		},
		{
			"column_id": "STAGING.ROAD_R_HR_RS_ORDER_MK.KREDITKARTE",
			"column_order": 4
		},
		{
			"column_id": "STAGING.ROAD_R_HR_RS_ORDER_MK.GUELTIGBIS",
			"column_order": 5
		},
		{
			"column_id": "STAGING.ROAD_R_HR_RS_ORDER_MK.KKFIRMA",
			"column_order": 6
		}
	],
	"datavault_category_id": "raw_vault",
	"hub_id": "H_SALE",
	"hub_load_display_name": "road: HR RS ORDER MK (BESTELLUNGID, VEREINSPARTNERID, KUNDEID, KREDITKARTE, GUELTIGBIS, KKFIRMA)",
	"hub_load_id": "H_SALE_S_ROAD_R_HR_RS_ORDER_MK",
	"keys_are_prehashed": false,
	"keys_are_unique": true,
	"staging_table_id": "STAGING.ROAD_R_HR_RS_ORDER_MK",
	"system_id": "ROAD",
	"system_name": "road"
}