{
	"hub_a_id": "H_SALE_NO_CUSTOMER",
	"hub_b_id": "H_CUSTOMER",
	"link_comment": "",
	"link_id": "L_SALE_NO_CUSTOMER_T_CUSTOMER",
	"link_subject_area_name": "Sale",
	"link_suffix_id": null,
	"link_suffix_name": "",
	"link_type": "many_to_one"
}