{
	"businessobject_comment": "",
	"businessobject_display_name": "Product > Hub > Default",
	"businessobject_dropdown_entry_string": "Product",
	"businessobject_elements": [
		{
			"columns": [
				{
					"column_comment": "",
					"column_id": "DATAVAULT.H_PRODUCT.PRODUCT_H",
					"column_name": "PRODUCT_H",
					"column_name_detail": "PRODUCT_H",
					"column_nq_id": "PRODUCT_H",
					"column_order": 1,
					"column_orig_name": "PRODUCT_H",
					"conversion_type": null
				},
				{
					"column_comment": "Business Key for Hub Product",
					"column_id": "DATAVAULT.H_PRODUCT.PRODUCT_BK",
					"column_name": "PRODUCT_BK",
					"column_name_detail": "PRODUCT_BK",
					"column_nq_id": "PRODUCT_BK",
					"column_order": 2,
					"column_orig_name": "PRODUCT_BK",
					"conversion_type": null
				},
				{
					"column_comment": "Full Load Valid Hub Product > web > Hr Web PRODUCT",
					"column_id": "DATAVAULT.S_PRODUCT_S_WEB_R_HR_WEB_PRODUCT_W_TRKF_C.PRODUCT_S_WEB_R_HR_WEB_PRODUCT_W_TRKF_VC",
					"column_name": "FV_PRODUCT",
					"column_name_detail": "PRODUCT_S_WEB_R_HR_WEB_PRODUCT_W_TRKF_VC",
					"column_nq_id": "PRODUCT_S_WEB_R_HR_WEB_PRODUCT_W_TRKF_VC",
					"column_order": 11,
					"column_orig_name": "FV_PRODUCT",
					"conversion_type": null
				},
				{
					"column_comment": "Full Load Last Validity Change Time Hub Product > web > Hr Web PRODUCT",
					"column_id": "DATAVAULT.S_PRODUCT_S_WEB_R_HR_WEB_PRODUCT_W_TRKF_C.PRODUCT_S_WEB_R_HR_WEB_PRODUCT_W_TRKF_LTC",
					"column_name": "FLVC_PRODUCT",
					"column_name_detail": "PRODUCT_S_WEB_R_HR_WEB_PRODUCT_W_TRKF_LTC",
					"column_nq_id": "PRODUCT_S_WEB_R_HR_WEB_PRODUCT_W_TRKF_LTC",
					"column_order": 12,
					"column_orig_name": "FLVC_PRODUCT",
					"conversion_type": null
				}
			],
			"path_id": "{\"businessobject_path\":{\"hubs\":[{\"hub_id\":\"H_PRODUCT\"}]}}"
		},
		{
			"columns": [
				{
					"column_comment": "",
					"column_id": "DATAVAULT.S_PRODUCT_S_WEB_R_HR_WEB_PRODUCT_C.PRODUKTID",
					"column_name": "PRODUKTID",
					"column_name_detail": "",
					"column_nq_id": "PRODUKTID",
					"column_order": 3,
					"column_orig_name": "PRODUKTID",
					"complete_data_type": "DECIMAL(18,0)",
					"conversion_type": null
				},
				{
					"column_comment": "",
					"column_id": "DATAVAULT.S_PRODUCT_S_WEB_R_HR_WEB_PRODUCT_C.KATID",
					"column_name": "KATID",
					"column_name_detail": "",
					"column_nq_id": "KATID",
					"column_order": 4,
					"column_orig_name": "KATID",
					"complete_data_type": "VARCHAR(16777216)",
					"conversion_type": null
				},
				{
					"column_comment": "",
					"column_id": "DATAVAULT.S_PRODUCT_S_WEB_R_HR_WEB_PRODUCT_C.BEZEICHNUNG",
					"column_name": "BEZEICHNUNG",
					"column_name_detail": "",
					"column_nq_id": "BEZEICHNUNG",
					"column_order": 5,
					"column_orig_name": "BEZEICHNUNG",
					"complete_data_type": "VARCHAR(16777216)",
					"conversion_type": null
				},
				{
					"column_comment": "",
					"column_id": "DATAVAULT.S_PRODUCT_S_WEB_R_HR_WEB_PRODUCT_C.UMFANG",
					"column_name": "UMFANG",
					"column_name_detail": "",
					"column_nq_id": "UMFANG",
					"column_order": 6,
					"column_orig_name": "UMFANG",
					"complete_data_type": "VARCHAR(16777216)",
					"conversion_type": null
				},
				{
					"column_comment": "",
					"column_id": "DATAVAULT.S_PRODUCT_S_WEB_R_HR_WEB_PRODUCT_C.TYP",
					"column_name": "TYP",
					"column_name_detail": "",
					"column_nq_id": "TYP",
					"column_order": 7,
					"column_orig_name": "TYP",
					"complete_data_type": "DECIMAL(18,0)",
					"conversion_type": null
				},
				{
					"column_comment": "",
					"column_id": "DATAVAULT.S_PRODUCT_S_WEB_R_HR_WEB_PRODUCT_C.PREIS",
					"column_name": "PREIS",
					"column_name_detail": "",
					"column_nq_id": "PREIS",
					"column_order": 8,
					"column_orig_name": "PREIS",
					"complete_data_type": "DECIMAL(18,2)",
					"conversion_type": null
				},
				{
					"column_comment": "",
					"column_id": "DATAVAULT.S_PRODUCT_S_WEB_R_HR_WEB_PRODUCT_C.PFLANZORT",
					"column_name": "PFLANZORT",
					"column_name_detail": "",
					"column_nq_id": "PFLANZORT",
					"column_order": 9,
					"column_orig_name": "PFLANZORT",
					"complete_data_type": "VARCHAR(16777216)",
					"conversion_type": null
				},
				{
					"column_comment": "",
					"column_id": "DATAVAULT.S_PRODUCT_S_WEB_R_HR_WEB_PRODUCT_C.PFLANZABSTAND",
					"column_name": "PFLANZABSTAND",
					"column_name_detail": "",
					"column_nq_id": "PFLANZABSTAND",
					"column_order": 10,
					"column_orig_name": "PFLANZABSTAND",
					"complete_data_type": "VARCHAR(16777216)",
					"conversion_type": null
				}
			],
			"path_id": "{\"businessobject_path\":{\"hubs\":[{\"hub_id\":\"H_PRODUCT\",\"satellites\":[{\"satellite_id\":\"S_PRODUCT_S_WEB_R_HR_WEB_PRODUCT\"}]}]}}"
		}
	],
	"businessobject_set_id": "businessobject_set_H_PRODUCT",
	"businessobject_structure": null,
	"businessobject_view_id": "BUSINESSOBJECTS.PRODUCT_S_DVB_HUB",
	"dependent_objects": [
		{
			"object_id": "H_PRODUCT",
			"object_type": "hub"
		},
		{
			"object_id": "S_PRODUCT_S_WEB_R_HR_WEB_PRODUCT",
			"object_type": "satellite"
		},
		{
			"object_id": "no_pits",
			"object_type": "unknown_object"
		}
	],
	"granularity_satellite_id": null,
	"scd_type": 1,
	"system_id": "DVB_HUB",
	"system_name": "Hub"
}