{
	"column_ids": [
		{
			"character_maximum_length": 2000000,
			"column_comment": "",
			"column_id": "DATAVAULT.S_SALE_NO_CUSTOMER_S_ROAD_R_HR_RS_ORDER_KK_H.BESTELLUNGID",
			"column_is_used": true,
			"column_name": "BESTELLUNGID",
			"column_name_detail": "",
			"column_nq_id": "BESTELLUNGID",
			"column_order": 1,
			"column_type": "attribute",
			"complete_data_type": "VARCHAR(2000000) UTF8",
			"conversion_type": null,
			"data_type": "VARCHAR UTF8",
			"datetime_precision": null,
			"numeric_precision": null,
			"numeric_scale": null
		},
		{
			"character_maximum_length": 2000000,
			"column_comment": "",
			"column_id": "DATAVAULT.S_SALE_NO_CUSTOMER_S_ROAD_R_HR_RS_ORDER_KK_H.VEREINSPARTNERID",
			"column_is_used": true,
			"column_name": "VEREINSPARTNERID",
			"column_name_detail": "",
			"column_nq_id": "VEREINSPARTNERID",
			"column_order": 2,
			"column_type": "attribute",
			"complete_data_type": "VARCHAR(2000000) UTF8",
			"conversion_type": null,
			"data_type": "VARCHAR UTF8",
			"datetime_precision": null,
			"numeric_precision": null,
			"numeric_scale": null
		},
		{
			"character_maximum_length": 2000000,
			"column_comment": "",
			"column_id": "DATAVAULT.S_SALE_NO_CUSTOMER_S_ROAD_R_HR_RS_ORDER_KK_H.GUELTIGBIS",
			"column_is_used": true,
			"column_name": "GUELTIGBIS",
			"column_name_detail": "",
			"column_nq_id": "GUELTIGBIS",
			"column_order": 3,
			"column_type": "attribute",
			"complete_data_type": "VARCHAR(2000000) UTF8",
			"conversion_type": null,
			"data_type": "VARCHAR UTF8",
			"datetime_precision": null,
			"numeric_precision": null,
			"numeric_scale": null
		},
		{
			"character_maximum_length": 2000000,
			"column_comment": "",
			"column_id": "DATAVAULT.S_SALE_NO_CUSTOMER_S_ROAD_R_HR_RS_ORDER_KK_H.KKFIRMA",
			"column_is_used": true,
			"column_name": "KKFIRMA",
			"column_name_detail": "",
			"column_nq_id": "KKFIRMA",
			"column_order": 4,
			"column_type": "attribute",
			"complete_data_type": "VARCHAR(2000000) UTF8",
			"conversion_type": null,
			"data_type": "VARCHAR UTF8",
			"datetime_precision": null,
			"numeric_precision": null,
			"numeric_scale": null
		},
		{
			"character_maximum_length": 2000000,
			"column_comment": "",
			"column_id": "DATAVAULT.S_SALE_NO_CUSTOMER_S_ROAD_R_HR_RS_ORDER_KK_H.KREDITKARTE",
			"column_is_used": true,
			"column_name": "KREDITKARTE",
			"column_name_detail": "",
			"column_nq_id": "KREDITKARTE",
			"column_order": 5,
			"column_type": "attribute",
			"complete_data_type": "VARCHAR(2000000) UTF8",
			"conversion_type": null,
			"data_type": "VARCHAR UTF8",
			"datetime_precision": null,
			"numeric_precision": null,
			"numeric_scale": null
		}
	],
	"functional_suffix_id": "",
	"functional_suffix_name": "Default of HR_RS_ORDER_KK",
	"hub_id": "H_SALE_NO_CUSTOMER",
	"satellite_comment": "",
	"satellite_id": "S_SALE_NO_CUSTOMER_S_ROAD_R_HR_RS_ORDER_KK",
	"satellite_is_prototype": false,
	"satellite_subject_area_name": "Sale",
	"staging_resource_id": "HR_RS_ORDER_KK",
	"staging_table_id": "STAGING.ROAD_R_HR_RS_ORDER_KK",
	"system_id": "ROAD"
}