{
	"business_key_prefix": "",
	"business_key_short": "KUNDEID",
	"column_ids": [
		{
			"column_id": "STAGING.SR_R_ROADSHOW_ORDERS_CUSTOMER.KUNDEID",
			"column_order": 1
		}
	],
	"datavault_category_id": "business_vault",
	"hub_id": "H_CUSTOMER",
	"hub_load_display_name": "Softrule: ROADSHOW ORDERS CUSTOMER (KUNDEID)",
	"hub_load_id": "H_CUSTOMER_S_SR_R_ROADSHOW_ORDERS_CUSTOMER",
	"keys_are_prehashed": false,
	"keys_are_unique": false,
	"staging_table_id": "STAGING.SR_R_ROADSHOW_ORDERS_CUSTOMER",
	"system_id": "SR",
	"system_name": "Softrule"
}