{
	"businessobject_comment": "",
	"businessobject_display_name": "On_Time_Delivery > ref > scd",
	"businessobject_dropdown_entry_string": "On_Time_Delivery - scd",
	"businessobject_elements": [
		{
			"columns": [
				{
					"column_comment": "",
					"column_id": "DATAVAULT.S_ON_TIME_DELIVERY_S_REF_R_HR_HREF_ON_TIME_DELIVERY_H.Anzahl Tage von",
					"column_name": "Anzahl Tage von",
					"column_name_detail": "",
					"column_nq_id": "Anzahl Tage von",
					"column_order": 1,
					"column_orig_name": "Anzahl Tage von",
					"complete_data_type": "VARCHAR(2000000) UTF8",
					"conversion_type": null
				},
				{
					"column_comment": "",
					"column_id": "DATAVAULT.S_ON_TIME_DELIVERY_S_REF_R_HR_HREF_ON_TIME_DELIVERY_H.Anzahl Tage bis",
					"column_name": "Anzahl Tage bis",
					"column_name_detail": "",
					"column_nq_id": "Anzahl Tage bis",
					"column_order": 2,
					"column_orig_name": "Anzahl Tage bis",
					"complete_data_type": "VARCHAR(2000000) UTF8",
					"conversion_type": null
				},
				{
					"column_comment": "",
					"column_id": "DATAVAULT.S_ON_TIME_DELIVERY_S_REF_R_HR_HREF_ON_TIME_DELIVERY_H.Bezeichnung",
					"column_name": "Bezeichnung",
					"column_name_detail": "",
					"column_nq_id": "Bezeichnung",
					"column_order": 3,
					"column_orig_name": "Bezeichnung",
					"complete_data_type": "VARCHAR(2000000) UTF8",
					"conversion_type": null
				},
				{
					"column_comment": "",
					"column_id": "DATAVAULT.S_ON_TIME_DELIVERY_S_REF_R_HR_HREF_ON_TIME_DELIVERY_H.Bewertung",
					"column_name": "Bewertung",
					"column_name_detail": "",
					"column_nq_id": "Bewertung",
					"column_order": 4,
					"column_orig_name": "Bewertung",
					"complete_data_type": "VARCHAR(2000000) UTF8",
					"conversion_type": null
				},
				{
					"column_comment": "Load Time Satellite On_Time_Delivery > ref > Default of HR_HREF_ON_TIME_DELIVERY",
					"column_id": "DATAVAULT.S_ON_TIME_DELIVERY_S_REF_R_HR_HREF_ON_TIME_DELIVERY_H.ON_TIME_DELIVERY_S_REF_R_HR_HREF_ON_TIME_DELIVERY_LTH",
					"column_name": "ON_TIME_DELIVERY_LTS",
					"column_name_detail": "ON_TIME_DELIVERY_S_REF_R_HR_HREF_ON_TIME_DELIVERY_LTH",
					"column_nq_id": "ON_TIME_DELIVERY_S_REF_R_HR_HREF_ON_TIME_DELIVERY_LTH",
					"column_order": 7,
					"column_orig_name": "LTS On_Time_Delivery - ref - Default of HR_HREF_ON_TIME_DELIVERY",
					"complete_data_type": "TIMESTAMP",
					"conversion_type": null
				}
			],
			"path_id": "{\"businessobject_path\":{\"hubs\":[{\"hub_id\":\"H_ON_TIME_DELIVERY\",\"satellites\":[{\"satellite_id\":\"S_ON_TIME_DELIVERY_S_REF_R_HR_HREF_ON_TIME_DELIVERY\"}]}]}}"
		},
		{
			"columns": [
				{
					"column_comment": "Business Key for Hub On_Time_Delivery",
					"column_id": "DATAVAULT.H_ON_TIME_DELIVERY.ON_TIME_DELIVERY_BK",
					"column_name": "ON_TIME_DELIVERY_BK",
					"column_name_detail": "ON_TIME_DELIVERY_BK",
					"column_nq_id": "ON_TIME_DELIVERY_BK",
					"column_order": 5,
					"column_orig_name": "ON_TIME_DELIVERY_BK",
					"conversion_type": null
				},
				{
					"column_comment": "",
					"column_id": "DATAVAULT.H_ON_TIME_DELIVERY.ON_TIME_DELIVERY_H",
					"column_name": "ON_TIME_DELIVERY_H",
					"column_name_detail": "ON_TIME_DELIVERY_H",
					"column_nq_id": "ON_TIME_DELIVERY_H",
					"column_order": 6,
					"column_orig_name": "ON_TIME_DELIVERY_H",
					"conversion_type": null
				},
				{
					"column_comment": "",
					"column_id": "BUSINESSOBJECTS.ON_TIME_DELIVERY_S_REF_C_SCD_H.ON_TIME_DELIVERY_S_REF_C_SCD_H_LT",
					"column_name": "ON_TIME_DELIVERY_S_REF_C_SCD_H_LT",
					"column_name_detail": "ON_TIME_DELIVERY_S_REF_C_SCD_H_LT",
					"column_nq_id": "ON_TIME_DELIVERY_S_REF_C_SCD_H_LT",
					"column_order": 8,
					"column_orig_name": "ON_TIME_DELIVERY_S_REF_C_SCD_H_LT",
					"conversion_type": null
				},
				{
					"column_comment": "",
					"column_id": "BUSINESSOBJECTS.ON_TIME_DELIVERY_S_REF_C_SCD_H.ON_TIME_DELIVERY_S_REF_C_SCD_H_LT_END",
					"column_name": "ON_TIME_DELIVERY_S_REF_C_SCD_H_LT_END",
					"column_name_detail": "ON_TIME_DELIVERY_S_REF_C_SCD_H_LT_END",
					"column_nq_id": "ON_TIME_DELIVERY_S_REF_C_SCD_H_LT_END",
					"column_order": 9,
					"column_orig_name": "ON_TIME_DELIVERY_S_REF_C_SCD_H_LT_END",
					"conversion_type": null
				},
				{
					"column_comment": "",
					"column_id": "BUSINESSOBJECTS.ON_TIME_DELIVERY_S_REF_C_SCD_H.ON_TIME_DELIVERY_S_REF_C_SCD_H_BKLT",
					"column_name": "ON_TIME_DELIVERY_S_REF_C_SCD_H_BKLT",
					"column_name_detail": "ON_TIME_DELIVERY_S_REF_C_SCD_H_BKLT",
					"column_nq_id": "ON_TIME_DELIVERY_S_REF_C_SCD_H_BKLT",
					"column_order": 10,
					"column_orig_name": "ON_TIME_DELIVERY_S_REF_C_SCD_H_BKLT",
					"conversion_type": null
				},
				{
					"column_comment": "Full Load Valid Hub On_Time_Delivery > ref > Hr Href on_time_delivery",
					"column_id": "DATAVAULT.S_ON_TIME_DELIVERY_S_REF_R_HR_HREF_ON_TIME_DELIVERY_W_TRKF_H.ON_TIME_DELIVERY_S_REF_R_HR_HREF_ON_TIME_DELIVERY_W_TRKF_VH",
					"column_name": "FV_ON_TIME_DELIVERY",
					"column_name_detail": "ON_TIME_DELIVERY_S_REF_R_HR_HREF_ON_TIME_DELIVERY_W_TRKF_VH",
					"column_nq_id": "ON_TIME_DELIVERY_S_REF_R_HR_HREF_ON_TIME_DELIVERY_W_TRKF_VH",
					"column_order": 11,
					"column_orig_name": "FV_ON_TIME_DELIVERY",
					"conversion_type": null
				},
				{
					"column_comment": "Full Load Last Validity Change Time Hub On_Time_Delivery > ref > Hr Href on_time_delivery",
					"column_id": "DATAVAULT.S_ON_TIME_DELIVERY_S_REF_R_HR_HREF_ON_TIME_DELIVERY_W_TRKF_H.ON_TIME_DELIVERY_S_REF_R_HR_HREF_ON_TIME_DELIVERY_W_TRKF_LTH",
					"column_name": "FLVC_ON_TIME_DELIVERY",
					"column_name_detail": "ON_TIME_DELIVERY_S_REF_R_HR_HREF_ON_TIME_DELIVERY_W_TRKF_LTH",
					"column_nq_id": "ON_TIME_DELIVERY_S_REF_R_HR_HREF_ON_TIME_DELIVERY_W_TRKF_LTH",
					"column_order": 12,
					"column_orig_name": "FLVC_ON_TIME_DELIVERY",
					"conversion_type": null
				}
			],
			"path_id": "{\"businessobject_path\":{\"hubs\":[{\"hub_id\":\"H_ON_TIME_DELIVERY\"}]}}"
		}
	],
	"businessobject_set_id": "businessobject_set_H_ON_TIME_DELIVERY_C_SCD",
	"businessobject_structure": null,
	"businessobject_view_id": "BUSINESSOBJECTS.ON_TIME_DELIVERY_S_REF_C_SCD_H",
	"dependent_objects": [
		{
			"object_id": "BUSINESSOBJECTS_PITS.P_ON_TIME_DELIVERY",
			"object_type": "unknown_object"
		},
		{
			"object_id": "S_ON_TIME_DELIVERY_S_REF_R_HR_HREF_ON_TIME_DELIVERY",
			"object_type": "satellite"
		}
	],
	"granularity_satellite_id": "S_ON_TIME_DELIVERY_S_REF_R_HR_HREF_ON_TIME_DELIVERY",
	"scd_type": 2,
	"system_id": "REF",
	"system_name": "ref"
}