{
	"columns": [
		{
			"column_comment": null,
			"column_id": "STAGING.WEB_R_HR_WEB_PRODUCT_CATEGORY.KATID",
			"column_name": "KATID",
			"column_order": 1,
			"complete_data_type": "VARCHAR(2000000) UTF8",
			"jdbc_data_type": {
				"character_maximum_length": 2000000,
				"data_type_name": "VARCHAR UTF8",
				"jdbc_data_type_id": 12,
				"numeric_precision": null,
				"numeric_scale": null
			}
		},
		{
			"column_comment": null,
			"column_id": "STAGING.WEB_R_HR_WEB_PRODUCT_CATEGORY.NAME",
			"column_name": "NAME",
			"column_order": 3,
			"complete_data_type": "VARCHAR(2000000) UTF8",
			"jdbc_data_type": {
				"character_maximum_length": 2000000,
				"data_type_name": "VARCHAR UTF8",
				"jdbc_data_type_id": 12,
				"numeric_precision": null,
				"numeric_scale": null
			}
		},
		{
			"column_comment": null,
			"column_id": "STAGING.WEB_R_HR_WEB_PRODUCT_CATEGORY.OBERKATID",
			"column_name": "OBERKATID",
			"column_order": 2,
			"complete_data_type": "VARCHAR(2000000) UTF8",
			"jdbc_data_type": {
				"character_maximum_length": 2000000,
				"data_type_name": "VARCHAR UTF8",
				"jdbc_data_type_id": 12,
				"numeric_precision": null,
				"numeric_scale": null
			}
		}
	],
	"loading_batch_size": 50000,
	"source_query_customized": null,
	"source_schema_name": "DBT_WILLIBALD_Q3_HR",
	"source_schema_or_system_id": null,
	"source_table_id": "DBT_WILLIBALD_Q3_HR.HR_WEB_PRODUCT_CATEGORY",
	"source_table_name": "HR_WEB_PRODUCT_CATEGORY",
	"source_table_staging_id": "HR_WEB_PRODUCT_CATEGORY",
	"source_table_type_id": "VIEW",
	"staging_table_comment": null,
	"staging_table_display_string": "Hr Web Product Category [WEB_R_HR_WEB_PRODUCT_CATEGORY]",
	"staging_table_id": "STAGING.WEB_R_HR_WEB_PRODUCT_CATEGORY",
	"staging_table_name": "Hr Web Product Category",
	"system_id": "WEB",
	"where_clause_delta_part_template": null,
	"where_clause_general_part": null
}