{
	"columns": [
		{
			"column_comment": null,
			"column_id": "STAGING.ROAD_R_HR_RS_POSITION_MK.BESTELLUNGID",
			"column_name": "BESTELLUNGID",
			"column_order": 1,
			"complete_data_type": "VARCHAR(16777216)",
			"jdbc_data_type": {
				"character_maximum_length": 2000000,
				"data_type_name": "VARCHAR",
				"jdbc_data_type_id": 12,
				"numeric_precision": null,
				"numeric_scale": null
			}
		},
		{
			"column_comment": null,
			"column_id": "STAGING.ROAD_R_HR_RS_POSITION_MK.KAUFDATUM",
			"column_name": "KAUFDATUM",
			"column_order": 5,
			"complete_data_type": "VARCHAR(16777216)",
			"jdbc_data_type": {
				"character_maximum_length": 2000000,
				"data_type_name": "VARCHAR",
				"jdbc_data_type_id": 12,
				"numeric_precision": null,
				"numeric_scale": null
			}
		},
		{
			"column_comment": null,
			"column_id": "STAGING.ROAD_R_HR_RS_POSITION_MK.KUNDEID",
			"column_name": "KUNDEID",
			"column_order": 2,
			"complete_data_type": "DECIMAL(18,0)",
			"jdbc_data_type": {
				"character_maximum_length": 18,
				"data_type_name": "DECIMAL",
				"jdbc_data_type_id": 2,
				"numeric_precision": 18,
				"numeric_scale": 0
			}
		},
		{
			"column_comment": null,
			"column_id": "STAGING.ROAD_R_HR_RS_POSITION_MK.MENGE",
			"column_name": "MENGE",
			"column_order": 6,
			"complete_data_type": "DECIMAL(18,0)",
			"jdbc_data_type": {
				"character_maximum_length": 18,
				"data_type_name": "DECIMAL",
				"jdbc_data_type_id": 2,
				"numeric_precision": 18,
				"numeric_scale": 0
			}
		},
		{
			"column_comment": null,
			"column_id": "STAGING.ROAD_R_HR_RS_POSITION_MK.PREIS",
			"column_name": "PREIS",
			"column_order": 7,
			"complete_data_type": "DECIMAL(18,2)",
			"jdbc_data_type": {
				"character_maximum_length": 18,
				"data_type_name": "DECIMAL",
				"jdbc_data_type_id": 2,
				"numeric_precision": 18,
				"numeric_scale": 2
			}
		},
		{
			"column_comment": null,
			"column_id": "STAGING.ROAD_R_HR_RS_POSITION_MK.PRODUKTID",
			"column_name": "PRODUKTID",
			"column_order": 4,
			"complete_data_type": "DECIMAL(18,0)",
			"jdbc_data_type": {
				"character_maximum_length": 18,
				"data_type_name": "DECIMAL",
				"jdbc_data_type_id": 2,
				"numeric_precision": 18,
				"numeric_scale": 0
			}
		},
		{
			"column_comment": null,
			"column_id": "STAGING.ROAD_R_HR_RS_POSITION_MK.RABATT",
			"column_name": "RABATT",
			"column_order": 8,
			"complete_data_type": "DECIMAL(18,2)",
			"jdbc_data_type": {
				"character_maximum_length": 18,
				"data_type_name": "DECIMAL",
				"jdbc_data_type_id": 2,
				"numeric_precision": 18,
				"numeric_scale": 2
			}
		},
		{
			"column_comment": null,
			"column_id": "STAGING.ROAD_R_HR_RS_POSITION_MK.VEREINSPARTNERID",
			"column_name": "VEREINSPARTNERID",
			"column_order": 3,
			"complete_data_type": "VARCHAR(16777216)",
			"jdbc_data_type": {
				"character_maximum_length": 2000000,
				"data_type_name": "VARCHAR",
				"jdbc_data_type_id": 12,
				"numeric_precision": null,
				"numeric_scale": null
			}
		}
	],
	"loading_batch_size": 50000,
	"source_query_customized": null,
	"source_schema_name": "DBT_WILLIBALD_Q3_HR",
	"source_schema_or_system_id": null,
	"source_table_id": "DBT_WILLIBALD_Q3_HR.HR_RS_POSITION_MK",
	"source_table_name": "HR_RS_POSITION_MK",
	"source_table_staging_id": "HR_RS_POSITION_MK",
	"source_table_type_id": "VIEW",
	"staging_table_comment": null,
	"staging_table_display_string": "Hr Rs Position Mk [ROAD_R_HR_RS_POSITION_MK]",
	"staging_table_id": "STAGING.ROAD_R_HR_RS_POSITION_MK",
	"staging_table_name": "Hr Rs Position Mk",
	"system_id": "ROAD",
	"where_clause_delta_part_template": null,
	"where_clause_general_part": null
}