{
	"columns": [
		{
			"column_comment": null,
			"column_id": "STAGING.WEB_R_HR_WEB_CLUB_PARTNER.KUNDEIDVEREIN",
			"column_name": "KUNDEIDVEREIN",
			"column_order": 2,
			"complete_data_type": "DECIMAL(18,0)",
			"jdbc_data_type": {
				"character_maximum_length": 18,
				"data_type_name": "DECIMAL",
				"jdbc_data_type_id": 2,
				"numeric_precision": 18,
				"numeric_scale": 0
			}
		},
		{
			"column_comment": null,
			"column_id": "STAGING.WEB_R_HR_WEB_CLUB_PARTNER.RABATT1",
			"column_name": "RABATT1",
			"column_order": 3,
			"complete_data_type": "DECIMAL(18,0)",
			"jdbc_data_type": {
				"character_maximum_length": 18,
				"data_type_name": "DECIMAL",
				"jdbc_data_type_id": 2,
				"numeric_precision": 18,
				"numeric_scale": 0
			}
		},
		{
			"column_comment": null,
			"column_id": "STAGING.WEB_R_HR_WEB_CLUB_PARTNER.RABATT2",
			"column_name": "RABATT2",
			"column_order": 4,
			"complete_data_type": "DECIMAL(18,0)",
			"jdbc_data_type": {
				"character_maximum_length": 18,
				"data_type_name": "DECIMAL",
				"jdbc_data_type_id": 2,
				"numeric_precision": 18,
				"numeric_scale": 0
			}
		},
		{
			"column_comment": null,
			"column_id": "STAGING.WEB_R_HR_WEB_CLUB_PARTNER.RABATT3",
			"column_name": "RABATT3",
			"column_order": 5,
			"complete_data_type": "DECIMAL(18,0)",
			"jdbc_data_type": {
				"character_maximum_length": 18,
				"data_type_name": "DECIMAL",
				"jdbc_data_type_id": 2,
				"numeric_precision": 18,
				"numeric_scale": 0
			}
		},
		{
			"column_comment": null,
			"column_id": "STAGING.WEB_R_HR_WEB_CLUB_PARTNER.VEREINSPARTNERID",
			"column_name": "VEREINSPARTNERID",
			"column_order": 1,
			"complete_data_type": "VARCHAR(2000000) UTF8",
			"jdbc_data_type": {
				"character_maximum_length": 2000000,
				"data_type_name": "VARCHAR UTF8",
				"jdbc_data_type_id": 12,
				"numeric_precision": null,
				"numeric_scale": null
			}
		}
	],
	"loading_batch_size": 50000,
	"source_query_customized": null,
	"source_schema_name": "DBT_WILLIBALD_Q3_HR",
	"source_schema_or_system_id": null,
	"source_table_id": "DBT_WILLIBALD_Q3_HR.HR_WEB_CLUB_PARTNER",
	"source_table_name": "HR_WEB_CLUB_PARTNER",
	"source_table_staging_id": "HR_WEB_CLUB_PARTNER",
	"source_table_type_id": "VIEW",
	"staging_table_comment": null,
	"staging_table_display_string": "Hr Web Club Partner [WEB_R_HR_WEB_CLUB_PARTNER]",
	"staging_table_id": "STAGING.WEB_R_HR_WEB_CLUB_PARTNER",
	"staging_table_name": "Hr Web Club Partner",
	"system_id": "WEB",
	"where_clause_delta_part_template": null,
	"where_clause_general_part": null
}