{
	"column_ids": [
		{
			"character_maximum_length": 18,
			"column_comment": "",
			"column_id": "DATAVAULT.S_ADDRESS_OF_RESIDENCE_S_WEB_R_HR_WEB_ADDRESS_RESIDENCE_H.KUNDEID",
			"column_is_used": true,
			"column_name": "KUNDEID",
			"column_name_detail": "",
			"column_nq_id": "KUNDEID",
			"column_order": 1,
			"column_type": "attribute",
			"complete_data_type": "DECIMAL(18,0)",
			"conversion_type": null,
			"data_type": "DECIMAL",
			"datetime_precision": null,
			"numeric_precision": 18,
			"numeric_scale": 0
		},
		{
			"character_maximum_length": 2000000,
			"column_comment": "",
			"column_id": "DATAVAULT.S_ADDRESS_OF_RESIDENCE_S_WEB_R_HR_WEB_ADDRESS_RESIDENCE_H.VON",
			"column_is_used": true,
			"column_name": "VON",
			"column_name_detail": "",
			"column_nq_id": "VON",
			"column_order": 2,
			"column_type": "attribute",
			"complete_data_type": "VARCHAR(2000000) UTF8",
			"conversion_type": null,
			"data_type": "VARCHAR UTF8",
			"datetime_precision": null,
			"numeric_precision": null,
			"numeric_scale": null
		},
		{
			"character_maximum_length": 2000000,
			"column_comment": "",
			"column_id": "DATAVAULT.S_ADDRESS_OF_RESIDENCE_S_WEB_R_HR_WEB_ADDRESS_RESIDENCE_H.BIS",
			"column_is_used": true,
			"column_name": "BIS",
			"column_name_detail": "",
			"column_nq_id": "BIS",
			"column_order": 3,
			"column_type": "attribute",
			"complete_data_type": "VARCHAR(2000000) UTF8",
			"conversion_type": null,
			"data_type": "VARCHAR UTF8",
			"datetime_precision": null,
			"numeric_precision": null,
			"numeric_scale": null
		},
		{
			"character_maximum_length": 2000000,
			"column_comment": "",
			"column_id": "DATAVAULT.S_ADDRESS_OF_RESIDENCE_S_WEB_R_HR_WEB_ADDRESS_RESIDENCE_H.STRASSE",
			"column_is_used": true,
			"column_name": "STRASSE",
			"column_name_detail": "",
			"column_nq_id": "STRASSE",
			"column_order": 4,
			"column_type": "attribute",
			"complete_data_type": "VARCHAR(2000000) UTF8",
			"conversion_type": null,
			"data_type": "VARCHAR UTF8",
			"datetime_precision": null,
			"numeric_precision": null,
			"numeric_scale": null
		},
		{
			"character_maximum_length": 2000000,
			"column_comment": "",
			"column_id": "DATAVAULT.S_ADDRESS_OF_RESIDENCE_S_WEB_R_HR_WEB_ADDRESS_RESIDENCE_H.HAUSNUMMER",
			"column_is_used": true,
			"column_name": "HAUSNUMMER",
			"column_name_detail": "",
			"column_nq_id": "HAUSNUMMER",
			"column_order": 5,
			"column_type": "attribute",
			"complete_data_type": "VARCHAR(2000000) UTF8",
			"conversion_type": null,
			"data_type": "VARCHAR UTF8",
			"datetime_precision": null,
			"numeric_precision": null,
			"numeric_scale": null
		},
		{
			"character_maximum_length": 2000000,
			"column_comment": "",
			"column_id": "DATAVAULT.S_ADDRESS_OF_RESIDENCE_S_WEB_R_HR_WEB_ADDRESS_RESIDENCE_H.ADRESSZUSATZ",
			"column_is_used": true,
			"column_name": "ADRESSZUSATZ",
			"column_name_detail": "",
			"column_nq_id": "ADRESSZUSATZ",
			"column_order": 6,
			"column_type": "attribute",
			"complete_data_type": "VARCHAR(2000000) UTF8",
			"conversion_type": null,
			"data_type": "VARCHAR UTF8",
			"datetime_precision": null,
			"numeric_precision": null,
			"numeric_scale": null
		},
		{
			"character_maximum_length": 18,
			"column_comment": "",
			"column_id": "DATAVAULT.S_ADDRESS_OF_RESIDENCE_S_WEB_R_HR_WEB_ADDRESS_RESIDENCE_H.PLZ",
			"column_is_used": true,
			"column_name": "PLZ",
			"column_name_detail": "",
			"column_nq_id": "PLZ",
			"column_order": 7,
			"column_type": "attribute",
			"complete_data_type": "DECIMAL(18,0)",
			"conversion_type": null,
			"data_type": "DECIMAL",
			"datetime_precision": null,
			"numeric_precision": 18,
			"numeric_scale": 0
		},
		{
			"character_maximum_length": 2000000,
			"column_comment": "",
			"column_id": "DATAVAULT.S_ADDRESS_OF_RESIDENCE_S_WEB_R_HR_WEB_ADDRESS_RESIDENCE_H.ORT",
			"column_is_used": true,
			"column_name": "ORT",
			"column_name_detail": "",
			"column_nq_id": "ORT",
			"column_order": 8,
			"column_type": "attribute",
			"complete_data_type": "VARCHAR(2000000) UTF8",
			"conversion_type": null,
			"data_type": "VARCHAR UTF8",
			"datetime_precision": null,
			"numeric_precision": null,
			"numeric_scale": null
		},
		{
			"character_maximum_length": 18,
			"column_comment": "",
			"column_id": "DATAVAULT.S_ADDRESS_OF_RESIDENCE_S_WEB_R_HR_WEB_ADDRESS_RESIDENCE_H.LAND",
			"column_is_used": true,
			"column_name": "LAND",
			"column_name_detail": "",
			"column_nq_id": "LAND",
			"column_order": 9,
			"column_type": "attribute",
			"complete_data_type": "DECIMAL(18,0)",
			"conversion_type": null,
			"data_type": "DECIMAL",
			"datetime_precision": null,
			"numeric_precision": 18,
			"numeric_scale": 0
		}
	],
	"functional_suffix_id": "",
	"functional_suffix_name": "Default of HR_WEB_ADDRESS_RESIDENCE",
	"hub_id": "H_ADDRESS_OF_RESIDENCE",
	"satellite_comment": "",
	"satellite_id": "S_ADDRESS_OF_RESIDENCE_S_WEB_R_HR_WEB_ADDRESS_RESIDENCE",
	"satellite_is_prototype": false,
	"satellite_subject_area_name": "CRM",
	"staging_resource_id": "HR_WEB_ADDRESS_RESIDENCE",
	"staging_table_id": "STAGING.WEB_R_HR_WEB_ADDRESS_RESIDENCE",
	"system_id": "WEB"
}