{
	"business_key_prefix": "",
	"business_key_short": "KUNDEID",
	"column_ids": [
		{
			"column_id": "STAGING.WEB_R_HR_WEB_ADDRESS_RESIDENCE.KUNDEID",
			"column_order": 1
		}
	],
	"datavault_category_id": "raw_vault",
	"hub_id": "H_CUSTOMER",
	"hub_load_display_name": "web: HR WEB ADDRESS RESIDENCE (KUNDEID)",
	"hub_load_id": "H_CUSTOMER_S_WEB_R_HR_WEB_ADDRESS_RESIDENCE",
	"keys_are_prehashed": false,
	"keys_are_unique": false,
	"staging_table_id": "STAGING.WEB_R_HR_WEB_ADDRESS_RESIDENCE",
	"system_id": "WEB",
	"system_name": "web"
}