{
	"businessobject_set_display_name": "Customer > SCD_2",
	"businessobject_set_id": "businessobject_set_H_CUSTOMER_C_SCD2",
	"functional_suffix_id": "SCD2",
	"functional_suffix_name": "SCD_2",
	"start_hub_id": "H_CUSTOMER",
	"start_hub_name": "Customer"
}