{
	"link_id": "L_ORDER_T_CUSTOMER",
	"link_load_display_name": "Order > web: HR WEB ORDER (BESTELLUNGID) TO Customer > web: HR WEB ORDER (KUNDEID)",
	"link_load_id": "L_ORDER_T_CUSTOMER_S_WEB_R_HR_WEB_ORDER",
	"staging_table_id": "STAGING.WEB_R_HR_WEB_ORDER",
	"system_id": "WEB"
}