{
	"accesslayer_priorization": 1,
	"additional_deployment_parameters": {
		"business_ruleset_hierarchy_level": 0
	},
	"alias_schema_id": null,
	"alias_view_nq_id": null,
	"business_rules_view_code": "Derived from column_nq_ids",
	"business_ruleset_comment": null,
	"business_ruleset_name": "Unaltered default",
	"business_ruleset_order": 1,
	"business_ruleset_suffix_id": null,
	"business_ruleset_view_id": "BUSINESS_RULES.DELIVERY_ADDRESS_S_DVB_HUB",
	"column_nq_ids": [
		"ADRESSZUSATZ",
		"DELIVERY_ADDRESS_BK",
		"DELIVERY_ADDRESS_H",
		"FLVC_DELIVERY_ADDRESS",
		"FV_DELIVERY_ADDRESS",
		"HAUSNUMMER",
		"KUNDEID",
		"LAND",
		"LIEFERADRID",
		"ORT",
		"PLZ",
		"STRASSE"
	],
	"container_id": "H_DELIVERY_ADDRESS_C_dvb_default",
	"dependent_objects": [
		{
			"object_id": "BUSINESSOBJECTS.DELIVERY_ADDRESS_S_DVB_HUB",
			"object_type": "business_object"
		}
	],
	"include_in_accesslayer": false,
	"is_error_ruleset": false,
	"is_unaltered_business_ruleset": true,
	"quick_inserts": {
		"quick_insert_list": [
			{
				"quick_insert_table_id": "BUSINESSOBJECTS.DELIVERY_ADDRESS_S_DVB_HUB"
			}
		]
	},
	"system_id": "DVB_HUB"
}