{
	"job_comment": "Automatically created job on system creation",
	"job_enabled": true,
	"job_id": "ROAD_J_DEFAULT",
	"job_loads": [
	],
	"job_name": "Default",
	"job_sql_queries": [
	],
	"job_suffix_id": "DEFAULT",
	"job_type": "auto",
	"parallel_loads": -1,
	"system_id": "ROAD"
}