{
	"hub_a_id": "H_SALE_ITEM_NO_CUSTOMER",
	"hub_b_id": "H_SALE_NO_CUSTOMER",
	"link_comment": "describes Sale without Details about the Customer",
	"link_id": "L_SALE_ITEM_NO_CUSTOMER_T_SALE_NO_CUSTOMER",
	"link_subject_area_name": "Sale_no_customer",
	"link_suffix_id": null,
	"link_suffix_name": "",
	"link_type": "many_to_one"
}