{
	"business_rules_businessobject_container_display_name": "Delivery_Address",
	"business_rules_businessobject_container_id": "H_DELIVERY_ADDRESS_C_dvb_default",
	"business_rules_businessobject_container_order": 8,
	"business_rules_businessobject_systems": [
		{
			"related_businessobject_view_id": "BUSINESSOBJECTS.DELIVERY_ADDRESS_S_DVB_HUB",
			"system_id": "DVB_HUB",
			"system_order": 1
		},
		{
			"related_businessobject_view_id": "BUSINESSOBJECTS.DELIVERY_ADDRESS_S_WEB",
			"system_id": "WEB",
			"system_order": 2
		}
	]
}