{
	"business_key_prefix": "",
	"business_key_short": "PRODUKTID",
	"column_ids": [
		{
			"column_id": "STAGING.WEB_R_HR_WEB_PRODUCT.PRODUKTID",
			"column_order": 1
		}
	],
	"datavault_category_id": "raw_vault",
	"hub_id": "H_PRODUCT",
	"hub_load_display_name": "web: HR WEB PRODUCT (PRODUKTID)",
	"hub_load_id": "H_PRODUCT_S_WEB_R_HR_WEB_PRODUCT",
	"keys_are_prehashed": false,
	"keys_are_unique": true,
	"staging_table_id": "STAGING.WEB_R_HR_WEB_PRODUCT",
	"system_id": "WEB",
	"system_name": "web"
}