{
	"business_rules_businessobject_container_display_name": "On_Time_Delivery - scd",
	"business_rules_businessobject_container_id": "H_ON_TIME_DELIVERY_C_SCD",
	"business_rules_businessobject_container_order": 10,
	"business_rules_businessobject_systems": [
		{
			"related_businessobject_view_id": "BUSINESSOBJECTS.ON_TIME_DELIVERY_S_REF_C_SCD_H",
			"system_id": "REF",
			"system_order": 1
		}
	]
}