{
	"businessobject_comment": "",
	"businessobject_display_name": "Product_Category > web > Default",
	"businessobject_dropdown_entry_string": "Product_Category",
	"businessobject_elements": [
		{
			"columns": [
				{
					"column_comment": "",
					"column_id": "DATAVAULT.H_PRODUCT_CATEGORY.PRODUCT_CATEGORY_H",
					"column_name": "PRODUCT_CATEGORY_H",
					"column_name_detail": "PRODUCT_CATEGORY_H",
					"column_nq_id": "PRODUCT_CATEGORY_H",
					"column_order": 1,
					"column_orig_name": "PRODUCT_CATEGORY_H",
					"conversion_type": null
				},
				{
					"column_comment": "Business Key for Hub Product_Category",
					"column_id": "DATAVAULT.H_PRODUCT_CATEGORY.PRODUCT_CATEGORY_BK",
					"column_name": "PRODUCT_CATEGORY_BK",
					"column_name_detail": "PRODUCT_CATEGORY_BK",
					"column_nq_id": "PRODUCT_CATEGORY_BK",
					"column_order": 2,
					"column_orig_name": "PRODUCT_CATEGORY_BK",
					"conversion_type": null
				},
				{
					"column_comment": "Full Load Valid Hub Product_Category > web > Hr Web PRODUCT_CATEGORY",
					"column_id": "DATAVAULT.S_PRODUCT_CATEGORY_S_WEB_R_HR_WEB_PRODUCT_CATEGORY_W_TRKF_C.PRODUCT_CATEGORY_S_WEB_R_HR_WEB_PRODUCT_CATEGORY_W_TRKF_VC",
					"column_name": "FV_PRODUCT_CATEGORY",
					"column_name_detail": "PRODUCT_CATEGORY_S_WEB_R_HR_WEB_PRODUCT_CATEGORY_W_TRKF_VC",
					"column_nq_id": "PRODUCT_CATEGORY_S_WEB_R_HR_WEB_PRODUCT_CATEGORY_W_TRKF_VC",
					"column_order": 6,
					"column_orig_name": "FV_PRODUCT_CATEGORY",
					"conversion_type": null
				},
				{
					"column_comment": "Full Load Last Validity Change Time Hub Product_Category > web > Hr Web PRODUCT_CATEGORY",
					"column_id": "DATAVAULT.S_PRODUCT_CATEGORY_S_WEB_R_HR_WEB_PRODUCT_CATEGORY_W_TRKF_C.PRODUCT_CATEGORY_S_WEB_R_HR_WEB_PRODUCT_CATEGORY_W_TRKF_LTC",
					"column_name": "FLVC_PRODUCT_CATEGORY",
					"column_name_detail": "PRODUCT_CATEGORY_S_WEB_R_HR_WEB_PRODUCT_CATEGORY_W_TRKF_LTC",
					"column_nq_id": "PRODUCT_CATEGORY_S_WEB_R_HR_WEB_PRODUCT_CATEGORY_W_TRKF_LTC",
					"column_order": 7,
					"column_orig_name": "FLVC_PRODUCT_CATEGORY",
					"conversion_type": null
				}
			],
			"path_id": "{\"businessobject_path\":{\"hubs\":[{\"hub_id\":\"H_PRODUCT_CATEGORY\"}]}}"
		},
		{
			"columns": [
				{
					"column_comment": "",
					"column_id": "DATAVAULT.S_PRODUCT_CATEGORY_S_WEB_R_HR_WEB_PRODUCT_CATEGORY_C.KATID",
					"column_name": "KATID",
					"column_name_detail": "",
					"column_nq_id": "KATID",
					"column_order": 3,
					"column_orig_name": "KATID",
					"complete_data_type": "VARCHAR(16777216)",
					"conversion_type": null
				},
				{
					"column_comment": "",
					"column_id": "DATAVAULT.S_PRODUCT_CATEGORY_S_WEB_R_HR_WEB_PRODUCT_CATEGORY_C.OBERKATID",
					"column_name": "OBERKATID",
					"column_name_detail": "",
					"column_nq_id": "OBERKATID",
					"column_order": 4,
					"column_orig_name": "OBERKATID",
					"complete_data_type": "VARCHAR(16777216)",
					"conversion_type": null
				},
				{
					"column_comment": "",
					"column_id": "DATAVAULT.S_PRODUCT_CATEGORY_S_WEB_R_HR_WEB_PRODUCT_CATEGORY_C.NAME",
					"column_name": "NAME",
					"column_name_detail": "",
					"column_nq_id": "NAME",
					"column_order": 5,
					"column_orig_name": "NAME",
					"complete_data_type": "VARCHAR(16777216)",
					"conversion_type": null
				}
			],
			"path_id": "{\"businessobject_path\":{\"hubs\":[{\"hub_id\":\"H_PRODUCT_CATEGORY\",\"satellites\":[{\"satellite_id\":\"S_PRODUCT_CATEGORY_S_WEB_R_HR_WEB_PRODUCT_CATEGORY\"}]}]}}"
		}
	],
	"businessobject_set_id": "businessobject_set_H_PRODUCT_CATEGORY",
	"businessobject_structure": null,
	"businessobject_view_id": "BUSINESSOBJECTS.PRODUCT_CATEGORY_S_WEB",
	"dependent_objects": [
		{
			"object_id": "H_PRODUCT_CATEGORY",
			"object_type": "hub"
		},
		{
			"object_id": "S_PRODUCT_CATEGORY_S_WEB_R_HR_WEB_PRODUCT_CATEGORY",
			"object_type": "satellite"
		},
		{
			"object_id": "no_pits",
			"object_type": "unknown_object"
		}
	],
	"granularity_satellite_id": "S_PRODUCT_CATEGORY_S_WEB_R_HR_WEB_PRODUCT_CATEGORY",
	"scd_type": 1,
	"system_id": "WEB",
	"system_name": "web"
}