{
	"business_rules_businessobject_container_display_name": "Order - SCD2",
	"business_rules_businessobject_container_id": "H_ORDER_C_SCD2",
	"business_rules_businessobject_container_order": 12,
	"business_rules_businessobject_systems": [
		{
			"related_businessobject_view_id": "BUSINESSOBJECTS.ORDER_S_WEB_C_SCD2_H",
			"system_id": "WEB",
			"system_order": 1
		}
	]
}