{
	"businessobject_comment": "",
	"businessobject_display_name": "Customer > web > SCD_2",
	"businessobject_dropdown_entry_string": "Customer - SCD_2",
	"businessobject_elements": [
		{
			"columns": [
				{
					"column_comment": "",
					"column_id": "DATAVAULT.H_CUSTOMER.CUSTOMER_H",
					"column_name": "CUSTOMER_H",
					"column_name_detail": "CUSTOMER_H",
					"column_nq_id": "CUSTOMER_H",
					"column_order": 1,
					"column_orig_name": "CUSTOMER_H",
					"conversion_type": null
				},
				{
					"column_comment": "Business Key for Hub Customer",
					"column_id": "DATAVAULT.H_CUSTOMER.CUSTOMER_BK",
					"column_name": "CUSTOMER_BK",
					"column_name_detail": "CUSTOMER_BK",
					"column_nq_id": "CUSTOMER_BK",
					"column_order": 2,
					"column_orig_name": "CUSTOMER_BK",
					"conversion_type": null
				},
				{
					"column_comment": "",
					"column_id": "BUSINESSOBJECTS.CUSTOMER_S_WEB_C_SCD2_H.CUSTOMER_S_WEB_C_SCD2_H_LT",
					"column_name": "CUSTOMER_S_WEB_C_SCD2_H_LT",
					"column_name_detail": "CUSTOMER_S_WEB_C_SCD2_H_LT",
					"column_nq_id": "CUSTOMER_S_WEB_C_SCD2_H_LT",
					"column_order": 5,
					"column_orig_name": "CUSTOMER_S_WEB_C_SCD2_H_LT",
					"conversion_type": null
				},
				{
					"column_comment": "",
					"column_id": "BUSINESSOBJECTS.CUSTOMER_S_WEB_C_SCD2_H.CUSTOMER_S_WEB_C_SCD2_H_LT_END",
					"column_name": "CUSTOMER_S_WEB_C_SCD2_H_LT_END",
					"column_name_detail": "CUSTOMER_S_WEB_C_SCD2_H_LT_END",
					"column_nq_id": "CUSTOMER_S_WEB_C_SCD2_H_LT_END",
					"column_order": 7,
					"column_orig_name": "CUSTOMER_S_WEB_C_SCD2_H_LT_END",
					"conversion_type": null
				},
				{
					"column_comment": "",
					"column_id": "BUSINESSOBJECTS.CUSTOMER_S_WEB_C_SCD2_H.CUSTOMER_S_WEB_C_SCD2_H_BKLT",
					"column_name": "CUSTOMER_S_WEB_C_SCD2_H_BKLT",
					"column_name_detail": "CUSTOMER_S_WEB_C_SCD2_H_BKLT",
					"column_nq_id": "CUSTOMER_S_WEB_C_SCD2_H_BKLT",
					"column_order": 9,
					"column_orig_name": "CUSTOMER_S_WEB_C_SCD2_H_BKLT",
					"conversion_type": null
				},
				{
					"column_comment": "Delta Load Last Seen Time Hub Customer > web > Hr Web Customer",
					"column_id": "DATAVAULT.S_CUSTOMER_S_WEB_R_HR_WEB_CUSTOMER_W_TRKD_H.CUSTOMER_S_WEB_R_HR_WEB_CUSTOMER_W_TRKD_LTH",
					"column_name": "DLS_CUSTOMER",
					"column_name_detail": "CUSTOMER_S_WEB_R_HR_WEB_CUSTOMER_W_TRKD_LTH",
					"column_nq_id": "CUSTOMER_S_WEB_R_HR_WEB_CUSTOMER_W_TRKD_LTH",
					"column_order": 17,
					"column_orig_name": "DLS_CUSTOMER",
					"conversion_type": null
				},
				{
					"column_comment": "Full Load Valid Hub Customer > web > Hr Web Customer",
					"column_id": "DATAVAULT.S_CUSTOMER_S_WEB_R_HR_WEB_CUSTOMER_W_TRKF_H.CUSTOMER_S_WEB_R_HR_WEB_CUSTOMER_W_TRKF_VH",
					"column_name": "FV_CUSTOMER",
					"column_name_detail": "CUSTOMER_S_WEB_R_HR_WEB_CUSTOMER_W_TRKF_VH",
					"column_nq_id": "CUSTOMER_S_WEB_R_HR_WEB_CUSTOMER_W_TRKF_VH",
					"column_order": 20,
					"column_orig_name": "FV_CUSTOMER",
					"conversion_type": null
				},
				{
					"column_comment": "Full Load Last Validity Change Time Hub Customer > web > Hr Web Customer",
					"column_id": "DATAVAULT.S_CUSTOMER_S_WEB_R_HR_WEB_CUSTOMER_W_TRKF_H.CUSTOMER_S_WEB_R_HR_WEB_CUSTOMER_W_TRKF_LTH",
					"column_name": "FLVC_CUSTOMER",
					"column_name_detail": "CUSTOMER_S_WEB_R_HR_WEB_CUSTOMER_W_TRKF_LTH",
					"column_nq_id": "CUSTOMER_S_WEB_R_HR_WEB_CUSTOMER_W_TRKF_LTH",
					"column_order": 21,
					"column_orig_name": "FLVC_CUSTOMER",
					"conversion_type": null
				}
			],
			"path_id": "{\"businessobject_path\":{\"hubs\":[{\"hub_id\":\"H_CUSTOMER\"}]}}"
		},
		{
			"columns": [
				{
					"column_comment": "",
					"column_id": "DATAVAULT.S_CUSTOMER_S_WEB_R_HR_WEB_CUSTOMER_H.KUNDEID",
					"column_name": "KUNDEID",
					"column_name_detail": "",
					"column_nq_id": "KUNDEID",
					"column_order": 3,
					"column_orig_name": "KUNDEID",
					"complete_data_type": "DECIMAL(18,0)",
					"conversion_type": null
				},
				{
					"column_comment": "",
					"column_id": "DATAVAULT.S_CUSTOMER_S_WEB_R_HR_WEB_CUSTOMER_H.VEREINSPARTNERID",
					"column_name": "VEREINSPARTNERID",
					"column_name_detail": "",
					"column_nq_id": "VEREINSPARTNERID",
					"column_order": 4,
					"column_orig_name": "VEREINSPARTNERID",
					"complete_data_type": "VARCHAR(16777216)",
					"conversion_type": null
				},
				{
					"column_comment": "",
					"column_id": "DATAVAULT.S_CUSTOMER_S_WEB_R_HR_WEB_CUSTOMER_H.VORNAME",
					"column_name": "VORNAME",
					"column_name_detail": "",
					"column_nq_id": "VORNAME",
					"column_order": 6,
					"column_orig_name": "VORNAME",
					"complete_data_type": "VARCHAR(16777216)",
					"conversion_type": null
				},
				{
					"column_comment": "",
					"column_id": "DATAVAULT.S_CUSTOMER_S_WEB_R_HR_WEB_CUSTOMER_H.NAME",
					"column_name": "NAME",
					"column_name_detail": "",
					"column_nq_id": "NAME",
					"column_order": 8,
					"column_orig_name": "NAME",
					"complete_data_type": "VARCHAR(16777216)",
					"conversion_type": null
				},
				{
					"column_comment": "",
					"column_id": "DATAVAULT.S_CUSTOMER_S_WEB_R_HR_WEB_CUSTOMER_H.GESCHLECHT",
					"column_name": "GESCHLECHT",
					"column_name_detail": "",
					"column_nq_id": "GESCHLECHT",
					"column_order": 10,
					"column_orig_name": "GESCHLECHT",
					"complete_data_type": "VARCHAR(16777216)",
					"conversion_type": null
				},
				{
					"column_comment": "",
					"column_id": "DATAVAULT.S_CUSTOMER_S_WEB_R_HR_WEB_CUSTOMER_H.GEBURTSDATUM",
					"column_name": "GEBURTSDATUM",
					"column_name_detail": "",
					"column_nq_id": "GEBURTSDATUM",
					"column_order": 11,
					"column_orig_name": "GEBURTSDATUM",
					"complete_data_type": "VARCHAR(16777216)",
					"conversion_type": null
				},
				{
					"column_comment": "",
					"column_id": "DATAVAULT.S_CUSTOMER_S_WEB_R_HR_WEB_CUSTOMER_H.TELEFON",
					"column_name": "TELEFON",
					"column_name_detail": "",
					"column_nq_id": "TELEFON",
					"column_order": 12,
					"column_orig_name": "TELEFON",
					"complete_data_type": "VARCHAR(16777216)",
					"conversion_type": null
				},
				{
					"column_comment": "",
					"column_id": "DATAVAULT.S_CUSTOMER_S_WEB_R_HR_WEB_CUSTOMER_H.MOBIL",
					"column_name": "MOBIL",
					"column_name_detail": "",
					"column_nq_id": "MOBIL",
					"column_order": 13,
					"column_orig_name": "MOBIL",
					"complete_data_type": "VARCHAR(16777216)",
					"conversion_type": null
				},
				{
					"column_comment": "",
					"column_id": "DATAVAULT.S_CUSTOMER_S_WEB_R_HR_WEB_CUSTOMER_H.EMAIL",
					"column_name": "EMAIL",
					"column_name_detail": "",
					"column_nq_id": "EMAIL",
					"column_order": 14,
					"column_orig_name": "EMAIL",
					"complete_data_type": "VARCHAR(16777216)",
					"conversion_type": null
				},
				{
					"column_comment": "",
					"column_id": "DATAVAULT.S_CUSTOMER_S_WEB_R_HR_WEB_CUSTOMER_H.KREDITKARTE",
					"column_name": "KREDITKARTE",
					"column_name_detail": "",
					"column_nq_id": "KREDITKARTE",
					"column_order": 15,
					"column_orig_name": "KREDITKARTE",
					"complete_data_type": "VARCHAR(16777216)",
					"conversion_type": null
				},
				{
					"column_comment": "",
					"column_id": "DATAVAULT.S_CUSTOMER_S_WEB_R_HR_WEB_CUSTOMER_H.GUELTIGBIS",
					"column_name": "GUELTIGBIS",
					"column_name_detail": "",
					"column_nq_id": "GUELTIGBIS",
					"column_order": 16,
					"column_orig_name": "GUELTIGBIS",
					"complete_data_type": "VARCHAR(16777216)",
					"conversion_type": null
				},
				{
					"column_comment": "",
					"column_id": "DATAVAULT.S_CUSTOMER_S_WEB_R_HR_WEB_CUSTOMER_H.KKFIRMA",
					"column_name": "KKFIRMA",
					"column_name_detail": "",
					"column_nq_id": "KKFIRMA",
					"column_order": 18,
					"column_orig_name": "KKFIRMA",
					"complete_data_type": "VARCHAR(16777216)",
					"conversion_type": null
				},
				{
					"column_comment": "Load Time Satellite Customer > web > Default of HR_WEB_CUSTOMER",
					"column_id": "DATAVAULT.S_CUSTOMER_S_WEB_R_HR_WEB_CUSTOMER_H.CUSTOMER_S_WEB_R_HR_WEB_CUSTOMER_LTH",
					"column_name": "LTS_CUSTOMER",
					"column_name_detail": "CUSTOMER_S_WEB_R_HR_WEB_CUSTOMER_LTH",
					"column_nq_id": "CUSTOMER_S_WEB_R_HR_WEB_CUSTOMER_LTH",
					"column_order": 19,
					"column_orig_name": "LTS Customer - web - Default of HR_WEB_CUSTOMER",
					"complete_data_type": "TIMESTAMP",
					"conversion_type": null
				}
			],
			"path_id": "{\"businessobject_path\":{\"hubs\":[{\"hub_id\":\"H_CUSTOMER\",\"satellites\":[{\"satellite_id\":\"S_CUSTOMER_S_WEB_R_HR_WEB_CUSTOMER\"}]}]}}"
		}
	],
	"businessobject_set_id": "businessobject_set_H_CUSTOMER_C_SCD2",
	"businessobject_structure": null,
	"businessobject_view_id": "BUSINESSOBJECTS.CUSTOMER_S_WEB_C_SCD2_H",
	"dependent_objects": [
		{
			"object_id": "BUSINESSOBJECTS_PITS.P_CUSTOMER",
			"object_type": "unknown_object"
		},
		{
			"object_id": "S_CUSTOMER_S_WEB_R_HR_WEB_CUSTOMER",
			"object_type": "satellite"
		}
	],
	"granularity_satellite_id": "S_CUSTOMER_S_WEB_R_HR_WEB_CUSTOMER",
	"scd_type": 2,
	"system_id": "WEB",
	"system_name": "web"
}