{
	"link_id": "L_CUSTOMER_T_CLUB_PARTNER_L_MEMBERSHIP",
	"link_load_display_name": "Customer > web: HR WEB CLUB PARTNER (VEREINSPARTNERID) TO Club_Partner > web: HR WEB CLUB PARTNER (VEREINSPARTNERID)",
	"link_load_id": "L_CUSTOMER_T_CLUB_PARTNER_L_MEMBERSHIP_S_WEB_R_HR_WEB_CLUB_PARTNER",
	"staging_table_id": "STAGING.WEB_R_HR_WEB_CLUB_PARTNER",
	"system_id": "WEB"
}