{
	"link_id": "L_SALE_T_CLUB_PARTNER",
	"link_load_display_name": "Sale > road: HR RS ORDER MK (BESTELLUNGID, VEREINSPARTNERID, KUNDEID, KREDITKARTE, GUELTIGBIS, KKFIRMA) TO Club_Partner > road: HR RS ORDER MK (VEREINSPARTNERID)",
	"link_load_id": "L_SALE_T_CLUB_PARTNER_S_ROAD_R_HR_RS_ORDER_MK",
	"staging_table_id": "STAGING.ROAD_R_HR_RS_ORDER_MK",
	"system_id": "ROAD"
}