{
	"column_ids": [
		{
			"character_maximum_length": 2000000,
			"column_comment": "",
			"column_id": "DATAVAULT.S_SALE_ITEM_NO_CUSTOMER_S_ROAD_R_HR_RS_POSITION_KK_H.BESTELLUNGID",
			"column_is_used": true,
			"column_name": "BESTELLUNGID",
			"column_name_detail": "",
			"column_nq_id": "BESTELLUNGID",
			"column_order": 1,
			"column_type": "attribute",
			"complete_data_type": "VARCHAR(2000000) UTF8",
			"conversion_type": null,
			"data_type": "VARCHAR UTF8",
			"datetime_precision": null,
			"numeric_precision": null,
			"numeric_scale": null
		},
		{
			"character_maximum_length": 2000000,
			"column_comment": "",
			"column_id": "DATAVAULT.S_SALE_ITEM_NO_CUSTOMER_S_ROAD_R_HR_RS_POSITION_KK_H.VEREINSPARTNERID",
			"column_is_used": true,
			"column_name": "VEREINSPARTNERID",
			"column_name_detail": "",
			"column_nq_id": "VEREINSPARTNERID",
			"column_order": 2,
			"column_type": "attribute",
			"complete_data_type": "VARCHAR(2000000) UTF8",
			"conversion_type": null,
			"data_type": "VARCHAR UTF8",
			"datetime_precision": null,
			"numeric_precision": null,
			"numeric_scale": null
		},
		{
			"character_maximum_length": 18,
			"column_comment": "",
			"column_id": "DATAVAULT.S_SALE_ITEM_NO_CUSTOMER_S_ROAD_R_HR_RS_POSITION_KK_H.PRODUKTID",
			"column_is_used": true,
			"column_name": "PRODUKTID",
			"column_name_detail": "",
			"column_nq_id": "PRODUKTID",
			"column_order": 3,
			"column_type": "attribute",
			"complete_data_type": "DECIMAL(18,0)",
			"conversion_type": null,
			"data_type": "DECIMAL",
			"datetime_precision": null,
			"numeric_precision": 18,
			"numeric_scale": 0
		},
		{
			"character_maximum_length": 2000000,
			"column_comment": "",
			"column_id": "DATAVAULT.S_SALE_ITEM_NO_CUSTOMER_S_ROAD_R_HR_RS_POSITION_KK_H.KAUFDATUM",
			"column_is_used": true,
			"column_name": "KAUFDATUM",
			"column_name_detail": "",
			"column_nq_id": "KAUFDATUM",
			"column_order": 4,
			"column_type": "attribute",
			"complete_data_type": "VARCHAR(2000000) UTF8",
			"conversion_type": null,
			"data_type": "VARCHAR UTF8",
			"datetime_precision": null,
			"numeric_precision": null,
			"numeric_scale": null
		},
		{
			"character_maximum_length": 18,
			"column_comment": "",
			"column_id": "DATAVAULT.S_SALE_ITEM_NO_CUSTOMER_S_ROAD_R_HR_RS_POSITION_KK_H.MENGE",
			"column_is_used": true,
			"column_name": "MENGE",
			"column_name_detail": "",
			"column_nq_id": "MENGE",
			"column_order": 5,
			"column_type": "attribute",
			"complete_data_type": "DECIMAL(18,0)",
			"conversion_type": null,
			"data_type": "DECIMAL",
			"datetime_precision": null,
			"numeric_precision": 18,
			"numeric_scale": 0
		},
		{
			"character_maximum_length": 18,
			"column_comment": "",
			"column_id": "DATAVAULT.S_SALE_ITEM_NO_CUSTOMER_S_ROAD_R_HR_RS_POSITION_KK_H.PREIS",
			"column_is_used": true,
			"column_name": "PREIS",
			"column_name_detail": "",
			"column_nq_id": "PREIS",
			"column_order": 6,
			"column_type": "attribute",
			"complete_data_type": "DECIMAL(18,2)",
			"conversion_type": null,
			"data_type": "DECIMAL",
			"datetime_precision": null,
			"numeric_precision": 18,
			"numeric_scale": 2
		},
		{
			"character_maximum_length": 18,
			"column_comment": "",
			"column_id": "DATAVAULT.S_SALE_ITEM_NO_CUSTOMER_S_ROAD_R_HR_RS_POSITION_KK_H.RABATT",
			"column_is_used": true,
			"column_name": "RABATT",
			"column_name_detail": "",
			"column_nq_id": "RABATT",
			"column_order": 7,
			"column_type": "attribute",
			"complete_data_type": "DECIMAL(18,2)",
			"conversion_type": null,
			"data_type": "DECIMAL",
			"datetime_precision": null,
			"numeric_precision": 18,
			"numeric_scale": 2
		}
	],
	"functional_suffix_id": "",
	"functional_suffix_name": "Default of HR_RS_POSITION_KK",
	"hub_id": "H_SALE_ITEM_NO_CUSTOMER",
	"satellite_comment": "",
	"satellite_id": "S_SALE_ITEM_NO_CUSTOMER_S_ROAD_R_HR_RS_POSITION_KK",
	"satellite_is_prototype": false,
	"satellite_subject_area_name": "Sale",
	"staging_resource_id": "HR_RS_POSITION_KK",
	"staging_table_id": "STAGING.ROAD_R_HR_RS_POSITION_KK",
	"system_id": "ROAD"
}