{
	"business_key_prefix": "",
	"business_key_short": "LIEFERDIENSTID",
	"column_ids": [
		{
			"column_id": "STAGING.WEB_R_HR_WEB_DELIVERY_SERVICE.LIEFERDIENSTID",
			"column_order": 1
		}
	],
	"datavault_category_id": "raw_vault",
	"hub_id": "H_DELIVERY_SERVICE",
	"hub_load_display_name": "web: HR WEB DELIVERY SERVICE (LIEFERDIENSTID)",
	"hub_load_id": "H_DELIVERY_SERVICE_S_WEB_R_HR_WEB_DELIVERY_SERVICE",
	"keys_are_prehashed": false,
	"keys_are_unique": true,
	"staging_table_id": "STAGING.WEB_R_HR_WEB_DELIVERY_SERVICE",
	"system_id": "WEB",
	"system_name": "web"
}