{
	"hub_a_id": "H_ORDER_ITEM",
	"hub_b_id": "H_DELIVERY",
	"link_comment": "delivers Products as part of Order_Item",
	"link_id": "L_ORDER_ITEM_T_DELIVERY",
	"link_subject_area_name": "Sale",
	"link_suffix_id": null,
	"link_suffix_name": "",
	"link_type": "many_to_one"
}