{
	"business_key_prefix": "",
	"business_key_short": "BESTELLUNGID, POSID",
	"column_ids": [
		{
			"column_id": "STAGING.WEB_R_HR_WEB_POSITION.BESTELLUNGID",
			"column_order": 1
		},
		{
			"column_id": "STAGING.WEB_R_HR_WEB_POSITION.POSID",
			"column_order": 2
		}
	],
	"datavault_category_id": "raw_vault",
	"hub_id": "H_ORDER_ITEM",
	"hub_load_display_name": "web: HR WEB POSITION (BESTELLUNGID, POSID)",
	"hub_load_id": "H_ORDER_ITEM_S_WEB_R_HR_WEB_POSITION",
	"keys_are_prehashed": false,
	"keys_are_unique": true,
	"staging_table_id": "STAGING.WEB_R_HR_WEB_POSITION",
	"system_id": "WEB",
	"system_name": "web"
}