{
	"business_rules_businessobject_container_display_name": "Sale",
	"business_rules_businessobject_container_id": "H_SALE_C_dvb_default",
	"business_rules_businessobject_container_order": 20,
	"business_rules_businessobject_systems": [
		{
			"related_businessobject_view_id": "BUSINESSOBJECTS.SALE_S_DVB_HUB",
			"system_id": "DVB_HUB",
			"system_order": 1
		},
		{
			"related_businessobject_view_id": "BUSINESSOBJECTS.SALE_S_ROAD",
			"system_id": "ROAD",
			"system_order": 2
		}
	]
}