{
	"link_id": "L_SALE_ITEM_NO_CUSTOMER_T_PRODUCT",
	"link_load_display_name": "Sale_Item_no_Customer > road: HR RS POSITION KK (PRODUKTID, VEREINSPARTNERID, BESTELLUNGID) TO Product > road: HR RS POSITION KK (PRODUKTID)",
	"link_load_id": "L_SALE_ITEM_NO_CUSTOMER_T_PRODUCT_S_ROAD_R_HR_RS_POSITION_KK",
	"staging_table_id": "STAGING.ROAD_R_HR_RS_POSITION_KK",
	"system_id": "ROAD"
}