{
	"column_ids": [
		{
			"character_maximum_length": 18,
			"column_comment": "",
			"column_id": "DATAVAULT.S_REF_PRODUCT_TYPE_S_REF_R_HR_REF_PRODUCT_TYPE_H.TYP",
			"column_is_used": true,
			"column_name": "TYP",
			"column_name_detail": "",
			"column_nq_id": "TYP",
			"column_order": 1,
			"column_type": "attribute",
			"complete_data_type": "DECIMAL(18,0)",
			"conversion_type": null,
			"data_type": "DECIMAL",
			"datetime_precision": null,
			"numeric_precision": 18,
			"numeric_scale": 0
		},
		{
			"character_maximum_length": 2000000,
			"column_comment": "",
			"column_id": "DATAVAULT.S_REF_PRODUCT_TYPE_S_REF_R_HR_REF_PRODUCT_TYPE_H.BEZEICHNUNG",
			"column_is_used": true,
			"column_name": "BEZEICHNUNG",
			"column_name_detail": "",
			"column_nq_id": "BEZEICHNUNG",
			"column_order": 2,
			"column_type": "attribute",
			"complete_data_type": "VARCHAR(2000000) UTF8",
			"conversion_type": null,
			"data_type": "VARCHAR UTF8",
			"datetime_precision": null,
			"numeric_precision": null,
			"numeric_scale": null
		}
	],
	"functional_suffix_id": "",
	"functional_suffix_name": "Default of HR_REF_PRODUCT_TYPE",
	"hub_id": "H_REF_PRODUCT_TYPE",
	"satellite_comment": "",
	"satellite_id": "S_REF_PRODUCT_TYPE_S_REF_R_HR_REF_PRODUCT_TYPE",
	"satellite_is_prototype": false,
	"satellite_subject_area_name": "Delivery",
	"staging_resource_id": "HR_REF_PRODUCT_TYPE",
	"staging_table_id": "STAGING.REF_R_HR_REF_PRODUCT_TYPE",
	"system_id": "REF"
}