BestellungID,KundeID,AllgLieferAdrID,Bestelldatum,Wunschdatum,Rabatt
1,1,1,05.03.2022,06.03.2022,0.5
2,1,120,05.03.2022,05.03.2022,0.0
3,1,530,05.03.2022,05.03.2022,0.0
4,2,275,05.03.2022,10.03.2022,2.5
5,2,631,05.03.2022,10.03.2022,2.5
6,2,686,05.03.2022,11.03.2022,3.0
7,3,494,05.03.2022,13.03.2022,3.0
8,3,526,05.03.2022,13.03.2022,3.0
9,3,568,05.03.2022,17.03.2022,3.0
10,4,162,05.03.2022,05.03.2022,0.0
11,4,422,05.03.2022,12.03.2022,3.0
12,4,551,05.03.2022,17.03.2022,3.0
13,5,287,05.03.2022,16.03.2022,3.0
14,5,638,05.03.2022,12.03.2022,3.0
15,5,721,05.03.2022,05.03.2022,0.0
16,6,588,05.03.2022,08.03.2022,1.5
17,6,589,05.03.2022,13.03.2022,3.0
18,6,627,05.03.2022,11.03.2022,3.0
19,7,263,05.03.2022,07.03.2022,1.0
20,7,652,05.03.2022,10.03.2022,2.5
21,7,742,05.03.2022,17.03.2022,3.0
22,8,22,05.03.2022,09.03.2022,2.0
23,8,321,05.03.2022,08.03.2022,1.5
24,8,792,05.03.2022,08.03.2022,1.5
25,9,43,05.03.2022,15.03.2022,3.0
26,9,403,05.03.2022,13.03.2022,3.0
27,9,599,05.03.2022,08.03.2022,1.5
28,10,93,05.03.2022,14.03.2022,3.0
29,10,112,05.03.2022,13.03.2022,3.0
30,10,490,05.03.2022,05.03.2022,0.0
31,11,392,05.03.2022,07.03.2022,1.0
32,11,469,05.03.2022,13.03.2022,3.0
33,11,601,05.03.2022,08.03.2022,1.5
34,12,239,05.03.2022,16.03.2022,3.0
35,12,576,05.03.2022,05.03.2022,0.0
36,12,788,05.03.2022,08.03.2022,1.5
37,13,173,05.03.2022,16.03.2022,3.0
38,13,623,05.03.2022,09.03.2022,2.0
39,13,749,05.03.2022,11.03.2022,3.0
40,14,514,05.03.2022,15.03.2022,3.0
41,14,644,05.03.2022,09.03.2022,2.0
42,14,735,05.03.2022,05.03.2022,0.0
43,15,50,05.03.2022,10.03.2022,2.5
44,15,89,05.03.2022,06.03.2022,0.5
45,15,414,05.03.2022,05.03.2022,0.0
46,16,140,05.03.2022,10.03.2022,2.5
47,16,396,05.03.2022,17.03.2022,3.0
48,16,678,05.03.2022,14.03.2022,3.0
49,17,36,05.03.2022,14.03.2022,3.0
50,17,154,05.03.2022,10.03.2022,2.5
51,17,763,05.03.2022,08.03.2022,1.5
52,18,433,05.03.2022,06.03.2022,0.5
53,18,447,05.03.2022,11.03.2022,3.0
54,18,665,05.03.2022,05.03.2022,0.0
55,19,234,05.03.2022,05.03.2022,0.0
56,19,593,05.03.2022,18.03.2022,3.0
57,19,657,05.03.2022,14.03.2022,3.0
58,20,64,05.03.2022,12.03.2022,3.0
59,20,259,05.03.2022,16.03.2022,3.0
60,20,755,05.03.2022,05.03.2022,0.0
61,21,104,05.03.2022,19.03.2022,3.0
62,21,214,05.03.2022,13.03.2022,3.0
63,21,726,05.03.2022,08.03.2022,1.5
64,22,56,05.03.2022,19.03.2022,3.0
65,22,308,05.03.2022,15.03.2022,3.0
66,22,784,05.03.2022,14.03.2022,3.0
67,23,125,05.03.2022,10.03.2022,2.5
68,23,363,05.03.2022,14.03.2022,3.0
69,23,482,05.03.2022,08.03.2022,1.5
70,24,297,05.03.2022,05.03.2022,0.0
71,24,577,05.03.2022,07.03.2022,1.0
72,24,776,05.03.2022,17.03.2022,3.0
73,25,85,05.03.2022,15.03.2022,3.0
74,25,615,05.03.2022,05.03.2022,0.0
75,25,712,05.03.2022,05.03.2022,0.0
76,26,147,05.03.2022,17.03.2022,3.0
77,26,564,05.03.2022,08.03.2022,1.5
78,26,670,05.03.2022,05.03.2022,0.0
79,27,27,05.03.2022,08.03.2022,1.5
80,27,291,05.03.2022,05.03.2022,0.0
81,27,397,05.03.2022,17.03.2022,3.0
82,28,103,05.03.2022,06.03.2022,0.5
83,28,251,05.03.2022,18.03.2022,3.0
84,28,338,05.03.2022,17.03.2022,3.0
85,29,199,05.03.2022,15.03.2022,3.0
86,29,313,05.03.2022,13.03.2022,3.0
87,29,474,05.03.2022,08.03.2022,1.5
88,30,77,05.03.2022,16.03.2022,3.0
89,30,276,05.03.2022,14.03.2022,3.0
90,30,607,05.03.2022,05.03.2022,0.0
91,31,453,05.03.2022,08.03.2022,1.5
92,31,495,05.03.2022,05.03.2022,0.0
93,31,768,05.03.2022,14.03.2022,3.0
94,32,417,05.03.2022,08.03.2022,1.5
95,32,483,05.03.2022,05.03.2022,0.0
96,32,581,05.03.2022,11.03.2022,3.0
97,33,13,05.03.2022,06.03.2022,0.5
98,33,222,05.03.2022,11.03.2022,3.0
99,33,227,05.03.2022,08.03.2022,1.5
100,34,200,05.03.2022,10.03.2022,2.5
101,34,285,05.03.2022,05.03.2022,0.0
102,34,506,05.03.2022,17.03.2022,3.0
103,35,130,05.03.2022,15.03.2022,3.0
104,35,238,05.03.2022,07.03.2022,1.0
105,35,691,05.03.2022,05.03.2022,0.0
106,36,289,05.03.2022,09.03.2022,2.0
107,36,636,05.03.2022,17.03.2022,3.0
108,36,666,05.03.2022,08.03.2022,1.5
109,37,384,05.03.2022,11.03.2022,3.0
110,37,429,05.03.2022,05.03.2022,0.0
111,37,620,05.03.2022,05.03.2022,0.0
112,38,215,05.03.2022,10.03.2022,2.5
113,38,376,05.03.2022,13.03.2022,3.0
114,38,464,05.03.2022,11.03.2022,3.0
115,39,69,05.03.2022,05.03.2022,0.0
116,39,372,05.03.2022,17.03.2022,3.0
117,39,432,05.03.2022,14.03.2022,3.0
118,40,487,05.03.2022,06.03.2022,0.5
119,40,528,05.03.2022,17.03.2022,3.0
120,40,679,05.03.2022,05.03.2022,0.0
121,41,191,05.03.2022,16.03.2022,3.0
122,41,502,05.03.2022,19.03.2022,3.0
123,41,565,05.03.2022,05.03.2022,0.0
124,42,516,05.03.2022,14.03.2022,3.0
125,42,718,05.03.2022,10.03.2022,2.5
126,42,747,05.03.2022,17.03.2022,3.0
127,43,109,05.03.2022,18.03.2022,3.0
128,43,628,05.03.2022,19.03.2022,3.0
129,43,680,05.03.2022,05.03.2022,0.0
130,44,159,05.03.2022,05.03.2022,0.0
131,44,705,05.03.2022,05.03.2022,0.0
132,44,731,05.03.2022,17.03.2022,3.0
133,45,48,05.03.2022,14.03.2022,3.0
134,45,143,05.03.2022,12.03.2022,3.0
135,45,727,05.03.2022,05.03.2022,0.0
136,46,32,05.03.2022,07.03.2022,1.0
137,46,368,05.03.2022,06.03.2022,0.5
138,46,456,05.03.2022,08.03.2022,1.5
139,47,6,05.03.2022,14.03.2022,3.0
140,47,331,05.03.2022,10.03.2022,2.5
141,47,424,05.03.2022,14.03.2022,3.0
142,48,210,05.03.2022,05.03.2022,0.0
143,48,326,05.03.2022,18.03.2022,3.0
144,48,777,05.03.2022,08.03.2022,1.5
145,49,507,05.03.2022,05.03.2022,0.0
146,49,523,05.03.2022,13.03.2022,3.0
147,49,641,05.03.2022,17.03.2022,3.0
148,50,355,05.03.2022,15.03.2022,3.0
149,50,358,05.03.2022,07.03.2022,1.0
150,50,533,05.03.2022,05.03.2022,0.0
151,51,19,05.03.2022,09.03.2022,2.0
152,51,252,05.03.2022,14.03.2022,3.0
153,51,277,05.03.2022,11.03.2022,3.0
154,52,336,05.03.2022,14.03.2022,3.0
155,52,401,05.03.2022,15.03.2022,3.0
156,52,789,05.03.2022,14.03.2022,3.0
157,53,170,05.03.2022,10.03.2022,2.5
158,53,398,05.03.2022,09.03.2022,2.0
159,53,463,05.03.2022,17.03.2022,3.0
160,54,28,05.03.2022,15.03.2022,3.0
161,54,290,05.03.2022,15.03.2022,3.0
162,54,606,05.03.2022,17.03.2022,3.0
163,55,90,05.03.2022,05.03.2022,0.0
164,55,496,05.03.2022,19.03.2022,3.0
165,55,497,05.03.2022,05.03.2022,0.0
166,56,117,05.03.2022,17.03.2022,3.0
167,56,650,05.03.2022,15.03.2022,3.0
168,56,744,05.03.2022,17.03.2022,3.0
169,57,78,05.03.2022,17.03.2022,3.0
170,57,269,05.03.2022,15.03.2022,3.0
171,57,471,05.03.2022,11.03.2022,3.0
172,58,45,05.03.2022,05.03.2022,0.0
173,58,323,05.03.2022,09.03.2022,2.0
174,58,573,05.03.2022,17.03.2022,3.0
175,59,265,05.03.2022,15.03.2022,3.0
176,59,524,05.03.2022,09.03.2022,2.0
177,59,710,05.03.2022,05.03.2022,0.0
178,60,437,05.03.2022,16.03.2022,3.0
179,60,520,05.03.2022,10.03.2022,2.5
180,60,765,05.03.2022,05.03.2022,0.0
181,61,342,05.03.2022,17.03.2022,3.0
182,61,580,05.03.2022,10.03.2022,2.5
183,61,752,05.03.2022,11.03.2022,3.0
184,62,11,05.03.2022,19.03.2022,3.0
185,62,552,05.03.2022,05.03.2022,0.0
186,62,717,05.03.2022,17.03.2022,3.0
187,63,66,05.03.2022,17.03.2022,3.0
188,63,448,05.03.2022,19.03.2022,3.0
189,63,609,05.03.2022,11.03.2022,3.0
190,64,18,05.03.2022,05.03.2022,0.0
191,64,138,05.03.2022,08.03.2022,1.5
192,64,412,05.03.2022,14.03.2022,3.0
193,65,421,05.03.2022,18.03.2022,3.0
194,65,613,05.03.2022,07.03.2022,1.0
195,65,738,05.03.2022,05.03.2022,0.0
196,66,127,05.03.2022,12.03.2022,3.0
197,66,156,05.03.2022,17.03.2022,3.0
198,66,549,05.03.2022,17.03.2022,3.0
199,67,445,05.03.2022,15.03.2022,3.0
200,67,662,05.03.2022,15.03.2022,3.0
201,67,757,05.03.2022,17.03.2022,3.0
202,68,545,05.03.2022,10.03.2022,2.5
203,68,570,05.03.2022,05.03.2022,0.0
204,68,675,05.03.2022,05.03.2022,0.0
205,69,39,05.03.2022,05.03.2022,0.0
206,69,188,05.03.2022,18.03.2022,3.0
207,69,189,05.03.2022,08.03.2022,1.5
208,70,217,05.03.2022,06.03.2022,0.5
209,70,529,05.03.2022,16.03.2022,3.0
210,70,778,05.03.2022,05.03.2022,0.0
211,71,58,05.03.2022,18.03.2022,3.0
212,71,122,05.03.2022,09.03.2022,2.0
213,71,569,05.03.2022,17.03.2022,3.0
214,72,261,05.03.2022,14.03.2022,3.0
215,72,365,05.03.2022,15.03.2022,3.0
216,72,440,05.03.2022,05.03.2022,0.0
217,73,53,05.03.2022,16.03.2022,3.0
218,73,720,05.03.2022,05.03.2022,0.0
219,73,723,05.03.2022,17.03.2022,3.0
220,74,164,05.03.2022,10.03.2022,2.5
221,74,306,05.03.2022,11.03.2022,3.0
222,74,659,05.03.2022,08.03.2022,1.5
223,75,150,05.03.2022,05.03.2022,0.0
224,75,278,05.03.2022,12.03.2022,3.0
225,75,504,05.03.2022,05.03.2022,0.0
226,76,400,05.03.2022,15.03.2022,3.0
227,76,592,05.03.2022,19.03.2022,3.0
228,76,773,05.03.2022,14.03.2022,3.0
229,77,203,05.03.2022,07.03.2022,1.0
230,77,503,05.03.2022,15.03.2022,3.0
231,77,685,05.03.2022,05.03.2022,0.0
232,78,361,05.03.2022,12.03.2022,3.0
233,78,476,05.03.2022,18.03.2022,3.0
234,78,693,05.03.2022,17.03.2022,3.0
235,79,24,05.03.2022,05.03.2022,0.0
236,79,667,05.03.2022,07.03.2022,1.0
237,79,780,05.03.2022,05.03.2022,0.0
238,80,266,05.03.2022,13.03.2022,3.0
239,80,654,05.03.2022,11.03.2022,3.0
240,80,770,05.03.2022,05.03.2022,0.0
241,81,21,05.03.2022,11.03.2022,3.0
242,81,177,05.03.2022,14.03.2022,3.0
243,81,472,05.03.2022,11.03.2022,3.0
244,82,71,05.03.2022,19.03.2022,3.0
245,82,74,05.03.2022,15.03.2022,3.0
246,82,79,05.03.2022,14.03.2022,3.0
247,83,175,05.03.2022,15.03.2022,3.0
248,83,492,05.03.2022,11.03.2022,3.0
249,83,544,05.03.2022,11.03.2022,3.0
250,84,132,05.03.2022,05.03.2022,0.0
251,84,360,05.03.2022,05.03.2022,0.0
252,84,766,05.03.2022,17.03.2022,3.0
253,85,101,05.03.2022,13.03.2022,3.0
254,85,579,05.03.2022,11.03.2022,3.0
255,85,701,05.03.2022,05.03.2022,0.0
256,86,237,05.03.2022,17.03.2022,3.0
257,86,622,05.03.2022,19.03.2022,3.0
258,86,625,05.03.2022,05.03.2022,0.0
259,87,2,05.03.2022,13.03.2022,3.0
260,87,67,05.03.2022,10.03.2022,2.5
261,87,318,05.03.2022,08.03.2022,1.5
262,88,193,05.03.2022,06.03.2022,0.5
263,88,224,05.03.2022,12.03.2022,3.0
264,88,273,05.03.2022,17.03.2022,3.0
265,89,81,05.03.2022,05.03.2022,0.0
266,89,399,05.03.2022,14.03.2022,3.0
267,89,681,05.03.2022,17.03.2022,3.0
268,90,128,05.03.2022,19.03.2022,3.0
269,90,221,05.03.2022,09.03.2022,2.0
270,90,521,05.03.2022,05.03.2022,0.0
271,91,208,05.03.2022,18.03.2022,3.0
272,91,229,05.03.2022,13.03.2022,3.0
273,91,634,05.03.2022,17.03.2022,3.0
274,92,310,05.03.2022,15.03.2022,3.0
275,92,596,05.03.2022,15.03.2022,3.0
276,92,683,05.03.2022,08.03.2022,1.5
277,93,113,05.03.2022,16.03.2022,3.0
278,93,315,05.03.2022,05.03.2022,0.0
279,93,548,05.03.2022,17.03.2022,3.0
280,94,145,05.03.2022,15.03.2022,3.0
281,94,373,05.03.2022,13.03.2022,3.0
282,94,779,05.03.2022,08.03.2022,1.5
283,95,264,05.03.2022,17.03.2022,3.0
284,95,350,05.03.2022,15.03.2022,3.0
285,95,786,05.03.2022,05.03.2022,0.0
286,96,426,05.03.2022,11.03.2022,3.0
287,96,694,05.03.2022,13.03.2022,3.0
288,96,736,05.03.2022,08.03.2022,1.5
289,97,80,05.03.2022,10.03.2022,2.5
290,97,391,05.03.2022,10.03.2022,2.5
291,97,484,05.03.2022,14.03.2022,3.0
292,98,87,05.03.2022,14.03.2022,3.0
293,98,386,05.03.2022,18.03.2022,3.0
294,98,559,05.03.2022,11.03.2022,3.0
295,99,37,05.03.2022,15.03.2022,3.0
296,99,281,05.03.2022,06.03.2022,0.5
297,99,505,06.03.2022,06.03.2022,0.0
298,100,204,06.03.2022,18.03.2022,3.0
299,100,408,06.03.2022,18.03.2022,3.0
300,100,543,06.03.2022,06.03.2022,0.0
301,101,253,06.03.2022,19.03.2022,3.0
302,101,431,06.03.2022,13.03.2022,3.0
303,101,536,06.03.2022,09.03.2022,1.5
304,102,166,06.03.2022,10.03.2022,2.0
305,102,351,06.03.2022,06.03.2022,0.0
306,102,707,06.03.2022,18.03.2022,3.0
307,103,584,06.03.2022,14.03.2022,3.0
308,103,594,06.03.2022,18.03.2022,3.0
309,103,745,06.03.2022,06.03.2022,0.0
310,104,339,06.03.2022,06.03.2022,0.0
311,104,455,06.03.2022,16.03.2022,3.0
312,104,500,06.03.2022,06.03.2022,0.0
313,105,8,06.03.2022,20.03.2022,3.0
314,105,148,06.03.2022,08.03.2022,1.0
315,105,158,06.03.2022,06.03.2022,0.0
316,106,46,06.03.2022,07.03.2022,0.5
317,106,271,06.03.2022,08.03.2022,1.0
318,106,728,06.03.2022,15.03.2022,3.0
319,107,136,06.03.2022,10.03.2022,2.0
320,107,245,06.03.2022,16.03.2022,3.0
321,107,498,06.03.2022,09.03.2022,1.5
322,108,307,06.03.2022,10.03.2022,2.0
323,108,461,06.03.2022,19.03.2022,3.0
324,108,465,06.03.2022,06.03.2022,0.0
325,109,29,06.03.2022,11.03.2022,2.5
326,109,207,06.03.2022,18.03.2022,3.0
327,109,697,06.03.2022,15.03.2022,3.0
328,110,413,06.03.2022,20.03.2022,3.0
329,110,525,06.03.2022,06.03.2022,0.0
330,110,583,06.03.2022,06.03.2022,0.0
331,111,119,06.03.2022,20.03.2022,3.0
332,111,169,06.03.2022,14.03.2022,3.0
333,111,240,06.03.2022,06.03.2022,0.0
334,112,230,06.03.2022,11.03.2022,2.5
335,112,334,06.03.2022,11.03.2022,2.5
336,112,611,06.03.2022,12.03.2022,3.0
337,113,531,06.03.2022,18.03.2022,3.0
338,113,616,06.03.2022,14.03.2022,3.0
339,113,682,06.03.2022,09.03.2022,1.5
340,114,555,06.03.2022,06.03.2022,0.0
341,114,651,06.03.2022,12.03.2022,3.0
342,114,706,06.03.2022,18.03.2022,3.0
343,115,213,06.03.2022,15.03.2022,3.0
344,115,695,06.03.2022,16.03.2022,3.0
345,115,709,06.03.2022,06.03.2022,0.0
346,116,111,06.03.2022,12.03.2022,3.0
347,116,630,06.03.2022,06.03.2022,0.0
348,116,759,06.03.2022,18.03.2022,3.0
349,117,10,06.03.2022,16.03.2022,3.0
350,117,205,06.03.2022,11.03.2022,2.5
351,117,250,06.03.2022,06.03.2022,0.0
352,118,7,06.03.2022,10.03.2022,2.0
353,118,274,06.03.2022,08.03.2022,1.0
354,118,423,06.03.2022,18.03.2022,3.0
355,119,288,06.03.2022,06.03.2022,0.0
356,119,346,06.03.2022,17.03.2022,3.0
357,119,458,06.03.2022,12.03.2022,3.0
358,120,60,06.03.2022,06.03.2022,0.0
359,120,560,06.03.2022,16.03.2022,3.0
360,120,572,06.03.2022,06.03.2022,0.0
361,121,357,06.03.2022,18.03.2022,3.0
362,121,604,06.03.2022,14.03.2022,3.0
363,121,674,06.03.2022,18.03.2022,3.0
364,122,639,06.03.2022,12.03.2022,3.0
365,122,643,06.03.2022,11.03.2022,2.5
366,122,722,06.03.2022,18.03.2022,3.0
367,123,121,06.03.2022,13.03.2022,3.0
368,123,167,06.03.2022,07.03.2022,0.5
369,123,388,06.03.2022,18.03.2022,3.0
370,124,118,06.03.2022,16.03.2022,3.0
371,124,280,06.03.2022,11.03.2022,2.5
372,124,741,06.03.2022,18.03.2022,3.0
373,125,139,06.03.2022,13.03.2022,3.0
374,125,270,06.03.2022,06.03.2022,0.0
375,125,791,06.03.2022,06.03.2022,0.0
376,126,206,06.03.2022,17.03.2022,3.0
377,126,436,06.03.2022,08.03.2022,1.0
378,126,632,06.03.2022,12.03.2022,3.0
379,127,42,06.03.2022,09.03.2022,1.5
380,127,335,06.03.2022,16.03.2022,3.0
381,127,468,06.03.2022,09.03.2022,1.5
382,128,92,06.03.2022,20.03.2022,3.0
383,128,499,06.03.2022,08.03.2022,1.0
384,128,783,06.03.2022,18.03.2022,3.0
385,129,178,06.03.2022,16.03.2022,3.0
386,129,181,06.03.2022,17.03.2022,3.0
387,129,460,06.03.2022,06.03.2022,0.0
388,130,23,06.03.2022,20.03.2022,3.0
389,130,517,06.03.2022,14.03.2022,3.0
390,130,762,06.03.2022,06.03.2022,0.0
391,131,295,06.03.2022,16.03.2022,3.0
392,131,325,06.03.2022,11.03.2022,2.5
393,131,664,06.03.2022,18.03.2022,3.0
394,132,389,06.03.2022,17.03.2022,3.0
395,132,547,06.03.2022,11.03.2022,2.5
396,132,793,06.03.2022,09.03.2022,1.5
397,133,63,06.03.2022,12.03.2022,3.0
398,133,624,06.03.2022,18.03.2022,3.0
399,133,715,06.03.2022,06.03.2022,0.0
400,134,344,06.03.2022,11.03.2022,2.5
401,134,687,06.03.2022,18.03.2022,3.0
402,134,754,06.03.2022,09.03.2022,1.5
403,135,94,06.03.2022,13.03.2022,3.0
404,135,352,06.03.2022,14.03.2022,3.0
405,135,354,06.03.2022,06.03.2022,0.0
406,136,16,06.03.2022,07.03.2022,0.5
407,136,84,06.03.2022,09.03.2022,1.5
408,136,124,06.03.2022,18.03.2022,3.0
409,137,106,06.03.2022,10.03.2022,2.0
410,137,370,06.03.2022,11.03.2022,2.5
411,137,491,06.03.2022,12.03.2022,3.0
412,138,171,06.03.2022,18.03.2022,3.0
413,138,327,06.03.2022,12.03.2022,3.0
414,138,541,06.03.2022,15.03.2022,3.0
415,139,153,06.03.2022,06.03.2022,0.0
416,139,442,06.03.2022,08.03.2022,1.0
417,139,785,06.03.2022,06.03.2022,0.0
418,140,260,06.03.2022,11.03.2022,2.5
419,140,646,06.03.2022,20.03.2022,3.0
420,140,750,06.03.2022,06.03.2022,0.0
421,141,86,07.03.2022,18.03.2022,3.0
422,141,256,07.03.2022,09.03.2022,1.0
423,141,377,07.03.2022,13.03.2022,3.0
424,142,185,07.03.2022,12.03.2022,2.5
425,142,267,07.03.2022,07.03.2022,0.0
426,142,567,07.03.2022,19.03.2022,3.0
427,143,330,07.03.2022,07.03.2022,0.0
428,143,532,07.03.2022,18.03.2022,3.0
429,143,781,07.03.2022,16.03.2022,3.0
430,144,314,07.03.2022,12.03.2022,2.5
431,144,341,07.03.2022,08.03.2022,0.5
432,144,614,07.03.2022,10.03.2022,1.5
433,145,179,07.03.2022,09.03.2022,1.0
434,145,343,07.03.2022,09.03.2022,1.0
435,145,438,07.03.2022,07.03.2022,0.0
436,146,55,07.03.2022,17.03.2022,3.0
437,146,393,07.03.2022,13.03.2022,3.0
438,146,725,07.03.2022,07.03.2022,0.0
439,147,102,07.03.2022,10.03.2022,1.5
440,147,415,07.03.2022,12.03.2022,2.5
441,147,598,07.03.2022,10.03.2022,1.5
442,148,284,07.03.2022,15.03.2022,3.0
443,148,293,07.03.2022,11.03.2022,2.0
444,148,696,07.03.2022,16.03.2022,3.0
445,149,574,07.03.2022,17.03.2022,3.0
446,149,595,07.03.2022,12.03.2022,2.5
447,149,775,07.03.2022,07.03.2022,0.0
448,150,539,07.03.2022,09.03.2022,1.0
449,150,633,07.03.2022,19.03.2022,3.0
450,150,671,07.03.2022,07.03.2022,0.0
451,151,180,07.03.2022,07.03.2022,0.0
452,151,656,07.03.2022,14.03.2022,3.0
453,151,797,07.03.2022,13.03.2022,3.0
454,152,26,07.03.2022,21.03.2022,3.0
455,152,597,07.03.2022,07.03.2022,0.0
456,152,669,07.03.2022,16.03.2022,3.0
457,153,98,07.03.2022,18.03.2022,3.0
458,153,137,07.03.2022,08.03.2022,0.5
459,153,591,07.03.2022,16.03.2022,3.0
460,154,160,07.03.2022,17.03.2022,3.0
461,154,473,07.03.2022,20.03.2022,3.0
462,154,501,07.03.2022,19.03.2022,3.0
463,155,51,07.03.2022,10.03.2022,1.5
464,155,82,07.03.2022,15.03.2022,3.0
465,155,586,07.03.2022,07.03.2022,0.0
466,156,248,07.03.2022,15.03.2022,3.0
467,156,407,07.03.2022,11.03.2022,2.0
468,156,794,07.03.2022,19.03.2022,3.0
469,157,605,07.03.2022,12.03.2022,2.5
470,157,619,07.03.2022,12.03.2022,2.5
471,157,690,07.03.2022,07.03.2022,0.0
472,158,225,07.03.2022,07.03.2022,0.0
473,158,582,07.03.2022,13.03.2022,3.0
474,158,700,07.03.2022,07.03.2022,0.0
475,159,95,07.03.2022,12.03.2022,2.5
476,159,110,07.03.2022,17.03.2022,3.0
477,159,418,07.03.2022,13.03.2022,3.0
478,160,174,07.03.2022,19.03.2022,3.0
479,160,303,07.03.2022,19.03.2022,3.0
480,160,767,07.03.2022,07.03.2022,0.0
481,161,76,07.03.2022,08.03.2022,0.5
482,161,219,07.03.2022,10.03.2022,1.5
483,161,302,07.03.2022,13.03.2022,3.0
484,162,242,07.03.2022,15.03.2022,3.0
485,162,451,07.03.2022,12.03.2022,2.5
486,162,488,07.03.2022,10.03.2022,1.5
487,163,68,07.03.2022,18.03.2022,3.0
488,163,320,07.03.2022,17.03.2022,3.0
489,163,663,07.03.2022,19.03.2022,3.0
490,164,232,07.03.2022,17.03.2022,3.0
491,164,602,07.03.2022,14.03.2022,3.0
492,164,711,07.03.2022,19.03.2022,3.0
493,165,108,07.03.2022,16.03.2022,3.0
494,165,231,07.03.2022,16.03.2022,3.0
495,165,590,07.03.2022,07.03.2022,0.0
496,166,12,07.03.2022,19.03.2022,3.0
497,166,129,07.03.2022,10.03.2022,1.5
498,166,457,07.03.2022,13.03.2022,3.0
499,167,369,07.03.2022,13.03.2022,3.0
500,167,375,07.03.2022,07.03.2022,0.0
501,167,782,07.03.2022,19.03.2022,3.0
502,168,647,07.03.2022,21.03.2022,3.0
503,168,648,07.03.2022,16.03.2022,3.0
504,168,732,07.03.2022,10.03.2022,1.5
505,169,244,07.03.2022,17.03.2022,3.0
506,169,512,07.03.2022,14.03.2022,3.0
507,169,716,07.03.2022,19.03.2022,3.0
508,170,83,07.03.2022,21.03.2022,3.0
509,170,486,07.03.2022,16.03.2022,3.0
510,170,676,07.03.2022,07.03.2022,0.0
511,171,33,07.03.2022,10.03.2022,1.5
512,171,300,07.03.2022,07.03.2022,0.0
513,171,381,07.03.2022,10.03.2022,1.5
514,172,107,07.03.2022,15.03.2022,3.0
515,172,190,07.03.2022,12.03.2022,2.5
516,172,309,07.03.2022,16.03.2022,3.0
517,173,410,08.03.2022,13.03.2022,2.5
518,173,546,08.03.2022,11.03.2022,1.5
519,173,724,08.03.2022,14.03.2022,3.0
520,174,123,08.03.2022,08.03.2022,0.0
521,174,427,08.03.2022,10.03.2022,1.0
522,174,672,08.03.2022,17.03.2022,3.0
523,175,218,08.03.2022,22.03.2022,3.0
524,175,518,08.03.2022,15.03.2022,3.0
525,175,774,08.03.2022,08.03.2022,0.0
526,176,554,08.03.2022,22.03.2022,3.0
527,176,587,08.03.2022,12.03.2022,2.0
528,176,713,08.03.2022,17.03.2022,3.0
529,177,17,08.03.2022,16.03.2022,3.0
530,177,228,08.03.2022,08.03.2022,0.0
531,177,571,08.03.2022,14.03.2022,3.0
532,178,184,08.03.2022,21.03.2022,3.0
533,178,316,08.03.2022,16.03.2022,3.0
534,178,795,08.03.2022,08.03.2022,0.0
535,179,14,08.03.2022,13.03.2022,2.5
536,179,25,08.03.2022,13.03.2022,2.5
537,179,730,08.03.2022,08.03.2022,0.0
538,180,292,08.03.2022,09.03.2022,0.5
539,180,298,08.03.2022,10.03.2022,1.0
540,180,640,08.03.2022,08.03.2022,0.0
541,181,96,08.03.2022,14.03.2022,3.0
542,181,443,08.03.2022,09.03.2022,0.5
543,181,653,08.03.2022,17.03.2022,3.0
544,182,31,08.03.2022,12.03.2022,2.0
545,182,226,08.03.2022,13.03.2022,2.5
546,182,626,08.03.2022,14.03.2022,3.0
547,183,75,08.03.2022,08.03.2022,0.0
548,183,304,08.03.2022,10.03.2022,1.0
549,183,603,08.03.2022,20.03.2022,3.0
550,184,356,08.03.2022,13.03.2022,2.5
551,184,534,08.03.2022,17.03.2022,3.0
552,184,734,08.03.2022,11.03.2022,1.5
553,185,233,08.03.2022,22.03.2022,3.0
554,185,425,08.03.2022,18.03.2022,3.0
555,185,435,08.03.2022,08.03.2022,0.0
556,186,378,08.03.2022,11.03.2022,1.5
557,186,493,08.03.2022,19.03.2022,3.0
558,186,751,08.03.2022,11.03.2022,1.5
559,187,35,08.03.2022,13.03.2022,2.5
560,187,454,08.03.2022,13.03.2022,2.5
561,187,556,08.03.2022,14.03.2022,3.0
562,188,216,08.03.2022,20.03.2022,3.0
563,188,698,08.03.2022,12.03.2022,2.0
564,188,787,08.03.2022,11.03.2022,1.5
565,189,52,08.03.2022,18.03.2022,3.0
566,189,198,08.03.2022,11.03.2022,1.5
567,189,489,08.03.2022,11.03.2022,1.5
568,190,88,08.03.2022,12.03.2022,2.0
569,190,142,08.03.2022,16.03.2022,3.0
570,190,163,08.03.2022,08.03.2022,0.0
571,191,359,08.03.2022,22.03.2022,3.0
572,191,430,08.03.2022,13.03.2022,2.5
573,191,439,08.03.2022,20.03.2022,3.0
574,192,332,08.03.2022,16.03.2022,3.0
575,192,660,08.03.2022,08.03.2022,0.0
576,192,733,08.03.2022,11.03.2022,1.5
577,193,201,08.03.2022,20.03.2022,3.0
578,193,446,08.03.2022,21.03.2022,3.0
579,193,563,08.03.2022,20.03.2022,3.0
580,194,345,08.03.2022,08.03.2022,0.0
581,194,406,08.03.2022,19.03.2022,3.0
582,194,519,08.03.2022,11.03.2022,1.5
583,195,34,08.03.2022,15.03.2022,3.0
584,195,186,08.03.2022,17.03.2022,3.0
585,195,299,08.03.2022,08.03.2022,0.0
586,196,146,08.03.2022,19.03.2022,3.0
587,196,340,08.03.2022,13.03.2022,2.5
588,196,349,08.03.2022,20.03.2022,3.0
589,197,258,08.03.2022,20.03.2022,3.0
590,197,283,08.03.2022,13.03.2022,2.5
591,197,743,08.03.2022,11.03.2022,1.5
592,198,328,08.03.2022,09.03.2022,0.5
593,198,371,08.03.2022,21.03.2022,3.0
594,198,714,08.03.2022,14.03.2022,3.0
595,199,268,08.03.2022,18.03.2022,3.0
596,199,305,08.03.2022,18.03.2022,3.0
597,199,481,09.03.2022,21.03.2022,3.0
598,200,44,09.03.2022,11.03.2022,1.0
599,200,470,09.03.2022,19.03.2022,3.0
600,200,800,09.03.2022,09.03.2022,0.0
601,201,441,09.03.2022,15.03.2022,3.0
602,201,477,09.03.2022,18.03.2022,3.0
603,202,279,09.03.2022,21.03.2022,3.0
604,202,796,09.03.2022,13.03.2022,2.0
605,203,450,09.03.2022,09.03.2022,0.0
606,203,764,09.03.2022,18.03.2022,3.0
607,204,522,09.03.2022,18.03.2022,3.0
608,204,771,09.03.2022,12.03.2022,1.5
609,205,97,09.03.2022,12.03.2022,1.5
610,205,362,09.03.2022,14.03.2022,2.5
611,206,65,09.03.2022,19.03.2022,3.0
612,206,635,09.03.2022,09.03.2022,0.0
613,207,15,09.03.2022,09.03.2022,0.0
614,207,452,09.03.2022,22.03.2022,3.0
615,208,379,09.03.2022,09.03.2022,0.0
616,208,535,09.03.2022,19.03.2022,3.0
617,209,126,09.03.2022,21.03.2022,3.0
618,209,155,09.03.2022,09.03.2022,0.0
619,210,133,09.03.2022,16.03.2022,3.0
620,210,637,09.03.2022,14.03.2022,2.5
621,211,649,09.03.2022,18.03.2022,3.0
622,211,704,09.03.2022,17.03.2022,3.0
623,212,192,09.03.2022,15.03.2022,3.0
624,212,444,09.03.2022,15.03.2022,3.0
625,213,72,09.03.2022,09.03.2022,0.0
626,213,195,09.03.2022,09.03.2022,0.0
627,214,202,09.03.2022,18.03.2022,3.0
628,214,756,09.03.2022,12.03.2022,1.5
629,215,187,09.03.2022,17.03.2022,3.0
630,215,658,09.03.2022,09.03.2022,0.0
631,216,194,09.03.2022,23.03.2022,3.0
632,216,661,09.03.2022,11.03.2022,1.0
633,217,5,09.03.2022,09.03.2022,0.0
634,217,380,09.03.2022,14.03.2022,2.5
635,218,182,09.03.2022,19.03.2022,3.0
636,218,692,09.03.2022,21.03.2022,3.0
637,219,367,09.03.2022,13.03.2022,2.0
638,219,510,09.03.2022,09.03.2022,0.0
639,220,57,09.03.2022,12.03.2022,1.5
640,220,557,09.03.2022,14.03.2022,2.5
641,221,296,09.03.2022,10.03.2022,0.5
642,221,699,09.03.2022,12.03.2022,1.5
643,222,540,09.03.2022,09.03.2022,0.0
644,222,748,09.03.2022,11.03.2022,1.0
645,223,385,09.03.2022,09.03.2022,0.0
646,223,608,09.03.2022,17.03.2022,3.0
647,224,183,09.03.2022,15.03.2022,3.0
648,224,746,09.03.2022,12.03.2022,1.5
649,225,255,09.03.2022,09.03.2022,0.0
650,225,478,09.03.2022,14.03.2022,2.5
651,226,116,09.03.2022,15.03.2022,3.0
652,226,409,09.03.2022,22.03.2022,3.0
653,227,475,09.03.2022,14.03.2022,2.5
654,227,553,09.03.2022,21.03.2022,3.0
655,228,366,09.03.2022,09.03.2022,0.0
656,228,772,09.03.2022,11.03.2022,1.0
657,229,434,09.03.2022,12.03.2022,1.5
658,229,629,09.03.2022,11.03.2022,1.0
659,230,621,09.03.2022,18.03.2022,3.0
660,230,739,09.03.2022,09.03.2022,0.0
661,231,49,09.03.2022,13.03.2022,2.0
662,231,272,09.03.2022,13.03.2022,2.0
663,232,420,09.03.2022,09.03.2022,0.0
664,232,719,09.03.2022,20.03.2022,3.0
665,233,40,09.03.2022,14.03.2022,2.5
666,233,769,09.03.2022,18.03.2022,3.0
667,234,134,09.03.2022,17.03.2022,3.0
668,234,527,10.03.2022,11.03.2022,0.5
669,235,20,10.03.2022,10.03.2022,0.0
670,235,585,10.03.2022,10.03.2022,0.0
671,236,47,10.03.2022,17.03.2022,3.0
672,236,322,10.03.2022,19.03.2022,3.0
673,237,73,10.03.2022,14.03.2022,2.0
674,237,740,10.03.2022,20.03.2022,3.0
675,238,243,10.03.2022,10.03.2022,0.0
676,238,790,10.03.2022,20.03.2022,3.0
677,239,131,10.03.2022,17.03.2022,3.0
678,239,347,10.03.2022,16.03.2022,3.0
679,240,319,10.03.2022,11.03.2022,0.5
680,240,760,10.03.2022,15.03.2022,2.5
681,241,91,10.03.2022,16.03.2022,3.0
682,241,684,10.03.2022,13.03.2022,1.5
683,242,151,10.03.2022,18.03.2022,3.0
684,242,515,10.03.2022,10.03.2022,0.0
685,243,41,10.03.2022,15.03.2022,2.5
686,243,428,10.03.2022,23.03.2022,3.0
687,244,168,10.03.2022,16.03.2022,3.0
688,244,236,10.03.2022,18.03.2022,3.0
689,245,70,10.03.2022,15.03.2022,2.5
690,245,311,10.03.2022,10.03.2022,0.0
691,246,61,10.03.2022,11.03.2022,0.5
692,246,511,10.03.2022,12.03.2022,1.0
693,247,257,10.03.2022,16.03.2022,3.0
694,247,642,10.03.2022,13.03.2022,1.5
695,248,317,10.03.2022,20.03.2022,3.0
696,248,459,10.03.2022,19.03.2022,3.0
697,249,152,10.03.2022,24.03.2022,3.0
698,249,223,10.03.2022,24.03.2022,3.0
699,250,294,10.03.2022,16.03.2022,3.0
700,250,479,10.03.2022,15.03.2022,2.5
701,251,247,10.03.2022,12.03.2022,1.0
702,251,798,10.03.2022,16.03.2022,3.0
703,252,467,10.03.2022,21.03.2022,3.0
704,252,688,10.03.2022,12.03.2022,1.0
705,253,196,10.03.2022,10.03.2022,0.0
706,253,612,10.03.2022,22.03.2022,3.0
707,254,99,10.03.2022,13.03.2022,1.5
708,254,655,10.03.2022,10.03.2022,0.0
709,255,249,10.03.2022,16.03.2022,3.0
710,255,404,10.03.2022,20.03.2022,3.0
711,256,235,10.03.2022,10.03.2022,0.0
712,256,753,10.03.2022,16.03.2022,3.0
713,257,508,10.03.2022,24.03.2022,3.0
714,257,702,10.03.2022,13.03.2022,1.5
715,258,561,10.03.2022,10.03.2022,0.0
716,258,703,10.03.2022,18.03.2022,3.0
717,259,54,10.03.2022,13.03.2022,1.5
718,259,390,10.03.2022,10.03.2022,0.0
719,260,3,10.03.2022,22.03.2022,3.0
720,260,537,10.03.2022,10.03.2022,0.0
721,261,4,10.03.2022,14.03.2022,2.0
722,261,578,10.03.2022,11.03.2022,0.5
723,262,312,10.03.2022,16.03.2022,3.0
724,262,374,10.03.2022,21.03.2022,3.0
725,263,144,10.03.2022,10.03.2022,0.0
726,263,165,10.03.2022,10.03.2022,0.0
727,264,211,10.03.2022,17.03.2022,3.0
728,264,761,10.03.2022,23.03.2022,3.0
729,265,462,10.03.2022,13.03.2022,1.5
730,265,668,10.03.2022,15.03.2022,2.5
731,266,220,10.03.2022,15.03.2022,2.5
732,266,566,11.03.2022,23.03.2022,3.0
733,267,62,11.03.2022,22.03.2022,3.0
734,267,115,11.03.2022,16.03.2022,2.5
735,268,135,11.03.2022,11.03.2022,0.0
736,268,562,11.03.2022,18.03.2022,3.0
737,269,114,11.03.2022,14.03.2022,1.5
738,269,364,11.03.2022,23.03.2022,3.0
739,270,212,11.03.2022,19.03.2022,3.0
740,270,394,11.03.2022,16.03.2022,2.5
741,271,157,11.03.2022,23.03.2022,3.0
742,271,405,11.03.2022,11.03.2022,0.0
743,272,176,11.03.2022,24.03.2022,3.0
744,272,282,11.03.2022,14.03.2022,1.5
745,273,241,11.03.2022,21.03.2022,3.0
746,273,395,11.03.2022,21.03.2022,3.0
747,274,329,11.03.2022,14.03.2022,1.5
748,274,480,11.03.2022,11.03.2022,0.0
749,275,402,11.03.2022,14.03.2022,1.5
750,275,799,11.03.2022,11.03.2022,0.0
751,276,466,11.03.2022,12.03.2022,0.5
752,276,689,11.03.2022,24.03.2022,3.0
753,277,197,11.03.2022,17.03.2022,3.0
754,277,353,11.03.2022,13.03.2022,1.0
755,278,100,11.03.2022,16.03.2022,2.5
756,278,558,11.03.2022,14.03.2022,1.5
757,279,161,11.03.2022,13.03.2022,1.0
758,279,550,11.03.2022,16.03.2022,2.5
759,280,286,11.03.2022,20.03.2022,3.0
760,280,301,11.03.2022,21.03.2022,3.0
761,281,382,11.03.2022,13.03.2022,1.0
762,281,538,11.03.2022,17.03.2022,3.0
763,282,333,11.03.2022,20.03.2022,3.0
764,282,737,11.03.2022,24.03.2022,3.0
765,283,416,11.03.2022,11.03.2022,0.0
766,283,449,11.03.2022,25.03.2022,3.0
767,284,575,11.03.2022,21.03.2022,3.0
768,284,617,11.03.2022,17.03.2022,3.0
769,285,38,11.03.2022,13.03.2022,1.0
770,285,172,11.03.2022,16.03.2022,2.5
771,286,485,11.03.2022,11.03.2022,0.0
772,286,708,11.03.2022,17.03.2022,3.0
773,287,254,11.03.2022,18.03.2022,3.0
774,287,758,11.03.2022,23.03.2022,3.0
775,288,262,11.03.2022,21.03.2022,3.0
776,288,618,11.03.2022,14.03.2022,1.5
777,289,9,11.03.2022,14.03.2022,1.5
778,289,513,11.03.2022,20.03.2022,3.0
779,290,59,11.03.2022,12.03.2022,0.5
780,290,383,11.03.2022,11.03.2022,0.0
781,291,149,11.03.2022,25.03.2022,3.0
782,291,348,11.03.2022,17.03.2022,3.0
783,292,645,11.03.2022,11.03.2022,0.0
784,292,729,11.03.2022,17.03.2022,3.0
785,293,209,11.03.2022,21.03.2022,3.0
786,293,509,11.03.2022,20.03.2022,3.0
787,294,419,11.03.2022,19.03.2022,3.0
788,294,677,11.03.2022,12.03.2022,0.5
789,295,30,11.03.2022,11.03.2022,0.0
790,295,673,11.03.2022,21.03.2022,3.0
791,296,387,11.03.2022,23.03.2022,3.0
792,296,610,11.03.2022,11.03.2022,0.0
793,297,141,11.03.2022,14.03.2022,1.5
794,297,542,11.03.2022,24.03.2022,3.0
795,298,105,11.03.2022,11.03.2022,0.0
796,298,324,11.03.2022,20.03.2022,3.0
797,299,246,11.03.2022,23.03.2022,3.0
798,299,411,11.03.2022,14.03.2022,1.5
799,300,337,11.03.2022,24.03.2022,3.0
800,300,600,11.03.2022,11.03.2022,0.0
