{
	"accesslayer_priorization": 1,
	"additional_deployment_parameters": {
		"business_ruleset_hierarchy_level": 0
	},
	"alias_schema_id": null,
	"alias_view_nq_id": null,
	"business_rules_view_code": "Derived from column_nq_ids",
	"business_ruleset_comment": null,
	"business_ruleset_name": "Unaltered default",
	"business_ruleset_order": 1,
	"business_ruleset_suffix_id": null,
	"business_ruleset_view_id": "BUSINESS_RULES.CUSTOMER_S_WEB_C_SCD2",
	"column_nq_ids": [
		"CUSTOMER_BK",
		"CUSTOMER_H",
		"CUSTOMER_S_WEB_C_SCD2_H_BKLT",
		"CUSTOMER_S_WEB_C_SCD2_H_LT",
		"CUSTOMER_S_WEB_C_SCD2_H_LT_END",
		"DLS_CUSTOMER",
		"EMAIL",
		"FLVC_CUSTOMER",
		"FV_CUSTOMER",
		"GEBURTSDATUM",
		"GESCHLECHT",
		"GUELTIGBIS",
		"KKFIRMA",
		"KREDITKARTE",
		"KUNDEID",
		"LTS_CUSTOMER",
		"MOBIL",
		"NAME",
		"TELEFON",
		"VEREINSPARTNERID",
		"VORNAME"
	],
	"container_id": "H_CUSTOMER_C_SCD2",
	"dependent_objects": [
		{
			"object_id": "BUSINESSOBJECTS.CUSTOMER_S_WEB_C_SCD2_H",
			"object_type": "business_object"
		}
	],
	"include_in_accesslayer": false,
	"is_error_ruleset": false,
	"is_unaltered_business_ruleset": true,
	"quick_inserts": {
		"quick_insert_list": [
			{
				"quick_insert_table_id": "BUSINESSOBJECTS.CUSTOMER_S_WEB_C_SCD2"
			}
		]
	},
	"system_id": "WEB"
}