BestellungID,PosID,ProduktID,SpezLieferAdrID,Menge,Preis
1538,3844,95,,4,2.0
1539,3845,17,1.0,3,3.5
1540,3846,68,,3,6.0
1541,3847,121,,11,4.0
1542,3848,49,,3,3.8
1543,3849,106,,6,7.0
1544,3850,38,,4,0.5
1545,3851,99,,9,3.8
1546,3852,35,,3,1.0
1547,3853,100,,8,5.6
1548,3854,40,,3,1.0
1549,3855,109,422.0,3,3.0
1550,3856,53,,4,5.0
1551,3857,126,,6,4.0
1552,3858,74,,3,3.0
1553,3859,24,,3,3.0
1554,3860,103,588.0,3,5.0
1555,3861,57,,3,8.0
1556,3862,13,,8,4.5
1557,3863,98,,6,4.5
1558,3864,58,,3,8.0
1559,3865,20,,4,8.0
1560,3866,111,,3,8.0
1561,3867,77,,3,2.0
1562,3868,45,,3,2.0
1563,3869,15,,9,4.5
1564,3870,114,,3,4.5
1565,3871,88,,8,0.5
1566,3872,64,,3,4.5
1567,3873,42,,6,2.4
1568,3874,22,,8,2.0
1569,3875,4,469.0,3,5.0
1570,3876,115,,3,4.5
1571,3877,101,,7,2.0
1572,3878,89,,3,0.8
1573,3879,79,,9,1.5
1574,3880,71,173.0,4,4.0
1575,3881,65,,3,4.5
1576,3882,61,,3,8.0
1577,3883,59,,1,3.0
1578,3884,59,,3,3.0
1579,3885,61,50.0,3,8.0
1580,3886,65,,4,4.5
1581,3887,71,,9,4.0
1582,3888,79,,3,1.5
1583,3889,89,,7,0.8
1584,3890,101,,3,2.0
1585,3891,115,,9,4.5
1586,3892,4,,8,5.0
1587,3893,22,,6,2.0
1588,3894,42,,3,2.4
1589,3895,64,447.0,8,4.5
1590,3896,88,,3,0.5
1591,3897,114,,6,4.5
1592,3898,15,,3,4.5
1593,3899,45,,3,2.0
1594,3900,77,259.0,3,2.0
1595,3901,111,,9,8.0
1596,3902,20,,3,8.0
1597,3903,58,,6,8.0
1598,3904,98,,4,4.5
1599,3905,13,56.0,3,4.5
1600,3906,57,,3,8.0
1601,3907,103,,5,5.0
1602,3908,24,,3,3.0
1603,3909,74,,6,3.0
1604,3910,126,482.0,3,4.0
1605,3911,53,,3,5.0
1606,3912,109,,3,3.0
1607,3913,40,,8,1.0
1608,3914,100,,3,5.6
1609,3915,35,85.0,9,1.0
1610,3916,99,,3,3.8
1611,3917,38,,6,0.5
1612,3918,106,,3,7.0
1613,3919,49,,11,3.8
1614,3920,121,,3,4.0
1615,3921,68,,3,6.0
1616,3922,17,,4,3.5
1617,3923,95,,9,2.0
1618,3924,48,,3,4.5
1619,3925,3,251.0,9,5.0
1620,3926,87,,3,0.5
1621,3927,46,,6,8.0
1622,3928,7,,8,8.0
1623,3929,97,,3,9.0
1624,3930,62,77.0,3,4.0
1625,3931,29,,7,1.5
1626,3932,125,,3,7.0
1627,3933,96,,3,8.0
1628,3934,69,,3,2.0
1629,3935,44,,3,4.0
1630,3936,21,,3,4.0
1631,3937,1,,11,2.0
1632,3938,108,,3,8.0
1633,3939,91,,9,1.2
1634,3940,76,523.0,8,4.0
1635,3941,63,,9,4.5
1636,3942,52,,3,4.0
1637,3943,43,,5,2.3
1638,3944,36,,3,0.5
1639,3945,31,19.0,9,2.0
1640,3946,28,,8,2.0
1641,3947,27,,9,2.0
1642,3948,28,,3,2.0
1643,3949,31,,5,2.0
1644,3950,36,,3,0.5
1645,3951,43,,9,2.3
1646,3952,52,,8,4.0
1647,3953,63,,9,4.5
1648,3954,76,,3,4.0
1649,3955,91,290.0,5,1.2
1650,3956,108,,3,8.0
1651,3957,1,,3,2.0
1652,3958,21,,3,4.0
1653,3959,44,,3,4.0
1654,3960,69,169.0,3,2.0
1655,3961,96,,3,8.0
1656,3962,125,,3,7.0
1657,3963,29,,3,1.5
1658,3964,62,,4,4.0
1659,3965,97,616.0,3,9.0
1660,3966,7,,3,8.0
1661,3967,46,,2,8.0
1662,3968,87,,3,0.5
1663,3969,3,,9,5.0
1664,3970,48,357.0,3,4.5
1665,3971,95,,9,2.0
1666,3972,17,,3,3.5
1667,3973,68,,4,6.0
1668,3974,121,,3,4.0
1669,3975,49,,3,3.8
1670,3976,106,,8,7.0
1671,3977,38,,6,0.5
1672,3978,99,,3,3.8
1673,3979,35,,1,1.0
1674,3980,100,280.0,3,5.6
1675,3981,40,,3,1.0
1676,3982,109,,8,3.0
1677,3983,53,,3,5.0
1678,3984,126,,3,4.0
1679,3985,74,206.0,10,3.0
1680,3986,24,,3,3.0
1681,3987,103,,9,5.0
1682,3988,57,,3,8.0
1683,3989,13,,3,4.5
1684,3990,98,,3,4.5
1685,3991,58,,2,8.0
1686,3992,20,,3,8.0
1687,3993,111,,9,8.0
1688,3994,77,,4,2.0
1689,3995,45,,3,2.0
1690,3996,15,,3,4.5
1691,3997,114,,6,4.5
1692,3998,88,,3,0.5
1693,3999,64,,3,4.5
1694,4000,42,,3,2.4
1695,4001,22,,6,2.0
1696,4002,4,,3,5.0
1697,4003,115,,5,4.5
1698,4004,101,,3,2.0
1699,4005,89,343.0,3,0.8
1700,4006,79,,8,1.5
1701,4007,71,,9,4.0
1702,4008,65,,3,4.5
1703,4009,61,,11,8.0
1704,4010,59,102.0,3,3.0
1705,4011,59,,9,3.0
1706,4012,61,,8,8.0
1707,4013,65,,3,4.5
1708,4014,71,,3,4.0
1709,4015,79,,5,1.5
1710,4016,89,,3,0.8
1711,4017,101,,3,2.0
1712,4018,115,,8,4.5
1713,4019,4,,3,5.0
1714,4020,22,633.0,3,2.0
1715,4021,42,,6,2.4
1716,4022,64,,3,4.5
1717,4023,88,,3,0.5
1718,4024,114,,3,4.5
1719,4025,15,26.0,9,4.5
1720,4026,45,,3,2.0
1721,4027,77,,7,2.0
1722,4028,111,,3,8.0
1723,4029,20,,3,8.0
1724,4030,58,,8,8.0
1725,4031,98,,6,4.5
1726,4032,13,,3,4.5
1727,4033,57,,3,8.0
1728,4034,103,,3,5.0
1729,4035,24,82.0,3,3.0
1730,4036,74,,4,3.0
1731,4037,126,,6,4.0
1732,4038,53,,3,5.0
1733,4039,109,,11,3.0
1734,4040,40,605.0,3,1.0
1735,4041,100,,3,5.6
1736,4042,35,,4,1.0
1737,4043,99,,9,3.8
1738,4044,38,,3,0.5
1739,4045,106,700.0,2,7.0
1740,4046,49,,3,3.8
1741,4047,121,,3,4.0
1742,4048,68,,4,6.0
1743,4049,17,,3,3.5
1744,4050,95,174.0,3,2.0
1745,4051,48,,3,4.5
1746,4052,3,,3,5.0
1747,4053,87,,9,0.5
1748,4054,46,,8,8.0
1749,4055,7,,9,8.0
1750,4056,97,,3,9.0
1751,4057,62,,10,4.0
1752,4058,29,,3,1.5
1753,4059,125,,3,7.0
1754,4060,96,320.0,3,8.0
1755,4061,69,,3,2.0
1756,4062,44,,3,4.0
1757,4063,21,,3,4.0
1758,4064,1,,3,2.0
1759,4065,108,108.0,3,8.0
1760,4066,91,,8,1.2
1761,4067,76,,3,4.0
1762,4068,63,,3,4.5
1763,4069,52,,8,4.0
1764,4070,43,,3,2.3
1765,4071,36,,3,0.5
1766,4072,31,,8,2.0
1767,4073,28,,3,2.0
1768,4074,27,,3,2.0
1769,4075,28,648.0,8,2.0
1770,4076,31,,3,2.0
1771,4077,36,,3,0.5
1772,4078,43,,8,2.3
1773,4079,52,,3,4.0
1774,4080,63,83.0,3,4.5
1775,4081,76,,8,4.0
1776,4082,91,,3,1.2
1777,4083,108,,3,8.0
1778,4084,1,,8,2.0
1779,4085,21,,3,4.0
1780,4086,44,,3,4.0
1781,4087,69,,3,2.0
1782,4088,96,,3,8.0
1783,4089,125,,3,7.0
1784,4090,29,546.0,4,1.5
1785,4091,62,,6,4.0
1786,4092,97,,3,9.0
1787,4093,7,,5,8.0
1788,4094,46,,3,8.0
1789,4095,87,698.0,9,0.5
1790,4096,3,,3,5.0
1791,4097,48,,3,4.5
1792,4098,95,,3,2.0
1793,4099,17,,7,3.5
1794,4100,68,88.0,3,6.0
1795,4101,121,,3,4.0
1796,4102,49,,8,3.8
1797,4103,106,,6,7.0
1798,4104,38,,3,0.5
1799,4105,99,,9,3.8
1800,4106,35,,3,1.0
1801,4107,100,,3,5.6
1802,4108,40,,8,1.0
1803,4109,109,,3,3.0
1804,4110,53,446.0,3,5.0
1805,4111,126,,6,4.0
1806,4112,74,,3,3.0
1807,4113,24,,3,3.0
1808,4114,103,,8,5.0
1809,4115,57,34.0,3,8.0
1810,4116,13,,3,4.5
1811,4117,98,,10,4.5
1812,4118,58,,3,8.0
1813,4119,20,,3,8.0
1814,4120,111,,3,8.0
1815,4121,77,,3,2.0
1816,4122,45,,3,2.0
1817,4123,15,,9,4.5
1818,4124,114,,3,4.5
1819,4125,88,371.0,3,0.5
1820,4126,64,,8,4.5
1821,4127,42,,6,2.4
1822,4128,22,,3,2.0
1823,4129,4,,8,5.0
1824,4130,115,44.0,3,4.5
1825,4131,101,,3,2.0
1826,4132,89,,4,0.8
1827,4133,79,,9,1.5
1828,4134,71,,3,4.0
1829,4135,65,279.0,7,4.5
1830,4136,61,,3,8.0
1831,4137,59,,9,3.0
1832,4138,59,,4,3.0
1833,4139,61,,3,8.0
1834,4140,65,522.0,3,4.5
1835,4141,71,,1,4.0
1836,4142,79,,3,1.5
1837,4143,89,,3,0.8
1838,4144,101,,4,2.0
1839,4145,115,,9,4.5
1840,4146,4,,3,5.0
1841,4147,22,,2,2.0
1842,4148,42,,3,2.4
1843,4149,64,,3,4.5
1844,4150,88,126.0,8,0.5
1845,4151,114,,6,4.5
1846,4152,15,,3,4.5
1847,4153,45,,3,2.0
1848,4154,77,,3,2.0
1849,4155,111,,9,8.0
1850,4156,20,,4,8.0
1851,4157,58,,6,8.0
1852,4158,98,,3,4.5
1853,4159,13,,11,4.5
1854,4160,57,202.0,3,8.0
1855,4161,103,,9,5.0
1856,4162,24,,3,3.0
1857,4163,74,,6,3.0
1858,4164,126,,3,4.0
1859,4165,53,,7,5.0
1860,4166,109,,3,3.0
1861,4167,40,,3,1.0
1862,4168,100,,8,5.6
1863,4169,35,,9,1.0
1864,4170,99,367.0,3,3.8
1865,4171,38,,10,0.5
1866,4172,106,,3,7.0
1867,4173,49,,3,3.8
1868,4174,121,,8,4.0
1869,4175,68,,3,6.0
1870,4176,17,,3,3.5
1871,4177,95,,1,2.0
1872,4178,48,,3,4.5
1873,4179,3,,9,5.0
1874,4180,87,183.0,3,0.5
1875,4181,46,,6,8.0
1876,4182,7,,3,8.0
1877,4183,97,,11,9.0
1878,4184,62,,3,4.0
1879,4185,29,,3,1.5
1880,4186,125,,4,7.0
1881,4187,96,,3,8.0
1882,4188,69,,3,2.0
1883,4189,44,,4,4.0
1884,4190,21,235.0,3,4.0
1885,4191,1,,3,2.0
1886,4192,108,,3,8.0
1887,4193,91,,9,1.2
1888,4194,76,,3,4.0
1889,4195,63,,9,4.5
1890,4196,52,,3,4.0
1891,4197,43,,9,2.3
1892,4198,36,,3,0.5
1893,4199,31,,9,2.0
1894,4200,28,4.0,3,2.0
1895,4201,27,,9,2.0
1896,4202,28,,3,2.0
1897,4203,31,,9,2.0
1898,4204,36,,3,0.5
1899,4205,43,,9,2.3
1900,4206,52,,3,4.0
1901,4207,63,,9,4.5
1902,4208,76,,3,4.0
1903,4209,91,,9,1.2
1904,4210,108,220.0,3,8.0
1905,4211,1,,3,2.0
1906,4212,21,,3,4.0
1907,4213,44,,4,4.0
1908,4214,69,,3,2.0
1909,4215,96,,3,8.0
1910,4216,125,,4,7.0
1911,4217,29,,3,1.5
1912,4218,62,,3,4.0
1913,4219,97,,11,9.0
1914,4220,7,,3,8.0
1915,4221,46,,6,8.0
1916,4222,87,,3,0.5
1917,4223,3,,9,5.0
1918,4224,48,,3,4.5
1919,4225,95,,1,2.0
1920,4226,17,,3,3.5
1921,4227,68,,3,6.0
1922,4228,121,,8,4.0
1923,4229,49,,3,3.8
1924,4230,106,,3,7.0
1925,4231,38,,10,0.5
1926,4232,99,,3,3.8
1927,4233,35,,9,1.0
1928,4234,100,,8,5.6
1929,4235,40,,3,1.0
1930,4236,109,,3,3.0
1931,4237,53,,7,5.0
1932,4238,126,,3,4.0
1933,4239,74,,6,3.0
1934,4240,24,843.0,3,3.0
1935,4241,103,,9,5.0
1936,4242,57,,3,8.0
1937,4243,13,,11,4.5
1938,4244,98,,3,4.5
1939,4245,58,,6,8.0
1940,4246,20,,4,8.0
1941,4247,111,,9,8.0
1942,4248,77,,3,2.0
1943,4249,45,,3,2.0
1944,4250,15,848.0,3,4.5
1945,4251,114,,6,4.5
1946,4252,88,,8,0.5
1947,4253,64,,3,4.5
1948,4254,42,,3,2.4
1949,4255,22,,2,2.0
1950,4256,4,,3,5.0
1951,4257,115,,9,4.5
1952,4258,101,,4,2.0
1953,4259,89,,3,0.8
1954,4260,79,918.0,3,1.5
1955,4261,71,,1,4.0
1956,4262,65,,3,4.5
1957,4263,61,,3,8.0
1958,4264,59,,4,3.0
1959,4265,59,,9,3.0
1960,4266,61,,3,8.0
1961,4267,65,,7,4.5
1962,4268,71,,3,4.0
1963,4269,79,,9,1.5
1964,4270,89,923.0,4,0.8
1965,4271,101,,3,2.0
1966,4272,115,,3,4.5
1967,4273,4,,8,5.0
1968,4274,22,,3,2.0
1969,4275,42,,6,2.4
1970,4276,64,,8,4.5
1971,4277,88,,3,0.5
1972,4278,114,,3,4.5
1973,4279,15,,9,4.5
1974,4280,45,928.0,3,2.0
1975,4281,77,,3,2.0
1976,4282,111,,3,8.0
1977,4283,20,,3,8.0
1978,4284,58,,3,8.0
1979,4285,98,,10,4.5
1980,4286,13,,3,4.5
1981,4287,57,,3,8.0
1982,4288,103,,8,5.0
1983,4289,24,,3,3.0
1984,4290,74,933.0,3,3.0
1985,4291,126,,6,4.0
1986,4292,53,,3,5.0
1987,4293,109,,3,3.0
1988,4294,40,,8,1.0
1989,4295,100,,3,5.6
1990,4296,35,,3,1.0
1991,4297,99,,9,3.8
1992,4298,38,,3,0.5
1993,4299,106,,6,7.0
1994,4300,49,938.0,8,3.8
1995,4301,121,,3,4.0
1996,4302,68,,3,6.0
1997,4303,17,,7,3.5
1998,4304,95,,3,2.0
1999,4305,48,,3,4.5
2000,4306,3,,3,5.0
2001,4307,87,,9,0.5
2002,4308,46,,3,8.0
2003,4309,7,,5,8.0
2004,4310,97,943.0,3,9.0
2005,4311,62,,6,4.0
2006,4312,29,,4,1.5
2007,4313,125,,3,7.0
2008,4314,96,,3,8.0
2009,4315,69,,3,2.0
2010,4316,44,,3,4.0
2011,4317,21,,3,4.0
2012,4318,1,,8,2.0
2013,4319,108,,3,8.0
2014,4320,91,948.0,3,1.2
2015,4321,76,,8,4.0
2016,4322,63,,3,4.5
2017,4323,52,,3,4.0
2018,4324,43,,8,2.3
2019,4325,36,,3,0.5
2020,4326,31,,3,2.0
2021,4327,28,,8,2.0
2022,4328,27,,3,2.0
2023,4329,28,,3,2.0
2024,4330,31,953.0,8,2.0
2025,4331,36,,3,0.5
2026,4332,43,,3,2.3
2027,4333,52,,8,4.0
2028,4334,63,,3,4.5
2029,4335,76,,3,4.0
2030,4336,91,,8,1.2
2031,4337,108,,3,8.0
2032,4338,1,,3,2.0
2033,4339,21,,3,4.0
2034,4340,44,958.0,3,4.0
2035,4341,69,,3,2.0
2036,4342,96,,3,8.0
2037,4343,125,,3,7.0
2038,4344,29,,3,1.5
2039,4345,62,,10,4.0
2040,4346,97,,3,9.0
2041,4347,7,,9,8.0
2042,4348,46,,8,8.0
2043,4349,87,,9,0.5
2044,4350,3,963.0,3,5.0
2045,4351,48,,3,4.5
2046,4352,95,,3,2.0
2047,4353,17,,3,3.5
2048,4354,68,,4,6.0
2049,4355,121,,3,4.0
2050,4356,49,,3,3.8
2051,4357,106,,2,7.0
2052,4358,38,,3,0.5
2053,4359,99,,9,3.8
2054,4360,35,968.0,4,1.0
2055,4361,100,,3,5.6
2056,4362,40,,3,1.0
2057,4363,109,,11,3.0
2058,4364,53,,3,5.0
2059,4365,126,,6,4.0
2060,4366,74,,4,3.0
2061,4367,24,,3,3.0
2062,4368,103,,3,5.0
801,2001,61,,9,8.0
801,2002,100,,3,5.6
801,2003,12,,3,4.0
802,2004,23,,3,3.0
802,2005,63,1.0,6,4.5
802,2006,103,,8,5.0
803,2007,118,,6,6.0
803,2008,32,,4,5.0
804,2009,50,,3,5.6
804,2010,92,,3,2.4
804,2011,7,,3,8.0
805,2012,29,,4,1.5
805,2013,72,,3,2.0
806,2014,97,,8,9.0
806,2015,14,631.0,8,4.5
806,2016,58,,3,8.0
807,2017,87,,9,0.5
807,2018,5,,6,5.0
808,2019,37,,3,0.5
808,2020,83,494.0,8,0.8
808,2021,2,,4,4.0
809,2022,38,,3,0.5
809,2023,85,,11,1.0
810,2024,124,,3,3.0
810,2025,45,,6,2.0
810,2026,93,,3,2.3
811,2027,9,,9,3.0
811,2028,58,,3,8.0
812,2029,104,,4,5.0
812,2030,27,422.0,3,2.0
812,2031,77,,3,2.0
813,2032,1,,3,2.0
813,2033,51,,3,2.0
814,2034,104,,3,5.0
814,2035,29,287.0,2,1.5
814,2036,81,,3,2.0
815,2037,11,,9,8.0
815,2038,64,,8,4.5
816,2039,124,,3,3.0
816,2040,51,,3,2.0
816,2041,105,,3,5.0
817,2042,42,,3,2.4
817,2043,97,,3,9.0
818,2044,37,,8,0.5
818,2045,93,589.0,6,2.3
818,2046,22,,3,2.0
819,2047,93,,9,2.3
819,2048,23,,3,3.0
820,2049,97,,3,9.0
820,2050,28,263.0,4,2.0
820,2051,86,,4,0.5
821,2052,37,,3,0.5
821,2053,96,,3,8.0
822,2054,50,,3,5.6
822,2055,110,,3,0.5
822,2056,43,,3,2.3
823,2057,1,,11,2.0
823,2058,62,,3,4.0
824,2059,23,,4,3.0
824,2060,85,,4,1.0
824,2061,20,,3,8.0
825,2062,112,,3,4.0
825,2063,48,,3,4.5
826,2064,16,,3,3.0
826,2065,80,,8,4.0
826,2066,17,,4,3.5
827,2067,116,,3,3.0
827,2068,54,,3,5.0
828,2069,29,,3,1.5
828,2070,95,615.0,3,2.0
828,2071,34,,3,0.75
829,2072,13,,8,4.5
829,2073,80,,3,4.0
830,2074,62,,4,4.0
830,2075,3,147.0,6,5.0
830,2076,71,,3,4.0
831,2077,57,,3,8.0
831,2078,126,,3,4.0
832,2079,115,,3,4.5
832,2080,58,,4,8.0
832,2081,1,,8,2.0
833,2082,121,,6,4.0
833,2083,65,,7,4.5
834,2084,61,,3,8.0
834,2085,6,291.0,3,7.0
834,2086,78,,3,2.0
835,2087,78,,6,2.0
835,2088,24,,3,3.0
836,2089,27,,3,2.0
836,2090,101,103.0,8,2.0
836,2091,48,,3,4.5
837,2092,55,,3,5.0
837,2093,3,,3,5.0
838,2094,13,,3,4.5
838,2095,89,,2,0.8
838,2096,38,,4,0.5
839,2097,52,,3,4.0
839,2098,2,,4,4.0
840,2099,19,,3,2.0
840,2100,97,313.0,3,9.0
840,2101,48,,3,4.5
841,2102,69,,6,2.0
841,2103,21,,3,4.0
842,2104,45,,3,2.0
842,2105,125,77.0,2,7.0
842,2106,78,,3,2.0
843,2107,106,,6,7.0
843,2108,60,,3,0.5
844,2109,91,,3,1.2
844,2110,46,,4,8.0
844,2111,1,,8,2.0
845,2112,36,,3,0.5
845,2113,119,,7,2.0
846,2114,30,,3,4.0
846,2115,114,495.0,3,4.5
846,2116,71,,3,4.0
847,2117,113,,7,4.5
847,2118,71,,6,4.0
848,2119,116,,4,3.0
848,2120,75,417.0,3,7.0
848,2121,34,,3,0.75
849,2122,83,,6,0.8
849,2123,43,,9,2.3
850,2124,95,,3,2.0
850,2125,56,,8,7.0
850,2126,17,,4,3.5
851,2127,73,,9,3.0
851,2128,35,,4,1.0
852,2129,94,,3,4.0
852,2130,57,222.0,3,8.0
852,2131,20,,3,8.0
853,2132,83,,4,0.8
853,2133,47,,3,9.0
854,2134,113,,4,4.5
854,2135,78,200.0,3,2.0
854,2136,43,,3,2.3
855,2137,113,,3,4.5
855,2138,79,,6,1.5
856,2139,25,,3,7.0
856,2140,119,,8,2.0
856,2141,86,,4,0.5
857,2142,36,,3,0.5
857,2143,4,,8,5.0
858,2144,84,,3,0.75
858,2145,53,238.0,6,5.0
858,2146,22,,3,2.0
859,2147,106,,2,7.0
859,2148,76,,3,4.0
860,2149,36,,3,0.5
860,2150,7,289.0,4,8.0
860,2151,105,,3,5.0
861,2152,69,,3,2.0
861,2153,41,,9,1.2
862,2154,8,,3,8.0
862,2155,108,,3,8.0
862,2156,81,,3,2.0
863,2157,52,,3,4.0
863,2158,26,,4,4.0
864,2159,1,,3,2.0
864,2160,102,429.0,3,4.0
864,2161,77,,3,2.0
865,2162,55,,2,5.0
865,2163,31,,9,2.0
866,2164,12,,3,4.0
866,2165,116,215.0,8,3.0
866,2166,93,,3,2.3
867,2167,78,,6,2.0
867,2168,56,,3,7.0
868,2169,44,,3,4.0
868,2170,23,,8,3.0
868,2171,2,,4,4.0
869,2172,121,,3,4.0
869,2173,101,,1,2.0
870,2174,96,,3,8.0
870,2175,77,372.0,6,2.0
870,2176,58,,3,8.0
871,2177,57,,3,8.0
871,2178,39,,6,0.8
872,2179,41,,4,1.2
872,2180,24,487.0,3,3.0
872,2181,7,,3,8.0
873,2182,13,,6,4.5
873,2183,124,,3,3.0
874,2184,6,,3,7.0
874,2185,118,,4,6.0
874,2186,103,,8,5.0
875,2187,116,,3,3.0
875,2188,102,,3,4.0
876,2189,118,,3,6.0
876,2190,105,502.0,3,5.0
876,2191,92,,3,2.4
877,2192,112,,8,4.0
877,2193,100,,3,5.6
878,2194,123,,3,3.0
878,2195,112,516.0,4,4.0
878,2196,101,,3,2.0
879,2197,1,,3,2.0
879,2198,118,,3,6.0
880,2199,21,,3,4.0
880,2200,12,,3,4.0
880,2201,3,,3,5.0
881,2202,37,,6,0.5
881,2203,29,,7,1.5
882,2204,66,,3,3.0
882,2205,59,628.0,6,3.0
882,2206,52,,3,4.0
883,2207,93,,9,2.3
883,2208,87,,3,0.5
884,2209,4,,8,5.0
884,2210,126,159.0,3,4.0
884,2211,121,,3,4.0
885,2212,42,,3,2.4
885,2213,38,,6,0.5
886,2214,89,,3,0.8
886,2215,86,,8,0.5
886,2216,83,,4,0.8
887,2217,11,,9,8.0
887,2218,9,,6,3.0
888,2219,67,,3,3.5
888,2220,66,143.0,3,3.0
888,2221,65,,3,4.5
889,2222,1,,2,2.0
889,2223,1,,3,2.0
890,2224,65,,4,4.5
890,2225,66,32.0,3,3.0
890,2226,67,,3,3.5
891,2227,9,,9,3.0
891,2228,11,,3,8.0
892,2229,83,,3,0.8
892,2230,86,,8,0.5
892,2231,89,,4,0.8
893,2232,38,,3,0.5
893,2233,42,,6,2.4
894,2234,121,,3,4.0
894,2235,126,331.0,3,4.0
894,2236,4,,3,5.0
895,2237,87,,9,0.5
895,2238,93,,6,2.3
896,2239,52,,8,4.0
896,2240,59,210.0,8,3.0
896,2241,66,,3,3.0
897,2242,29,,6,1.5
897,2243,37,,3,0.5
898,2244,3,,3,5.0
898,2245,12,,3,4.0
898,2246,21,,3,4.0
899,2247,118,,6,6.0
899,2248,1,,8,2.0
900,2249,101,,3,2.0
900,2250,112,523.0,3,4.0
900,2251,123,,3,3.0
901,2252,100,,8,5.6
901,2253,112,,3,4.0
902,2254,92,,4,2.4
902,2255,105,355.0,6,5.0
902,2256,118,,3,6.0
903,2257,102,,6,4.0
903,2258,116,,3,3.0
904,2259,103,,3,5.0
904,2260,118,,4,6.0
904,2261,6,,3,7.0
905,2262,124,,3,3.0
905,2263,13,,11,4.5
906,2264,7,,3,8.0
906,2265,24,252.0,3,3.0
906,2266,41,,3,1.2
907,2267,39,,3,0.8
907,2268,57,,3,8.0
908,2269,58,,8,8.0
908,2270,77,336.0,8,2.0
908,2271,96,,3,8.0
909,2272,101,,3,2.0
909,2273,121,,9,4.0
910,2274,2,,3,4.0
910,2275,23,,2,3.0
910,2276,44,,4,4.0
911,2277,56,,3,7.0
911,2278,78,,3,2.0
912,2279,93,,3,2.3
912,2280,116,398.0,3,3.0
912,2281,12,,3,4.0
913,2282,31,,2,2.0
913,2283,55,,9,5.0
914,2284,77,,4,2.0
914,2285,102,28.0,3,4.0
914,2286,1,,3,2.0
915,2287,26,,6,4.0
915,2288,52,,3,4.0
916,2289,81,,3,2.0
916,2290,108,,3,8.0
916,2291,8,,4,8.0
917,2292,41,,3,1.2
917,2293,69,,9,2.0
918,2294,105,,3,5.0
918,2295,7,496.0,6,8.0
918,2296,36,,3,0.5
919,2297,76,,8,4.0
919,2298,106,,3,7.0
920,2299,22,,8,2.0
920,2300,53,117.0,8,5.0
920,2301,84,,3,0.75
921,2302,4,,3,5.0
921,2303,36,,3,0.5
922,2304,86,,3,0.5
922,2305,119,744.0,2,2.0
922,2306,25,,8,7.0
923,2307,79,,3,1.5
923,2308,113,,4,4.5
924,2309,43,,3,2.3
924,2310,78,78.0,3,2.0
924,2311,113,,3,4.5
925,2312,47,,4,9.0
925,2313,83,,3,0.8
926,2314,20,,4,8.0
926,2315,57,,6,8.0
926,2316,94,,3,4.0
927,2317,35,,9,1.0
927,2318,73,,6,3.0
928,2319,17,,3,3.5
928,2320,56,323.0,8,7.0
928,2321,95,,4,2.0
929,2322,43,,6,2.3
929,2323,83,,1,0.8
930,2324,34,,3,0.75
930,2325,75,265.0,6,7.0
930,2326,116,,3,3.0
931,2327,71,,7,4.0
931,2328,113,,3,4.5
932,2329,71,,4,4.0
932,2330,114,,3,4.5
932,2331,30,,3,4.0
933,2332,119,,3,2.0
933,2333,36,,3,0.5
934,2334,1,,3,2.0
934,2335,46,520.0,4,8.0
934,2336,91,,8,1.2
935,2337,60,,3,0.5
935,2338,106,,8,7.0
936,2339,78,,3,2.0
936,2340,125,342.0,3,7.0
936,2341,45,,3,2.0
937,2342,21,,6,4.0
937,2343,69,,3,2.0
938,2344,48,,3,4.5
938,2345,97,,10,9.0
938,2346,19,,3,2.0
939,2347,2,,6,4.0
939,2348,52,,3,4.0
940,2349,38,,3,0.5
940,2350,89,552.0,8,0.8
940,2351,13,,8,4.5
941,2352,3,,3,5.0
941,2353,55,,11,5.0
942,2354,48,,3,4.5
942,2355,101,66.0,6,2.0
942,2356,27,,3,2.0
943,2357,24,,3,3.0
943,2358,78,,3,2.0
944,2359,78,,3,2.0
944,2360,6,,3,7.0
944,2361,61,,3,8.0
945,2362,65,,6,4.5
945,2363,121,,3,4.0
946,2364,1,,3,2.0
946,2365,58,24.0,4,8.0
946,2366,115,,8,4.5
947,2367,126,,6,4.0
947,2368,57,,3,8.0
948,2369,71,,3,4.0
948,2370,3,,3,5.0
948,2371,62,,3,4.0
949,2372,80,,4,4.0
949,2373,13,,9,4.5
950,2374,34,,8,0.75
950,2375,95,654.0,2,2.0
950,2376,29,,3,1.5
951,2377,54,,6,5.0
951,2378,116,,3,3.0
952,2379,17,,3,3.5
952,2380,80,21.0,8,4.0
952,2381,16,,8,3.0
953,2382,48,,3,4.5
953,2383,112,,8,4.0
954,2384,20,,3,8.0
954,2385,85,,6,1.0
954,2386,23,,3,3.0
955,2387,62,,10,4.0
955,2388,1,,3,2.0
956,2389,43,,8,2.3
956,2390,110,74.0,8,0.5
956,2391,50,,3,5.6
957,2392,96,,3,8.0
957,2393,37,,9,0.5
958,2394,86,,3,0.5
958,2395,28,175.0,4,2.0
958,2396,97,,8,9.0
959,2397,23,,9,3.0
959,2398,93,,6,2.3
960,2399,22,,3,2.0
960,2400,93,,3,2.3
960,2401,37,,3,0.5
961,2402,97,,2,9.0
961,2403,42,,6,2.4
962,2404,105,,3,5.0
962,2405,51,360.0,6,2.0
962,2406,124,,3,3.0
963,2407,64,,3,4.5
963,2408,11,,3,8.0
964,2409,81,,3,2.0
964,2410,29,101.0,8,1.5
964,2411,104,,4,5.0
965,2412,51,,3,2.0
965,2413,1,,5,2.0
966,2414,77,,3,2.0
966,2415,27,,6,2.0
966,2416,104,,3,5.0
967,2417,58,,2,8.0
967,2418,9,,6,3.0
968,2419,93,,3,2.3
968,2420,45,622.0,3,2.0
968,2421,124,,3,3.0
969,2422,85,,6,1.0
969,2423,38,,6,0.5
970,2424,2,,3,4.0
970,2425,83,2.0,2,0.8
970,2426,37,,8,0.5
971,2427,5,,9,5.0
971,2428,87,,3,0.5
972,2429,58,,3,8.0
972,2430,14,,3,4.5
972,2431,97,,3,9.0
973,2432,72,,3,2.0
973,2433,29,,9,1.5
974,2434,7,,8,8.0
974,2435,92,224.0,8,2.4
974,2436,50,,3,5.6
975,2437,32,,3,5.0
975,2438,118,,3,6.0
976,2439,103,,3,5.0
976,2440,63,81.0,3,4.5
976,2441,23,,4,3.0
977,2442,12,,3,4.0
977,2443,100,,8,5.6
978,2444,92,,3,2.4
978,2445,54,,3,5.0
978,2446,16,,3,3.0
979,2447,12,,3,4.0
979,2448,102,,3,4.0
980,2449,101,,4,2.0
980,2450,65,221.0,8,4.5
980,2451,29,,3,1.5
981,2452,32,,3,5.0
981,2453,124,,3,3.0
982,2454,3,,3,5.0
982,2455,96,208.0,3,8.0
982,2456,62,,4,4.0
983,2457,72,,3,2.0
983,2458,39,,6,0.8
984,2459,52,,3,4.0
984,2460,20,,3,8.0
984,2461,115,,3,4.5
985,2462,5,,10,5.0
985,2463,101,,3,2.0
986,2464,121,,8,4.0
986,2465,91,596.0,10,1.2
986,2466,61,,3,8.0
987,2467,85,,9,1.0
987,2468,56,,3,7.0
988,2469,83,,3,0.8
988,2470,55,,4,5.0
988,2471,27,,3,2.0
989,2472,58,,3,8.0
989,2473,31,,11,2.0
990,2474,65,,3,4.5
990,2475,39,315.0,6,0.8
990,2476,13,,3,4.5
991,2477,51,,9,2.0
991,2478,26,,3,4.0
992,2479,67,,8,3.5
992,2480,43,145.0,4,2.3
992,2481,19,,3,2.0
993,2482,64,,3,4.5
993,2483,41,,3,1.2
994,2484,89,,3,0.8
994,2485,67,,10,3.5
994,2486,45,,3,2.0
995,2487,97,,9,9.0
995,2488,76,,8,4.0
996,2489,4,,3,5.0
996,2490,111,350.0,3,8.0
996,2491,91,,3,1.2
997,2492,23,,4,3.0
997,2493,4,,3,5.0
998,2494,66,,3,3.0
998,2495,48,426.0,3,4.5
998,2496,30,,3,4.0
999,2497,96,,3,8.0
999,2498,79,,6,1.5
1000,2499,21,,3,4.0
1000,2500,5,,8,5.0
1000,2501,116,,4,3.0
1001,2502,62,,3,4.0
1001,2503,47,,1,9.0
1002,2504,123,,3,3.0
1002,2505,109,391.0,6,3.0
1002,2506,95,,3,2.0
1003,2507,48,,3,4.5
1003,2508,35,,3,1.0
1004,2509,118,,8,6.0
1004,2510,106,87.0,4,7.0
1004,2511,94,,3,4.0
1005,2512,54,,3,5.0
1005,2513,43,,3,2.3
1006,2514,6,,3,7.0
1006,2515,123,,6,3.0
1006,2516,113,,4,4.5
1007,2517,80,,3,4.0
1007,2518,71,,10,4.0
1008,2519,41,,3,1.2
1008,2520,33,281.0,3,0.8
1008,2521,25,,3,7.0
1009,2522,126,,3,4.0
1009,2523,119,,9,2.0
1010,2524,96,,3,8.0
1010,2525,90,204.0,3,1.0
1010,2526,84,,3,0.75
1011,2527,65,,9,4.5
1011,2528,60,,3,0.5
1012,2529,44,,3,4.0
1012,2530,40,,4,1.0
1012,2531,36,,3,0.5
1013,2532,24,,3,3.0
1013,2533,21,,9,4.0
1014,2534,12,,3,4.0
1014,2535,10,431.0,3,0.5
1014,2536,8,,3,8.0
1015,2537,3,,9,5.0
1015,2538,2,,3,4.0
1016,2539,1,,8,2.0
1016,2540,1,166.0,4,2.0
1016,2541,1,,3,2.0
1017,2542,2,,3,4.0
1017,2543,3,,9,5.0
1018,2544,8,,3,8.0
1018,2545,10,,4,0.5
1018,2546,12,,3,4.0
1019,2547,21,,9,4.0
1019,2548,24,,3,3.0
1020,2549,36,,3,0.5
1020,2550,40,594.0,3,1.0
1020,2551,44,,3,4.0
1021,2552,60,,3,0.5
1021,2553,65,,9,4.5
1022,2554,84,,3,0.75
1022,2555,90,339.0,3,1.0
1022,2556,96,,3,8.0
1023,2557,119,,9,2.0
1023,2558,126,,3,4.0
1024,2559,25,,3,7.0
1024,2560,33,,3,0.8
1024,2561,41,,4,1.2
1025,2562,71,,6,4.0
1025,2563,80,,4,4.0
1026,2564,113,,3,4.5
1026,2565,123,148.0,6,3.0
1026,2566,6,,3,7.0
1027,2567,43,,11,2.3
1027,2568,54,,3,5.0
1028,2569,94,,8,4.0
1028,2570,106,46.0,4,7.0
1028,2571,118,,3,6.0
1029,2572,35,,3,1.0
1029,2573,48,,3,4.5
1030,2574,95,,3,2.0
1030,2575,109,,10,3.0
1030,2576,123,,3,3.0
1031,2577,47,,9,9.0
1031,2578,62,,4,4.0
1032,2579,116,,3,3.0
1032,2580,5,245.0,3,5.0
1032,2581,21,,3,4.0
1033,2582,79,,2,1.5
1033,2583,96,,3,8.0
1034,2584,30,,3,4.0
1034,2585,48,307.0,3,4.5
1034,2586,66,,3,3.0
1035,2587,4,,3,5.0
1035,2588,23,,3,3.0
1036,2589,91,,3,1.2
1036,2590,111,,3,8.0
1036,2591,4,,8,5.0
1037,2592,76,,3,4.0
1037,2593,97,,5,9.0
1038,2594,45,,3,2.0
1038,2595,67,207.0,6,3.5
1038,2596,89,,3,0.8
1039,2597,41,,7,1.2
1039,2598,64,,3,4.5
1040,2599,19,,8,2.0
1040,2600,43,413.0,4,2.3
1040,2601,67,,3,3.5
1041,2602,26,,3,4.0
1041,2603,51,,9,2.0
1042,2604,13,,3,4.5
1042,2605,39,,6,0.8
1042,2606,65,,4,4.5
1043,2607,31,,3,2.0
1043,2608,58,,8,8.0
1044,2609,27,,3,2.0
1044,2610,55,169.0,3,5.0
1044,2611,83,,3,0.8
1045,2612,56,,4,7.0
1045,2613,85,,9,1.0
1046,2614,61,,8,8.0
1046,2615,91,230.0,10,1.2
1046,2616,121,,3,4.0
1047,2617,101,,3,2.0
1047,2618,5,,6,5.0
1048,2619,115,,3,4.5
1048,2620,20,,8,8.0
1048,2621,52,,8,4.0
1049,2622,39,,6,0.8
1049,2623,72,,3,2.0
1050,2624,62,,3,4.0
1050,2625,96,616.0,3,8.0
1050,2626,3,,3,5.0
1051,2627,124,,8,3.0
1051,2628,32,,3,5.0
1052,2629,29,,4,1.5
1052,2630,65,555.0,8,4.5
1052,2631,101,,3,2.0
1053,2632,102,,3,4.0
1053,2633,12,,3,4.0
1054,2634,16,,3,3.0
1054,2635,54,706.0,3,5.0
1054,2636,92,,4,2.4
1055,2637,100,,3,5.6
1055,2638,12,,3,4.0
1056,2639,23,,3,3.0
1056,2640,63,213.0,3,4.5
1056,2641,103,,3,5.0
1057,2642,118,,8,6.0
1057,2643,32,,3,5.0
1058,2644,50,,4,5.6
1058,2645,92,,8,2.4
1058,2646,7,,3,8.0
1059,2647,29,,9,1.5
1059,2648,72,,3,2.0
1060,2649,97,,3,9.0
1060,2650,14,630.0,8,4.5
1060,2651,58,,8,8.0
1061,2652,87,,3,0.5
1061,2653,5,,1,5.0
1062,2654,37,,3,0.5
1062,2655,83,10.0,6,0.8
1062,2656,2,,3,4.0
1063,2657,38,,10,0.5
1063,2658,85,,6,1.0
1064,2659,124,,8,3.0
1064,2660,45,,3,2.0
1064,2661,93,,3,2.3
1065,2662,9,,6,3.0
1065,2663,58,,6,8.0
1066,2664,104,,3,5.0
1066,2665,27,274.0,6,2.0
1066,2666,77,,4,2.0
1067,2667,1,,9,2.0
1067,2668,51,,3,2.0
1068,2669,104,,3,5.0
1068,2670,29,288.0,3,1.5
1068,2671,81,,3,2.0
1069,2672,11,,4,8.0
1069,2673,64,,3,4.5
1070,2674,124,,8,3.0
1070,2675,51,,6,2.0
1070,2676,105,,3,5.0
1071,2677,42,,6,2.4
1071,2678,97,,6,9.0
1072,2679,37,,3,0.5
1072,2680,93,560.0,3,2.3
1072,2681,22,,8,2.0
1073,2682,93,,6,2.3
1073,2683,23,,1,3.0
1074,2684,97,,3,9.0
1074,2685,28,357.0,3,2.0
1074,2686,86,,3,0.5
1075,2687,37,,5,0.5
1075,2688,96,,3,8.0
1076,2689,50,,4,5.6
1076,2690,110,,8,0.5
1076,2691,43,,3,2.3
1077,2692,1,,3,2.0
1077,2693,62,,6,4.0
1078,2694,23,,3,3.0
1078,2695,85,643.0,10,1.0
1078,2696,20,,4,8.0
1079,2697,112,,3,4.0
1079,2698,48,,3,4.5
1080,2699,16,,3,3.0
1080,2700,80,121.0,3,4.0
1080,2701,17,,3,3.5
1081,2702,116,,4,3.0
1081,2703,54,,6,5.0
1082,2704,29,,4,1.5
1082,2705,95,,2,2.0
1082,2706,34,,3,0.75
1083,2707,13,,9,4.5
1083,2708,80,,3,4.0
1084,2709,62,,3,4.0
1084,2710,3,280.0,3,5.0
1084,2711,71,,4,4.0
1085,2712,57,,3,8.0
1085,2713,126,,6,4.0
1086,2714,115,,3,4.5
1086,2715,58,139.0,3,8.0
1086,2716,1,,3,2.0
1087,2717,121,,11,4.0
1087,2718,65,,6,4.5
1088,2719,61,,8,8.0
1088,2720,6,,3,7.0
1088,2721,78,,3,2.0
1089,2722,78,,3,2.0
1089,2723,24,,3,3.0
1090,2724,27,,3,2.0
1090,2725,101,436.0,2,2.0
1090,2726,48,,3,4.5
1091,2727,55,,3,5.0
1091,2728,3,,3,5.0
1092,2729,13,,3,4.5
1092,2730,89,42.0,3,0.8
1092,2731,38,,3,0.5
1093,2732,52,,8,4.0
1093,2733,2,,6,4.0
1094,2734,19,,8,2.0
1094,2735,97,,10,9.0
1094,2736,48,,3,4.5
1095,2737,69,,3,2.0
1095,2738,21,,6,4.0
1096,2739,45,,3,2.0
1096,2740,125,499.0,8,7.0
1096,2741,78,,3,2.0
1097,2742,106,,3,7.0
1097,2743,60,,3,0.5
1098,2744,91,,3,1.2
1098,2745,46,178.0,3,8.0
1098,2746,1,,3,2.0
1099,2747,36,,3,0.5
1099,2748,119,,3,2.0
1100,2749,30,,3,4.0
1100,2750,114,,3,4.5
1100,2751,71,,3,4.0
1101,2752,113,,3,4.5
1101,2753,71,,3,4.0
1102,2754,116,,3,3.0
1102,2755,75,517.0,6,7.0
1102,2756,34,,8,0.75
1103,2757,83,,9,0.8
1103,2758,43,,2,2.3
1104,2759,95,,3,2.0
1104,2760,56,295.0,3,7.0
1104,2761,17,,3,3.5
1105,2762,73,,2,3.0
1105,2763,35,,9,1.0
1106,2764,94,,8,4.0
1106,2765,57,,6,8.0
1106,2766,20,,3,8.0
1107,2767,83,,3,0.8
1107,2768,47,,3,9.0
1108,2769,113,,3,4.5
1108,2770,78,547.0,3,2.0
1108,2771,43,,8,2.3
1109,2772,113,,3,4.5
1109,2773,79,,11,1.5
1110,2774,25,,3,7.0
1110,2775,119,63.0,6,2.0
1110,2776,86,,3,0.5
1111,2777,36,,3,0.5
1111,2778,4,,3,5.0
1112,2779,84,,3,0.75
1112,2780,53,,8,5.0
1112,2781,22,,3,2.0
1113,2782,106,,3,7.0
1113,2783,76,,3,4.0
1114,2784,36,,3,0.5
1114,2785,7,687.0,10,8.0
1114,2786,105,,3,5.0
1115,2787,69,,9,2.0
1115,2788,41,,4,1.2
1116,2789,8,,3,8.0
1116,2790,108,94.0,3,8.0
1116,2791,81,,3,2.0
1117,2792,52,,8,4.0
1117,2793,26,,6,4.0
1118,2794,1,,8,2.0
1118,2795,102,,3,4.0
1118,2796,77,,3,2.0
1119,2797,55,,9,5.0
1119,2798,31,,6,2.0
1120,2799,12,,3,4.0
1120,2800,116,84.0,8,3.0
1120,2801,93,,3,2.3
1121,2802,78,,3,2.0
1121,2803,56,,4,7.0
1122,2804,44,,3,4.0
1122,2805,23,,6,3.0
1122,2806,2,,3,4.0
1123,2807,121,,5,4.0
1123,2808,101,,3,2.0
1124,2809,96,,3,8.0
1124,2810,77,370.0,8,2.0
1124,2811,58,,3,8.0
1125,2812,57,,3,8.0
1125,2813,39,,3,0.8
1126,2814,41,,3,1.2
1126,2815,24,171.0,3,3.0
1126,2816,7,,8,8.0
1127,2817,13,,3,4.5
1127,2818,124,,8,3.0
1128,2819,6,,3,7.0
1128,2820,118,,3,6.0
1128,2821,103,,3,5.0
1129,2822,116,,4,3.0
1129,2823,102,,6,4.0
1130,2824,118,,8,6.0
1130,2825,105,442.0,6,5.0
1130,2826,92,,3,2.4
1131,2827,112,,3,4.0
1131,2828,100,,3,5.6
1132,2829,123,,3,3.0
1132,2830,112,260.0,4,4.0
1132,2831,101,,4,2.0
1133,2832,1,,3,2.0
1133,2833,118,,2,6.0
1134,2834,21,,3,4.0
1134,2835,12,,3,4.0
1134,2836,3,,3,5.0
1135,2837,37,,11,0.5
1135,2838,29,,6,1.5
1136,2839,66,,3,3.0
1136,2840,59,256.0,8,3.0
1136,2841,52,,3,4.0
1137,2842,93,,6,2.3
1137,2843,87,,9,0.5
1138,2844,4,,3,5.0
1138,2845,126,185.0,3,4.0
1138,2846,121,,8,4.0
1139,2847,42,,6,2.4
1139,2848,38,,4,0.5
1140,2849,89,,3,0.8
1140,2850,86,,3,0.5
1140,2851,83,,3,0.8
1141,2852,11,,4,8.0
1141,2853,9,,9,3.0
1142,2854,67,,8,3.5
1142,2855,66,532.0,3,3.0
1142,2856,65,,3,4.5
1143,2857,1,,3,2.0
1143,2858,1,,6,2.0
1144,2859,65,,3,4.5
1144,2860,66,314.0,3,3.0
1144,2861,67,,8,3.5
1145,2862,9,,6,3.0
1145,2863,11,,1,8.0
1146,2864,83,,3,0.8
1146,2865,86,,3,0.5
1146,2866,89,,3,0.8
1147,2867,38,,10,0.5
1147,2868,42,,3,2.4
1148,2869,121,,8,4.0
1148,2870,126,343.0,3,4.0
1148,2871,4,,3,5.0
1149,2872,87,,3,0.5
1149,2873,93,,9,2.3
1150,2874,52,,3,4.0
1150,2875,59,55.0,2,3.0
1150,2876,66,,3,3.0
1151,2877,29,,3,1.5
1151,2878,37,,2,0.5
1152,2879,3,,3,5.0
1152,2880,12,,3,4.0
1152,2881,21,,3,4.0
1153,2882,118,,8,6.0
1153,2883,1,,3,2.0
1154,2884,101,,4,2.0
1154,2885,112,415.0,4,4.0
1154,2886,123,,3,3.0
1155,2887,100,,3,5.6
1155,2888,112,,3,4.0
1156,2889,92,,3,2.4
1156,2890,105,284.0,3,5.0
1156,2891,118,,8,6.0
1157,2892,102,,3,4.0
1157,2893,116,,4,3.0
1158,2894,103,,3,5.0
1158,2895,118,,3,6.0
1158,2896,6,,3,7.0
1159,2897,124,,8,3.0
1159,2898,13,,6,4.5
1160,2899,7,,8,8.0
1160,2900,24,595.0,3,3.0
1160,2901,41,,3,1.2
1161,2902,39,,6,0.8
1161,2903,57,,3,8.0
1162,2904,58,,3,8.0
1162,2905,77,539.0,2,2.0
1162,2906,96,,3,8.0
1163,2907,101,,9,2.0
1163,2908,121,,8,4.0
1164,2909,2,,3,4.0
1164,2910,23,,3,3.0
1164,2911,44,,3,4.0
1165,2912,56,,4,7.0
1165,2913,78,,6,2.0
1166,2914,93,,3,2.3
1166,2915,116,656.0,8,3.0
1166,2916,12,,3,4.0
1167,2917,31,,9,2.0
1167,2918,55,,6,5.0
1168,2919,77,,3,2.0
1168,2920,102,26.0,3,4.0
1168,2921,1,,8,2.0
1169,2922,26,,3,4.0
1169,2923,52,,8,4.0
1170,2924,81,,3,2.0
1170,2925,108,,3,8.0
1170,2926,8,,3,8.0
1171,2927,41,,1,1.2
1171,2928,69,,3,2.0
1172,2929,105,,3,5.0
1172,2930,7,137.0,4,8.0
1172,2931,36,,3,0.5
1173,2932,76,,3,4.0
1173,2933,106,,6,7.0
1174,2934,22,,3,2.0
1174,2935,53,160.0,2,5.0
1174,2936,84,,3,0.75
1175,2937,4,,3,5.0
1175,2938,36,,3,0.5
1176,2939,86,,3,0.5
1176,2940,119,,3,2.0
1176,2941,25,,3,7.0
1177,2942,79,,2,1.5
1177,2943,113,,3,4.5
1178,2944,43,,8,2.3
1178,2945,78,82.0,3,2.0
1178,2946,113,,3,4.5
1179,2947,47,,3,9.0
1179,2948,83,,3,0.8
1180,2949,20,,3,8.0
1180,2950,57,248.0,3,8.0
1180,2951,94,,8,4.0
1181,2952,35,,3,1.0
1181,2953,73,,5,3.0
1182,2954,17,,3,3.5
1182,2955,56,,3,7.0
1182,2956,95,,3,2.0
1183,2957,43,,5,2.3
1183,2958,83,,6,0.8
1184,2959,34,,8,0.75
1184,2960,75,619.0,3,7.0
1184,2961,116,,3,3.0
1185,2962,71,,6,4.0
1185,2963,113,,3,4.5
1186,2964,71,,3,4.0
1186,2965,114,225.0,3,4.5
1186,2966,30,,3,4.0
1187,2967,119,,3,2.0
1187,2968,36,,3,0.5
1188,2969,1,,3,2.0
1188,2970,46,700.0,3,8.0
1188,2971,91,,3,1.2
1189,2972,60,,3,0.5
1189,2973,106,,6,7.0
1190,2974,78,,3,2.0
1190,2975,125,95.0,2,7.0
1190,2976,45,,3,2.0
1191,2977,21,,3,4.0
1191,2978,69,,6,2.0
1192,2979,48,,3,4.5
1192,2980,97,,4,9.0
1192,2981,19,,8,2.0
1193,2982,2,,3,4.0
1193,2983,52,,8,4.0
1194,2984,38,,3,0.5
1194,2985,89,303.0,6,0.8
1194,2986,13,,3,4.5
1195,2987,3,,3,5.0
1195,2988,55,,3,5.0
1196,2989,48,,3,4.5
1196,2990,101,76.0,8,2.0
1196,2991,27,,3,2.0
1197,2992,24,,3,3.0
1197,2993,78,,6,2.0
1198,2994,78,,3,2.0
1198,2995,6,,3,7.0
1198,2996,61,,8,8.0
1199,2997,65,,3,4.5
1199,2998,121,,2,4.0
1200,2999,1,,3,2.0
1200,3000,58,451.0,3,8.0
1200,3001,115,,3,4.5
1201,3002,126,,3,4.0
1201,3003,57,,3,8.0
1202,3004,71,,4,4.0
1202,3005,3,68.0,6,5.0
1202,3006,62,,3,4.0
1203,3007,80,,3,4.0
1203,3008,13,,3,4.5
1204,3009,34,,3,0.75
1204,3010,95,,8,2.0
1204,3011,29,,4,1.5
1205,3012,54,,3,5.0
1205,3013,116,,4,3.0
1206,3014,17,,3,3.5
1206,3015,80,602.0,3,4.0
1206,3016,16,,3,3.0
1207,3017,48,,3,4.5
1207,3018,112,,3,4.0
1208,3019,20,,4,8.0
1208,3020,85,108.0,4,1.0
1208,3021,23,,3,3.0
1209,3022,62,,3,4.0
1209,3023,1,,3,2.0
1210,3024,43,,3,2.3
1210,3025,110,,8,0.5
1210,3026,50,,4,5.6
1211,3027,96,,3,8.0
1211,3028,37,,8,0.5
1212,3029,86,,3,0.5
1212,3030,28,129.0,3,2.0
1212,3031,97,,3,9.0
1213,3032,23,,4,3.0
1213,3033,93,,9,2.3
1214,3034,22,,8,2.0
1214,3035,93,369.0,6,2.3
1214,3036,37,,3,0.5
1215,3037,97,,3,9.0
1215,3038,42,,3,2.4
1216,3039,105,,3,5.0
1216,3040,51,,3,2.0
1216,3041,124,,8,3.0
1217,3042,64,,3,4.5
1217,3043,11,,1,8.0
1218,3044,81,,3,2.0
1218,3045,29,648.0,6,1.5
1218,3046,104,,3,5.0
1219,3047,51,,3,2.0
1219,3048,1,,3,2.0
1220,3049,77,,4,2.0
1220,3050,27,244.0,3,2.0
1220,3051,104,,3,5.0
1221,3052,58,,3,8.0
1221,3053,9,,9,3.0
1222,3054,93,,3,2.3
1222,3055,45,,6,2.0
1222,3056,124,,8,3.0
1223,3057,85,,3,1.0
1223,3058,38,,4,0.5
1224,3059,2,,3,4.0
1224,3060,83,486.0,3,0.8
1224,3061,37,,3,0.5
1225,3062,5,,10,5.0
1225,3063,87,,9,0.5
1226,3064,58,,8,8.0
1226,3065,14,33.0,8,4.5
1226,3066,97,,3,9.0
1227,3067,72,,3,2.0
1227,3068,29,,3,1.5
1228,3069,7,,3,8.0
1228,3070,92,,8,2.4
1228,3071,50,,4,5.6
1229,3072,32,,3,5.0
1229,3073,118,,2,6.0
1230,3074,103,,3,5.0
1230,3075,63,190.0,6,4.5
1230,3076,23,,3,3.0
1231,3077,12,,3,4.0
1231,3078,100,,3,5.6
1232,3079,92,,4,2.4
1232,3080,54,410.0,3,5.0
1232,3081,16,,3,3.0
1233,3082,12,,3,4.0
1233,3083,102,,6,4.0
1234,3084,101,,3,2.0
1234,3085,65,,2,4.5
1234,3086,29,,4,1.5
1235,3087,32,,3,5.0
1235,3088,124,,8,3.0
1236,3089,3,,3,5.0
1236,3090,96,427.0,3,8.0
1236,3091,62,,3,4.0
1237,3092,72,,3,2.0
1237,3093,39,,3,0.8
1238,3094,52,,8,4.0
1238,3095,20,218.0,8,8.0
1238,3096,115,,3,4.5
1239,3097,5,,3,5.0
1239,3098,101,,6,2.0
1240,3099,121,,3,4.0
1240,3100,91,,4,1.2
1240,3101,61,,8,8.0
1241,3102,85,,6,1.0
1241,3103,56,,4,7.0
1242,3104,83,,3,0.8
1242,3105,55,587.0,6,5.0
1242,3106,27,,3,2.0
1243,3107,58,,2,8.0
1243,3108,31,,3,2.0
1244,3109,65,,4,4.5
1244,3110,39,17.0,3,0.8
1244,3111,13,,3,4.5
1245,3112,51,,3,2.0
1245,3113,26,,6,4.0
1246,3114,67,,3,3.5
1246,3115,43,,10,2.3
1246,3116,19,,8,2.0
1247,3117,64,,3,4.5
1247,3118,41,,10,1.2
1248,3119,89,,3,0.8
1248,3120,67,316.0,3,3.5
1248,3121,45,,3,2.0
1249,3122,97,,2,9.0
1249,3123,76,,3,4.0
1250,3124,4,,8,5.0
1250,3125,111,14.0,6,8.0
1250,3126,91,,3,1.2
1251,3127,23,,3,3.0
1251,3128,4,,3,5.0
1252,3129,66,,3,3.0
1252,3130,48,,3,4.5
1252,3131,30,,3,4.0
1253,3132,96,,3,8.0
1253,3133,79,,11,1.5
1254,3134,21,,3,4.0
1254,3135,5,298.0,6,5.0
1254,3136,116,,3,3.0
1255,3137,62,,10,4.0
1255,3138,47,,6,9.0
1256,3139,123,,3,3.0
1256,3140,109,,4,3.0
1256,3141,95,,3,2.0
1257,3142,48,,3,4.5
1257,3143,35,,9,1.0
1258,3144,118,,3,6.0
1258,3145,106,443.0,4,7.0
1258,3146,94,,8,4.0
1259,3147,54,,6,5.0
1259,3148,43,,8,2.3
1260,3149,6,,3,7.0
1260,3150,123,31.0,3,3.0
1260,3151,113,,3,4.5
1261,3152,80,,4,4.0
1261,3153,71,,3,4.0
1262,3154,41,,4,1.2
1262,3155,33,,6,0.8
1262,3156,25,,3,7.0
1263,3157,126,,6,4.0
1263,3158,119,,6,2.0
1264,3159,96,,3,8.0
1264,3160,90,304.0,3,1.0
1264,3161,84,,3,0.75
1265,3162,65,,6,4.5
1265,3163,60,,3,0.5
1266,3164,44,,3,4.0
1266,3165,40,356.0,3,1.0
1266,3166,36,,3,0.5
1267,3167,24,,3,3.0
1267,3168,21,,3,4.0
1268,3169,12,,3,4.0
1268,3170,10,,4,0.5
1268,3171,8,,3,8.0
1269,3172,3,,3,5.0
1269,3173,2,,6,4.0
1270,3174,1,,3,2.0
1270,3175,1,425.0,10,2.0
1270,3176,1,,8,2.0
1271,3177,2,,6,4.0
1271,3178,3,,6,5.0
1272,3179,8,,3,8.0
1272,3180,10,378.0,3,0.5
1272,3181,12,,3,4.0
1273,3182,21,,6,4.0
1273,3183,24,,3,3.0
1274,3184,36,,3,0.5
1274,3185,40,,4,1.0
1274,3186,44,,3,4.0
1275,3187,60,,3,0.5
1275,3188,65,,3,4.5
1276,3189,84,,3,0.75
1276,3190,90,454.0,3,1.0
1276,3191,96,,3,8.0
1277,3192,119,,3,2.0
1277,3193,126,,6,4.0
1278,3194,25,,3,7.0
1278,3195,33,216.0,6,0.8
1278,3196,41,,3,1.2
1279,3197,71,,1,4.0
1279,3198,80,,3,4.0
1280,3199,113,,4,4.5
1280,3200,123,,3,3.0
1280,3201,6,,3,7.0
1281,3202,43,,6,2.3
1281,3203,54,,6,5.0
1282,3204,94,,3,4.0
1282,3205,106,198.0,4,7.0
1282,3206,118,,8,6.0
1283,3207,35,,3,1.0
1283,3208,48,,3,4.5
1284,3209,95,,3,2.0
1284,3210,109,88.0,3,3.0
1284,3211,123,,3,3.0
1285,3212,47,,4,9.0
1285,3213,62,,6,4.0
1286,3214,116,,4,3.0
1286,3215,5,,2,5.0
1286,3216,21,,3,4.0
1287,3217,79,,9,1.5
1287,3218,96,,3,8.0
1289,3222,4,,3,5.0
1289,3223,23,,1,3.0
1290,3224,91,,3,1.2
1290,3225,111,332.0,6,8.0
1290,3226,4,,3,5.0
1291,3227,76,,8,4.0
1291,3228,97,,3,9.0
1292,3229,45,,3,2.0
1292,3230,67,,4,3.5
1292,3231,89,,3,0.8
1293,3232,41,,3,1.2
1293,3233,64,,3,4.5
1294,3234,19,,3,2.0
1294,3235,43,446.0,10,2.3
1294,3236,67,,8,3.5
1295,3237,26,,6,4.0
1295,3238,51,,6,2.0
1296,3239,13,,3,4.5
1296,3240,39,345.0,3,0.8
1296,3241,65,,3,4.5
1297,3242,31,,2,2.0
1297,3243,58,,6,8.0
1298,3244,27,,3,2.0
1298,3245,55,,10,5.0
1298,3246,83,,3,0.8
1299,3247,56,,3,7.0
1299,3248,85,,3,1.0
1300,3249,61,,3,8.0
1300,3250,91,186.0,4,1.2
1300,3251,121,,8,4.0
1301,3252,101,,3,2.0
1301,3253,5,,1,5.0
1302,3254,115,,3,4.5
1302,3255,20,146.0,3,8.0
1302,3256,52,,3,4.0
1303,3257,39,,9,0.8
1303,3258,72,,3,2.0
1304,3259,62,,4,4.0
1304,3260,96,,3,8.0
1304,3261,3,,3,5.0
1305,3262,124,,3,3.0
1305,3263,32,,3,5.0
1306,3264,29,,3,1.5
1306,3265,65,283.0,2,4.5
1306,3266,101,,4,2.0
1307,3267,102,,6,4.0
1307,3268,12,,3,4.0
1308,3269,16,,3,3.0
1308,3270,54,328.0,3,5.0
1308,3271,92,,3,2.4
1309,3272,100,,8,5.6
1309,3273,12,,3,4.0
1310,3274,23,,4,3.0
1310,3275,63,,6,4.5
1310,3276,103,,3,5.0
1311,3277,118,,6,6.0
1311,3278,32,,3,5.0
1312,3279,50,,3,5.6
1312,3280,92,305.0,8,2.4
1312,3281,7,,8,8.0
1313,3282,29,,6,1.5
1313,3283,72,,3,2.0
1314,3284,97,,3,9.0
1314,3285,14,44.0,3,4.5
1314,3286,58,,3,8.0
1315,3287,87,,3,0.5
1315,3288,5,,3,5.0
1316,3289,37,,8,0.5
1316,3290,83,,8,0.8
1316,3291,2,,3,4.0
1317,3292,38,,3,0.5
1317,3293,85,,9,1.0
1318,3294,124,,3,3.0
1318,3295,45,,6,2.0
1318,3296,93,,3,2.3
1319,3297,9,,3,3.0
1319,3298,58,,8,8.0
1320,3299,104,,3,5.0
1320,3300,27,,3,2.0
1320,3301,77,,3,2.0
1321,3302,1,,2,2.0
1321,3303,51,,9,2.0
1322,3304,104,,4,5.0
1322,3305,29,764.0,2,1.5
1322,3306,81,,3,2.0
1323,3307,11,,3,8.0
1323,3308,64,,3,4.5
1324,3309,124,,3,3.0
1324,3310,51,522.0,3,2.0
1324,3311,105,,3,5.0
1325,3312,42,,3,2.4
1325,3313,97,,5,9.0
1326,3314,37,,3,0.5
1326,3315,93,97.0,6,2.3
1326,3316,22,,3,2.0
1327,3317,93,,3,2.3
1327,3318,23,,6,3.0
1328,3319,97,,8,9.0
1328,3320,28,65.0,4,2.0
1328,3321,86,,3,0.5
1329,3322,37,,6,0.5
1329,3323,96,,3,8.0
1330,3324,50,,3,5.6
1330,3325,110,15.0,8,0.5
1330,3326,43,,8,2.3
1331,3327,1,,9,2.0
1331,3328,62,,4,4.0
1332,3329,23,,3,3.0
1332,3330,85,379.0,3,1.0
1332,3331,20,,3,8.0
1333,3332,112,,8,4.0
1333,3333,48,,3,4.5
1334,3334,16,,8,3.0
1334,3335,80,126.0,8,4.0
1334,3336,17,,3,3.5
1335,3337,116,,3,3.0
1335,3338,54,,3,5.0
1336,3339,29,,3,1.5
1336,3340,95,133.0,8,2.0
1336,3341,34,,8,0.75
1337,3342,13,,6,4.5
1337,3343,80,,4,4.0
1338,3344,62,,3,4.0
1338,3345,3,649.0,6,5.0
1338,3346,71,,3,4.0
1339,3347,57,,9,8.0
1339,3348,126,,3,4.0
1340,3349,115,,8,4.5
1340,3350,58,192.0,4,8.0
1340,3351,1,,3,2.0
1341,3352,121,,3,4.0
1341,3353,65,,9,4.5
1342,3354,61,,3,8.0
1342,3355,6,72.0,3,7.0
1342,3356,78,,3,2.0
1343,3357,78,,6,2.0
1343,3358,24,,3,3.0
1344,3359,27,,3,2.0
1344,3360,101,202.0,3,2.0
1344,3361,48,,3,4.5
1345,3362,55,,2,5.0
1345,3363,3,,9,5.0
1346,3364,13,,8,4.5
1346,3365,89,187.0,2,0.8
1346,3366,38,,3,0.5
1347,3367,52,,3,4.0
1347,3368,2,,3,4.0
1348,3369,19,,3,2.0
1348,3370,97,194.0,4,9.0
1348,3371,48,,3,4.5
1349,3372,69,,3,2.0
1349,3373,21,,9,4.0
1350,3374,45,,3,2.0
1350,3375,125,5.0,6,7.0
1350,3376,78,,3,2.0
1351,3377,106,,2,7.0
1351,3378,60,,3,0.5
1352,3379,91,,8,1.2
1352,3380,46,182.0,4,8.0
1352,3381,1,,3,2.0
1353,3382,36,,3,0.5
1353,3383,119,,9,2.0
1354,3384,30,,3,4.0
1354,3385,114,367.0,3,4.5
1354,3386,71,,4,4.0
1355,3387,113,,9,4.5
1355,3388,71,,4,4.0
1356,3389,116,,3,3.0
1356,3390,75,57.0,3,7.0
1356,3391,34,,3,0.75
1357,3392,83,,4,0.8
1357,3393,43,,3,2.3
1358,3394,95,,4,2.0
1358,3395,56,296.0,8,7.0
1358,3396,17,,3,3.5
1359,3397,73,,3,3.0
1359,3398,35,,6,1.0
1360,3399,94,,3,4.0
1360,3400,57,540.0,3,8.0
1360,3401,20,,4,8.0
1361,3402,83,,6,0.8
1361,3403,47,,1,9.0
1362,3404,113,,3,4.5
1362,3405,78,385.0,3,2.0
1362,3406,43,,3,2.3
1363,3407,113,,1,4.5
1363,3408,79,,3,1.5
1364,3409,25,,8,7.0
1364,3410,119,183.0,8,2.0
1364,3411,86,,3,0.5
1365,3412,36,,3,0.5
1365,3413,4,,3,5.0
1366,3414,84,,3,0.75
1366,3415,53,,2,5.0
1366,3416,22,,8,2.0
1367,3417,106,,6,7.0
1367,3418,76,,8,4.0
1368,3419,36,,3,0.5
1368,3420,7,,3,8.0
1368,3421,105,,3,5.0
1369,3422,69,,6,2.0
1369,3423,41,,3,1.2
1370,3424,8,,4,8.0
1370,3425,108,,3,8.0
1370,3426,81,,3,2.0
1371,3427,52,,3,4.0
1371,3428,26,,3,4.0
1372,3429,1,,3,2.0
1372,3430,102,,3,4.0
1372,3431,77,,4,2.0
1373,3432,55,,3,5.0
1373,3433,31,,11,2.0
1374,3434,12,,3,4.0
1374,3435,116,,3,3.0
1374,3436,93,,3,2.3
1375,3437,78,,6,2.0
1375,3438,56,,3,7.0
1376,3439,44,,4,4.0
1376,3440,23,,8,3.0
1376,3441,2,,3,4.0
1377,3442,121,,6,4.0
1377,3443,101,,3,2.0
1378,3444,96,,3,8.0
1378,3445,77,,2,2.0
1378,3446,58,,8,8.0
1379,3447,57,,9,8.0
1379,3448,39,,3,0.8
1380,3449,41,,3,1.2
1380,3450,24,,3,3.0
1380,3451,7,,3,8.0
1381,3452,13,,8,4.5
1381,3453,124,,3,3.0
1382,3454,6,,3,7.0
1382,3455,118,,4,6.0
1382,3456,103,,3,5.0
1383,3457,116,,3,3.0
1383,3458,102,,3,4.0
1384,3459,118,,3,6.0
1384,3460,105,,3,5.0
1384,3461,92,,4,2.4
1385,3462,112,,3,4.0
1385,3463,100,,8,5.6
1386,3464,123,,3,3.0
1386,3465,112,,3,4.0
1386,3466,101,,3,2.0
1387,3467,1,,5,2.0
1387,3468,118,,3,6.0
1388,3469,21,,3,4.0
1388,3470,12,,3,4.0
1388,3471,3,,3,5.0
1389,3472,37,,3,0.5
1389,3473,29,,9,1.5
1390,3474,66,,3,3.0
1390,3475,59,,2,3.0
1390,3476,52,,8,4.0
1391,3477,93,,3,2.3
1391,3478,87,,6,0.5
1392,3479,4,,3,5.0
1392,3480,126,,3,4.0
1392,3481,121,,3,4.0
1393,3482,42,,3,2.4
1393,3483,38,,6,0.5
1394,3484,89,,4,0.8
1394,3485,86,,8,0.5
1394,3486,83,,3,0.8
1395,3487,11,,3,8.0
1395,3488,9,,3,3.0
1396,3489,67,,3,3.5
1396,3490,66,,3,3.0
1396,3491,65,,4,4.5
1397,3492,1,,3,2.0
1397,3493,1,,5,2.0
1398,3494,65,,3,4.5
1398,3495,66,,3,3.0
1398,3496,67,,3,3.5
1399,3497,9,,3,3.0
1399,3498,11,,6,8.0
1400,3499,83,,4,0.8
1400,3500,86,,8,0.5
1400,3501,89,,3,0.8
1401,3502,38,,3,0.5
1401,3503,42,,6,2.4
1402,3504,121,,3,4.0
1402,3505,126,,3,4.0
1402,3506,4,,8,5.0
1403,3507,87,,3,0.5
1403,3508,93,,3,2.3
1404,3509,52,,3,4.0
1404,3510,59,,3,3.0
1404,3511,66,,3,3.0
1405,3512,29,,4,1.5
1405,3513,37,,9,0.5
1406,3514,3,,3,5.0
1406,3515,12,,3,4.0
1406,3516,21,,3,4.0
1407,3517,118,,6,6.0
1407,3518,1,,6,2.0
1408,3519,101,,3,2.0
1408,3520,112,,4,4.0
1408,3521,123,,3,3.0
1409,3522,100,,3,5.6
1409,3523,112,,8,4.0
1410,3524,92,,3,2.4
1410,3525,105,,6,5.0
1410,3526,118,,3,6.0
1411,3527,102,,6,4.0
1411,3528,116,,3,3.0
1412,3529,103,,8,5.0
1412,3530,118,642.0,4,6.0
1412,3531,6,,3,7.0
1413,3532,124,,3,3.0
1413,3533,13,,9,4.5
1414,3534,7,,3,8.0
1414,3535,24,317.0,3,3.0
1414,3536,41,,4,1.2
1415,3537,39,,9,0.8
1415,3538,57,,6,8.0
1416,3539,58,,3,8.0
1416,3540,77,152.0,3,2.0
1416,3541,96,,3,8.0
1417,3542,101,,10,2.0
1417,3543,121,,3,4.0
1418,3544,2,,4,4.0
1418,3545,23,294.0,2,3.0
1418,3546,44,,3,4.0
1419,3547,56,,3,7.0
1419,3548,78,,3,2.0
1420,3549,93,,3,2.3
1420,3550,116,247.0,8,3.0
1420,3551,12,,3,4.0
1421,3552,31,,3,2.0
1421,3553,55,,11,5.0
1422,3554,77,,3,2.0
1422,3555,102,467.0,3,4.0
1422,3556,1,,3,2.0
1423,3557,26,,10,4.0
1423,3558,52,,3,4.0
1424,3559,81,,3,2.0
1424,3560,108,196.0,3,8.0
1424,3561,8,,3,8.0
1425,3562,41,,6,1.2
1425,3563,69,,3,2.0
1426,3564,105,,3,5.0
1426,3565,7,99.0,10,8.0
1426,3566,36,,3,0.5
1427,3567,76,,3,4.0
1427,3568,106,,8,7.0
1428,3569,22,,3,2.0
1428,3570,53,249.0,3,5.0
1428,3571,84,,3,0.75
1429,3572,4,,8,5.0
1429,3573,36,,3,0.5
1430,3574,86,,4,0.5
1430,3575,119,235.0,2,2.0
1430,3576,25,,3,7.0
1431,3577,79,,9,1.5
1431,3578,113,,6,4.5
1432,3579,43,,3,2.3
1432,3580,78,508.0,3,2.0
1432,3581,113,,4,4.5
1433,3582,47,,6,9.0
1433,3583,83,,1,0.8
1434,3584,20,,3,8.0
1434,3585,57,561.0,6,8.0
1434,3586,94,,3,4.0
1435,3587,35,,7,1.0
1435,3588,73,,3,3.0
1436,3589,17,,4,3.5
1436,3590,56,54.0,8,7.0
1436,3591,95,,3,2.0
1437,3592,43,,3,2.3
1437,3593,83,,3,0.8
1438,3594,34,,3,0.75
1438,3595,75,3.0,6,7.0
1438,3596,116,,4,3.0
1439,3597,71,,9,4.0
1439,3598,113,,10,4.5
1440,3599,71,,3,4.0
1440,3600,114,4.0,3,4.5
1440,3601,30,,3,4.0
1441,3602,119,,10,2.0
1441,3603,36,,3,0.5
1442,3604,1,,8,2.0
1442,3605,46,312.0,4,8.0
1442,3606,91,,3,1.2
1443,3607,60,,3,0.5
1443,3608,106,,3,7.0
1444,3609,78,,3,2.0
1444,3610,125,144.0,8,7.0
1444,3611,45,,3,2.0
1445,3612,21,,3,4.0
1445,3613,69,,9,2.0
1446,3614,48,,3,4.5
1446,3615,97,211.0,6,9.0
1446,3616,19,,3,2.0
1447,3617,2,,10,4.0
1447,3618,52,,3,4.0
1448,3619,38,,4,0.5
1448,3620,89,462.0,8,0.8
1448,3621,13,,3,4.5
1449,3622,3,,6,5.0
1449,3623,55,,9,5.0
1450,3624,48,,3,4.5
1450,3625,101,220.0,2,2.0
1450,3626,27,,3,2.0
1451,3627,24,,3,3.0
1451,3628,78,,3,2.0
1452,3629,78,,3,2.0
1452,3630,6,62.0,3,7.0
1452,3631,61,,3,8.0
1453,3632,65,,4,4.5
1453,3633,121,,9,4.0
1454,3634,1,,8,2.0
1454,3635,58,135.0,4,8.0
1454,3636,115,,3,4.5
1455,3637,126,,6,4.0
1455,3638,57,,6,8.0
1456,3639,71,,3,4.0
1456,3640,3,114.0,3,5.0
1456,3641,62,,4,4.0
1457,3642,80,,3,4.0
1457,3643,13,,11,4.5
1458,3644,34,,3,0.75
1458,3645,95,,6,2.0
1458,3646,29,,3,1.5
1459,3647,54,,6,5.0
1459,3648,116,,3,3.0
1460,3649,17,,4,3.5
1460,3650,80,,8,4.0
1460,3651,16,,3,3.0
1461,3652,48,,3,4.5
1461,3653,112,,3,4.0
1462,3654,20,,3,8.0
1462,3655,85,,10,1.0
1462,3656,23,,4,3.0
1463,3657,62,,6,4.0
1463,3658,1,,2,2.0
1464,3659,43,,3,2.3
1464,3660,110,,3,0.5
1464,3661,50,,3,5.6
1465,3662,96,,3,8.0
1465,3663,37,,3,0.5
1466,3664,86,,4,0.5
1466,3665,28,,4,2.0
1466,3666,97,,3,9.0
1467,3667,23,,3,3.0
1467,3668,93,,3,2.3
1468,3669,22,,3,2.0
1468,3670,93,,3,2.3
1468,3671,37,,8,0.5
1469,3672,97,,3,9.0
1469,3673,42,,6,2.4
1471,3677,64,,8,4.5
1471,3678,11,,6,8.0
1472,3679,81,,3,2.0
1472,3680,29,,8,1.5
1472,3681,104,,3,5.0
1473,3682,51,,6,2.0
1473,3683,1,,3,2.0
1474,3684,77,,3,2.0
1474,3685,27,,6,2.0
1474,3686,104,,4,5.0
1475,3687,58,,6,8.0
1475,3688,9,,3,3.0
1476,3689,93,,3,2.3
1476,3690,45,,3,2.0
1476,3691,124,,3,3.0
1477,3692,85,,8,1.0
1477,3693,38,,6,0.5
1478,3694,2,,4,4.0
1478,3695,83,,2,0.8
1478,3696,37,,3,0.5
1479,3697,5,,3,5.0
1479,3698,87,,6,0.5
1480,3699,58,,3,8.0
1480,3700,14,,8,4.5
1480,3701,97,,8,9.0
1481,3702,72,,3,2.0
1481,3703,29,,7,1.5
1482,3704,7,,3,8.0
1482,3705,92,,3,2.4
1482,3706,50,,3,5.6
1483,3707,32,,4,5.0
1483,3708,118,,3,6.0
1484,3709,103,,8,5.0
1484,3710,63,,3,4.5
1484,3711,23,,3,3.0
1485,3712,12,,3,4.0
1485,3713,100,,3,5.6
1486,3714,92,,3,2.4
1486,3715,54,,3,5.0
1486,3716,16,,8,3.0
1487,3717,12,,3,4.0
1487,3718,102,,3,4.0
1488,3719,101,,3,2.0
1488,3720,65,,3,4.5
1488,3721,29,,3,1.5
1489,3722,32,,4,5.0
1489,3723,124,,3,3.0
1490,3724,3,,3,5.0
1490,3725,96,,3,8.0
1490,3726,62,,3,4.0
1491,3727,72,,3,2.0
1491,3728,39,,3,0.8
1492,3729,52,,3,4.0
1492,3730,20,,8,8.0
1492,3731,115,,8,4.5
1493,3732,5,,3,5.0
1493,3733,101,,1,2.0
1494,3734,121,,3,4.0
1494,3735,91,,6,1.2
1494,3736,61,,3,8.0
1495,3737,85,,11,1.0
1495,3738,56,,3,7.0
1496,3739,83,,4,0.8
1496,3740,55,,4,5.0
1496,3741,27,,3,2.0
1497,3742,58,,3,8.0
1497,3743,31,,9,2.0
1498,3744,65,,3,4.5
1498,3745,39,862.0,6,0.8
1498,3746,13,,8,4.5
1499,3747,51,,3,2.0
1499,3748,26,,4,4.0
1500,3749,67,,3,3.5
1500,3750,43,,3,2.3
1500,3751,19,,3,2.0
1501,3752,64,,8,4.5
1501,3753,41,,9,1.2
1502,3754,89,,4,0.8
1502,3755,67,,10,3.5
1502,3756,45,,3,2.0
1503,3757,97,,3,9.0
1503,3758,76,,3,4.0
1504,3759,4,,3,5.0
1504,3760,111,,3,8.0
1504,3761,91,,8,1.2
1505,3762,23,,6,3.0
1505,3763,4,,8,5.0
1506,3764,66,,3,3.0
1506,3765,48,,3,4.5
1506,3766,30,,3,4.0
1507,3767,96,,3,8.0
1507,3768,79,,3,1.5
1508,3769,21,,3,4.0
1508,3770,5,,8,5.0
1508,3771,116,,3,3.0
1509,3772,62,,3,4.0
1509,3773,47,,3,9.0
1510,3774,123,,3,3.0
1510,3775,109,,10,3.0
1510,3776,95,,4,2.0
1511,3777,48,,3,4.5
1511,3778,35,,10,1.0
1512,3779,118,,3,6.0
1512,3780,106,,3,7.0
1512,3781,94,,3,4.0
1513,3782,54,,3,5.0
1513,3783,43,,9,2.3
1514,3784,6,,3,7.0
1514,3785,123,,6,3.0
1514,3786,113,,3,4.5
1515,3787,80,,3,4.0
1515,3788,71,,3,4.0
1516,3789,41,,3,1.2
1516,3790,33,,3,0.8
1516,3791,25,,8,7.0
1517,3792,126,,3,4.0
1517,3793,119,,7,2.0
1518,3794,96,,3,8.0
1518,3795,90,,3,1.0
1518,3796,84,,3,0.75
1519,3797,65,,7,4.5
1519,3798,60,,3,0.5
1520,3799,44,,4,4.0
1520,3800,40,,4,1.0
1520,3801,36,,3,0.5
1521,3802,24,,3,3.0
1521,3803,21,,3,4.0
1522,3804,12,,3,4.0
1522,3805,10,,4,0.5
1522,3806,8,,4,8.0
1523,3807,3,,3,5.0
1523,3808,2,,4,4.0
1524,3809,1,,3,2.0
1524,3810,1,,3,2.0
1524,3811,1,,3,2.0
1525,3812,2,,4,4.0
1525,3813,3,,3,5.0
1526,3814,8,,4,8.0
1526,3815,10,,4,0.5
1526,3816,12,,3,4.0
1527,3817,21,,3,4.0
1527,3818,24,,3,3.0
1528,3819,36,,3,0.5
1528,3820,40,,4,1.0
1528,3821,44,,4,4.0
1529,3822,60,,3,0.5
1529,3823,65,,7,4.5
1530,3824,84,,3,0.75
1530,3825,90,,3,1.0
1530,3826,96,,3,8.0
1531,3827,119,,7,2.0
1531,3828,126,,3,4.0
1532,3829,25,,8,7.0
1532,3830,33,,3,0.8
1532,3831,41,,3,1.2
1533,3832,71,,3,4.0
1533,3833,80,,3,4.0
1534,3834,113,,3,4.5
1534,3835,123,,6,3.0
1534,3836,6,,3,7.0
1535,3837,43,,9,2.3
1535,3838,54,,3,5.0
1536,3839,94,,3,4.0
1536,3840,106,,3,7.0
1536,3841,118,,3,6.0
1537,3842,35,,10,1.0
1537,3843,48,,3,4.5
1,1,1,,1,2.0
1,2,2,,4,4.0
1,3,3,,9,5.0
2,4,8,,4,8.0
2,5,10,1.0,4,0.5
2,6,12,,3,4.0
3,7,21,,9,4.0
3,8,24,,3,3.0
4,9,36,,3,0.5
4,10,40,,4,1.0
4,11,44,,4,4.0
5,12,60,,3,0.5
5,13,65,,1,4.5
6,14,84,,3,0.75
6,15,90,631.0,3,1.0
6,16,96,,3,8.0
7,17,119,,1,2.0
7,18,126,,3,4.0
8,19,25,,8,7.0
8,20,33,494.0,3,0.8
8,21,41,,3,1.2
9,22,71,,6,4.0
9,23,80,,3,4.0
10,24,113,,3,4.5
10,25,123,,6,3.0
10,26,6,,3,7.0
11,27,43,,3,2.3
11,28,54,,3,5.0
12,29,94,,3,4.0
12,30,106,422.0,3,7.0
12,31,118,,3,6.0
13,32,35,,4,1.0
13,33,48,,3,4.5
14,34,95,,4,2.0
14,35,109,287.0,10,3.0
14,36,123,,3,3.0
15,37,47,,9,9.0
15,38,62,,3,4.0
16,39,116,,3,3.0
16,40,5,,8,5.0
16,41,21,,3,4.0
17,42,79,,6,1.5
17,43,96,,3,8.0
18,44,30,,3,4.0
18,45,48,589.0,3,4.5
18,46,66,,3,3.0
19,47,4,,8,5.0
19,48,23,,3,3.0
20,49,91,,8,1.2
20,50,111,263.0,3,8.0
20,51,4,,3,5.0
21,52,76,,3,4.0
21,53,97,,9,9.0
22,54,45,,3,2.0
22,55,67,,10,3.5
22,56,89,,4,0.8
23,57,41,,3,1.2
23,58,64,,8,4.5
24,59,19,,3,2.0
24,60,43,321.0,3,2.3
24,61,67,,3,3.5
25,62,26,,4,4.0
25,63,51,,9,2.0
26,64,13,,8,4.5
26,65,39,43.0,6,0.8
26,66,65,,3,4.5
27,67,31,,3,2.0
27,68,58,,3,8.0
28,69,27,,3,2.0
28,70,55,,4,5.0
28,71,83,,4,0.8
29,72,56,,3,7.0
29,73,85,,5,1.0
30,74,61,,3,8.0
30,75,91,112.0,6,1.2
30,76,121,,3,4.0
31,77,101,,7,2.0
31,78,5,,6,5.0
32,79,115,,8,4.5
32,80,20,392.0,8,8.0
32,81,52,,3,4.0
33,82,39,,6,0.8
33,83,72,,3,2.0
34,84,62,,3,4.0
34,85,96,,3,8.0
34,86,3,,3,5.0
35,87,124,,3,3.0
35,88,32,,4,5.0
36,89,29,,3,1.5
36,90,65,576.0,3,4.5
36,91,101,,3,2.0
37,92,102,,3,4.0
37,93,12,,3,4.0
38,94,16,,8,3.0
38,95,54,173.0,3,5.0
38,96,92,,3,2.4
39,97,100,,3,5.6
39,98,12,,3,4.0
40,99,23,,3,3.0
40,100,63,,3,4.5
40,101,103,,8,5.0
41,102,118,,3,6.0
41,103,32,,4,5.0
42,104,50,,3,5.6
42,105,92,644.0,3,2.4
42,106,7,,3,8.0
43,107,29,,1,1.5
43,108,72,,3,2.0
44,109,97,,8,9.0
44,110,14,50.0,8,4.5
44,111,58,,3,8.0
45,112,87,,3,0.5
45,113,5,,9,5.0
46,114,37,,3,0.5
46,115,83,,2,0.8
46,116,2,,4,4.0
47,117,38,,6,0.5
47,118,85,,2,1.0
48,119,124,,3,3.0
48,120,45,396.0,3,2.0
48,121,93,,3,2.3
49,122,9,,6,3.0
49,123,58,,6,8.0
50,124,104,,4,5.0
50,125,27,36.0,6,2.0
50,126,77,,3,2.0
51,127,1,,9,2.0
51,128,51,,3,2.0
52,129,104,,3,5.0
52,130,29,,8,1.5
52,131,81,,3,2.0
53,132,11,,3,8.0
53,133,64,,8,4.5
54,134,124,,3,3.0
54,135,51,447.0,6,2.0
54,136,105,,3,5.0
55,137,42,,6,2.4
55,138,97,,6,9.0
56,139,37,,8,0.5
56,140,93,234.0,3,2.3
56,141,22,,3,2.0
57,142,93,,6,2.3
57,143,23,,9,3.0
58,144,97,,3,9.0
58,145,28,,4,2.0
58,146,86,,4,0.5
59,147,37,,9,0.5
59,148,96,,3,8.0
60,149,50,,3,5.6
60,150,110,259.0,3,0.5
60,151,43,,3,2.3
61,152,1,,8,2.0
61,153,62,,6,4.0
62,154,23,,4,3.0
62,155,85,104.0,10,1.0
62,156,20,,3,8.0
63,157,112,,3,4.0
63,158,48,,3,4.5
64,159,16,,3,3.0
64,160,80,,8,4.0
64,161,17,,4,3.5
65,162,116,,3,3.0
65,163,54,,6,5.0
66,164,29,,3,1.5
66,165,95,308.0,6,2.0
66,166,34,,3,0.75
67,167,13,,5,4.5
67,168,80,,3,4.0
68,169,62,,4,4.0
68,170,3,125.0,3,5.0
68,171,71,,3,4.0
69,172,57,,3,8.0
69,173,126,,6,4.0
70,174,115,,3,4.5
70,175,58,,4,8.0
70,176,1,,8,2.0
71,177,121,,3,4.0
71,178,65,,10,4.5
72,179,61,,3,8.0
72,180,6,577.0,3,7.0
72,181,78,,3,2.0
73,182,78,,3,2.0
73,183,24,,3,3.0
74,184,27,,3,2.0
74,185,101,85.0,2,2.0
74,186,48,,3,4.5
75,187,55,,3,5.0
75,188,3,,3,5.0
76,189,13,,3,4.5
76,190,89,,8,0.8
76,191,38,,4,0.5
77,192,52,,3,4.0
77,193,2,,10,4.0
78,194,19,,3,2.0
78,195,97,564.0,6,9.0
78,196,48,,3,4.5
79,197,69,,3,2.0
79,198,21,,6,4.0
80,199,45,,3,2.0
80,200,125,27.0,8,7.0
80,201,78,,3,2.0
81,202,106,,3,7.0
81,203,60,,3,0.5
82,204,91,,3,1.2
82,205,46,,4,8.0
82,206,1,,8,2.0
83,207,36,,3,0.5
83,208,119,,4,2.0
84,209,30,,3,4.0
84,210,114,251.0,3,4.5
84,211,71,,3,4.0
85,212,113,,4,4.5
85,213,71,,3,4.0
86,214,116,,4,3.0
86,215,75,199.0,6,7.0
86,216,34,,3,0.75
87,217,83,,9,0.8
87,218,43,,6,2.3
88,219,95,,3,2.0
88,220,56,,8,7.0
88,221,17,,4,3.5
89,222,73,,6,3.0
89,223,35,,1,1.0
90,224,94,,3,4.0
90,225,57,276.0,6,8.0
90,226,20,,3,8.0
91,227,83,,7,0.8
91,228,47,,3,9.0
92,229,113,,4,4.5
92,230,78,453.0,3,2.0
92,231,43,,3,2.3
93,232,113,,3,4.5
93,233,79,,3,1.5
94,234,25,,3,7.0
94,235,119,,2,2.0
94,236,86,,4,0.5
95,237,36,,3,0.5
95,238,4,,8,5.0
96,239,84,,3,0.75
96,240,53,483.0,3,5.0
96,241,22,,3,2.0
97,242,106,,8,7.0
97,243,76,,3,4.0
98,244,36,,3,0.5
98,245,7,13.0,10,8.0
98,246,105,,3,5.0
100,249,8,,3,8.0
100,250,108,,3,8.0
100,251,81,,3,2.0
101,252,52,,3,4.0
101,253,26,,10,4.0
102,254,1,,3,2.0
102,255,102,285.0,3,4.0
102,256,77,,3,2.0
103,257,55,,5,5.0
103,258,31,,6,2.0
104,259,12,,3,4.0
104,260,116,130.0,8,3.0
104,261,93,,3,2.3
105,262,78,,3,2.0
105,263,56,,3,7.0
106,264,44,,3,4.0
106,265,23,,2,3.0
106,266,2,,4,4.0
107,267,121,,9,4.0
107,268,101,,4,2.0
108,269,96,,3,8.0
108,270,77,636.0,3,2.0
108,271,58,,3,8.0
109,272,57,,3,8.0
109,273,39,,3,0.8
110,274,41,,4,1.2
110,275,24,384.0,3,3.0
110,276,7,,3,8.0
111,277,13,,3,4.5
111,278,124,,3,3.0
112,279,6,,3,7.0
112,280,118,,4,6.0
112,281,103,,8,5.0
113,282,116,,3,3.0
113,283,102,,6,4.0
114,284,118,,3,6.0
114,285,105,376.0,6,5.0
114,286,92,,3,2.4
115,287,112,,8,4.0
115,288,100,,3,5.6
116,289,123,,3,3.0
116,290,112,69.0,4,4.0
116,291,101,,3,2.0
117,292,1,,3,2.0
117,293,118,,6,6.0
118,294,21,,3,4.0
118,295,12,,3,4.0
118,296,3,,3,5.0
119,297,37,,3,0.5
119,298,29,,10,1.5
120,299,66,,3,3.0
120,300,59,528.0,3,3.0
120,301,52,,3,4.0
121,302,93,,6,2.3
121,303,87,,9,0.5
122,304,4,,8,5.0
122,305,126,191.0,3,4.0
122,306,121,,3,4.0
123,307,42,,6,2.4
123,308,38,,3,0.5
124,309,89,,3,0.8
124,310,86,,8,0.5
124,311,83,,4,0.8
125,312,11,,3,8.0
125,313,9,,9,3.0
126,314,67,,3,3.5
126,315,66,718.0,3,3.0
126,316,65,,3,4.5
127,317,1,,11,2.0
127,318,1,,6,2.0
128,319,65,,4,4.5
128,320,66,109.0,3,3.0
128,321,67,,3,3.5
129,322,9,,6,3.0
129,323,11,,9,8.0
130,324,83,,3,0.8
130,325,86,,8,0.5
130,326,89,,4,0.8
131,327,38,,6,0.5
131,328,42,,3,2.4
132,329,121,,3,4.0
132,330,126,705.0,3,4.0
132,331,4,,3,5.0
133,332,87,,3,0.5
133,333,93,,9,2.3
134,334,52,,8,4.0
134,335,59,48.0,2,3.0
134,336,66,,3,3.0
135,337,29,,3,1.5
135,338,37,,6,0.5
136,339,3,,3,5.0
136,340,12,,3,4.0
136,341,21,,3,4.0
137,342,118,,3,6.0
137,343,1,,11,2.0
138,344,101,,3,2.0
138,345,112,368.0,3,4.0
138,346,123,,3,3.0
139,347,100,,8,5.6
139,348,112,,3,4.0
140,349,92,,4,2.4
140,350,105,6.0,3,5.0
140,351,118,,3,6.0
141,352,102,,3,4.0
141,353,116,,3,3.0
142,354,103,,3,5.0
142,355,118,,4,6.0
142,356,6,,3,7.0
143,357,124,,3,3.0
143,358,13,,2,4.5
144,359,7,,3,8.0
144,360,24,326.0,3,3.0
144,361,41,,3,1.2
145,362,39,,6,0.8
145,363,57,,3,8.0
146,364,58,,8,8.0
146,365,77,507.0,2,2.0
146,366,96,,3,8.0
147,367,101,,9,2.0
147,368,121,,3,4.0
148,369,2,,3,4.0
148,370,23,,8,3.0
148,371,44,,4,4.0
149,372,56,,3,7.0
149,373,78,,6,2.0
150,374,93,,3,2.3
150,375,116,358.0,3,3.0
150,376,12,,3,4.0
151,377,31,,5,2.0
151,378,55,,6,5.0
152,379,77,,4,2.0
152,380,102,19.0,3,4.0
152,381,1,,3,2.0
153,382,26,,3,4.0
153,383,52,,3,4.0
154,384,81,,3,2.0
154,385,108,,3,8.0
154,386,8,,4,8.0
155,387,41,,9,1.2
155,388,69,,3,2.0
156,389,105,,3,5.0
156,390,7,401.0,3,8.0
156,391,36,,3,0.5
157,392,76,,8,4.0
157,393,106,,6,7.0
158,394,22,,8,2.0
158,395,53,170.0,2,5.0
158,396,84,,3,0.75
159,397,4,,3,5.0
159,398,36,,3,0.5
160,399,86,,3,0.5
160,400,119,,8,2.0
160,401,25,,8,7.0
161,402,79,,6,1.5
161,403,113,,7,4.5
162,404,43,,3,2.3
162,405,78,290.0,3,2.0
162,406,113,,3,4.5
163,407,47,,7,9.0
163,408,83,,3,0.8
164,409,20,,4,8.0
164,410,57,90.0,3,8.0
164,411,94,,3,4.0
165,412,35,,3,1.0
165,413,73,,9,3.0
166,414,17,,3,3.5
166,415,56,,8,7.0
166,416,95,,4,2.0
167,417,43,,9,2.3
167,418,83,,10,0.8
168,419,34,,3,0.75
168,420,75,650.0,3,7.0
168,421,116,,3,3.0
169,422,71,,10,4.0
169,423,113,,3,4.5
170,424,71,,4,4.0
170,425,114,78.0,3,4.5
170,426,30,,3,4.0
171,427,119,,3,2.0
171,428,36,,3,0.5
172,429,1,,3,2.0
172,430,46,,4,8.0
172,431,91,,8,1.2
173,432,60,,3,0.5
173,433,106,,2,7.0
174,434,78,,3,2.0
174,435,125,323.0,6,7.0
174,436,45,,3,2.0
175,437,21,,3,4.0
175,438,69,,6,2.0
176,439,48,,3,4.5
176,440,97,265.0,4,9.0
176,441,19,,3,2.0
177,442,2,,3,4.0
177,443,52,,3,4.0
178,444,38,,3,0.5
178,445,89,,2,0.8
178,446,13,,8,4.5
179,447,3,,3,5.0
179,448,55,,8,5.0
180,449,48,,3,4.5
180,450,101,520.0,3,2.0
180,451,27,,3,2.0
181,452,24,,3,3.0
181,453,78,,6,2.0
182,454,78,,3,2.0
182,455,6,342.0,3,7.0
182,456,61,,3,8.0
183,457,65,,3,4.5
183,458,121,,6,4.0
184,459,1,,3,2.0
184,460,58,,4,8.0
184,461,115,,8,4.5
185,462,126,,3,4.0
185,463,57,,3,8.0
186,464,71,,3,4.0
186,465,3,552.0,6,5.0
186,466,62,,3,4.0
187,467,80,,4,4.0
187,468,13,,3,4.5
188,469,34,,8,0.75
188,470,95,66.0,8,2.0
188,471,29,,3,1.5
189,472,54,,3,5.0
189,473,116,,3,3.0
190,474,17,,3,3.5
190,475,80,,8,4.0
190,476,16,,8,3.0
191,477,48,,3,4.5
191,478,112,,8,4.0
192,479,20,,3,8.0
192,480,85,138.0,3,1.0
192,481,23,,3,3.0
193,482,62,,4,4.0
193,483,1,,3,2.0
194,484,43,,8,2.3
194,485,110,421.0,8,0.5
194,486,50,,3,5.6
195,487,96,,3,8.0
195,488,37,,3,0.5
196,489,86,,3,0.5
196,490,28,,4,2.0
196,491,97,,8,9.0
197,492,23,,3,3.0
197,493,93,,9,2.3
198,494,22,,3,2.0
198,495,93,156.0,6,2.3
198,496,37,,3,0.5
199,497,97,,11,9.0
199,498,42,,3,2.4
200,499,105,,3,5.0
200,500,51,445.0,3,2.0
200,501,124,,3,3.0
201,502,64,,3,4.5
201,503,11,,9,8.0
202,504,81,,3,2.0
202,505,29,,2,1.5
202,506,104,,4,5.0
203,507,51,,3,2.0
203,508,1,,8,2.0
204,509,77,,3,2.0
204,510,27,570.0,3,2.0
204,511,104,,3,5.0
205,512,58,,8,8.0
205,513,9,,9,3.0
206,514,93,,3,2.3
206,515,45,39.0,6,2.0
206,516,124,,3,3.0
207,517,85,,3,1.0
207,518,38,,3,0.5
208,519,2,,3,4.0
208,520,83,,8,0.8
208,521,37,,8,0.5
209,522,5,,6,5.0
209,523,87,,9,0.5
210,524,58,,3,8.0
210,525,14,529.0,3,4.5
210,526,97,,3,9.0
211,527,72,,3,2.0
211,528,29,,3,1.5
212,529,7,,8,8.0
212,530,92,58.0,8,2.4
212,531,50,,3,5.6
213,532,32,,3,5.0
213,533,118,,6,6.0
214,534,103,,3,5.0
214,535,63,,6,4.5
214,536,23,,4,3.0
215,537,12,,3,4.0
215,538,100,,8,5.6
216,539,92,,3,2.4
216,540,54,365.0,3,5.0
216,541,16,,3,3.0
217,542,12,,3,4.0
217,543,102,,6,4.0
218,544,101,,4,2.0
218,545,65,53.0,2,4.5
218,546,29,,3,1.5
219,547,32,,3,5.0
219,548,124,,3,3.0
221,552,72,,3,2.0
221,553,39,,3,0.8
222,554,52,,3,4.0
222,555,20,306.0,3,8.0
222,556,115,,3,4.5
223,557,5,,7,5.0
223,558,101,,6,2.0
224,559,121,,8,4.0
224,560,91,150.0,4,1.2
224,561,61,,3,8.0
225,562,85,,6,1.0
225,563,56,,3,7.0
226,564,83,,3,0.8
226,565,55,,10,5.0
226,566,27,,3,2.0
227,567,58,,6,8.0
227,568,31,,8,2.0
228,569,65,,3,4.5
228,570,39,592.0,3,0.8
228,571,13,,3,4.5
229,572,51,,3,2.0
229,573,26,,6,4.0
230,574,67,,8,3.5
230,575,43,203.0,10,2.3
230,576,19,,3,2.0
231,577,64,,3,4.5
231,578,41,,6,1.2
232,579,89,,3,0.8
232,580,67,,4,3.5
232,581,45,,3,2.0
233,582,97,,6,9.0
233,583,76,,8,4.0
234,584,4,,3,5.0
234,585,111,476.0,6,8.0
234,586,91,,3,1.2
235,587,23,,7,3.0
235,588,4,,3,5.0
236,589,66,,3,3.0
236,590,48,24.0,3,4.5
236,591,30,,3,4.0
237,592,96,,3,8.0
237,593,79,,3,1.5
238,594,21,,3,4.0
238,595,5,,2,5.0
238,596,116,,4,3.0
239,597,62,,6,4.0
239,598,47,,10,9.0
240,599,123,,3,3.0
240,600,109,654.0,3,3.0
240,601,95,,3,2.0
241,602,48,,3,4.5
241,603,35,,9,1.0
242,604,118,,8,6.0
242,605,106,21.0,4,7.0
242,606,94,,3,4.0
243,607,54,,6,5.0
243,608,43,,3,2.3
244,609,6,,3,7.0
244,610,123,,3,3.0
244,611,113,,4,4.5
245,612,80,,3,4.0
245,613,71,,7,4.0
246,614,41,,3,1.2
246,615,33,74.0,6,0.8
246,616,25,,3,7.0
247,617,126,,6,4.0
247,618,119,,6,2.0
248,619,96,,3,8.0
248,620,90,175.0,3,1.0
248,621,84,,3,0.75
249,622,65,,6,4.5
249,623,60,,3,0.5
250,624,44,,3,4.0
250,625,40,,4,1.0
250,626,36,,3,0.5
251,627,24,,3,3.0
251,628,21,,3,4.0
252,629,12,,3,4.0
252,630,10,360.0,3,0.5
252,631,8,,3,8.0
253,632,3,,3,5.0
253,633,2,,6,4.0
254,634,1,,8,2.0
254,635,1,101.0,10,2.0
254,636,1,,3,2.0
255,637,2,,6,4.0
255,638,3,,6,5.0
256,639,8,,3,8.0
256,640,10,,4,0.5
256,641,12,,3,4.0
257,642,21,,6,4.0
257,643,24,,3,3.0
258,644,36,,3,0.5
258,645,40,622.0,3,1.0
258,646,44,,3,4.0
259,647,60,,3,0.5
259,648,65,,3,4.5
260,649,84,,3,0.75
260,650,90,2.0,3,1.0
260,651,96,,3,8.0
261,652,119,,3,2.0
261,653,126,,6,4.0
262,654,25,,3,7.0
262,655,33,,6,0.8
262,656,41,,4,1.2
263,657,71,,9,4.0
263,658,80,,4,4.0
264,659,113,,3,4.5
264,660,123,224.0,3,3.0
264,661,6,,3,7.0
265,662,43,,2,2.3
265,663,54,,6,5.0
266,664,94,,8,4.0
266,665,106,81.0,4,7.0
266,666,118,,3,6.0
267,667,35,,3,1.0
267,668,48,,3,4.5
268,669,95,,3,2.0
268,670,109,,4,3.0
268,671,123,,3,3.0
269,672,47,,3,9.0
269,673,62,,10,4.0
270,674,116,,3,3.0
270,675,5,221.0,6,5.0
270,676,21,,3,4.0
271,677,79,,5,1.5
271,678,96,,3,8.0
272,679,30,,3,4.0
272,680,48,208.0,3,4.5
272,681,66,,3,3.0
273,682,4,,3,5.0
273,683,23,,9,3.0
274,684,91,,3,1.2
274,685,111,,6,8.0
274,686,4,,8,5.0
275,687,76,,3,4.0
275,688,97,,8,9.0
276,689,45,,3,2.0
276,690,67,596.0,3,3.5
276,691,89,,3,0.8
277,692,41,,4,1.2
277,693,64,,3,4.5
278,694,19,,8,2.0
278,695,43,113.0,10,2.3
278,696,67,,3,3.5
279,697,26,,6,4.0
279,698,51,,6,2.0
280,699,13,,3,4.5
280,700,39,,3,0.8
280,701,65,,4,4.5
281,702,31,,6,2.0
281,703,58,,2,8.0
282,704,27,,3,2.0
282,705,55,373.0,6,5.0
282,706,83,,3,0.8
283,707,56,,4,7.0
283,708,85,,3,1.0
284,709,61,,8,8.0
284,710,91,264.0,4,1.2
284,711,121,,3,4.0
285,712,101,,3,2.0
285,713,5,,9,5.0
286,714,115,,3,4.5
286,715,20,,8,8.0
286,716,52,,8,4.0
287,717,39,,9,0.8
287,718,72,,3,2.0
288,719,62,,3,4.0
288,720,96,694.0,3,8.0
288,721,3,,3,5.0
289,722,124,,8,3.0
289,723,32,,3,5.0
290,724,29,,4,1.5
290,725,65,80.0,2,4.5
290,726,101,,3,2.0
291,727,102,,6,4.0
291,728,12,,3,4.0
292,729,16,,3,3.0
292,730,54,,3,5.0
292,731,92,,4,2.4
293,732,100,,3,5.6
293,733,12,,3,4.0
294,734,23,,3,3.0
294,735,63,386.0,6,4.5
294,736,103,,3,5.0
295,737,118,,2,6.0
295,738,32,,3,5.0
296,739,50,,4,5.6
296,740,92,37.0,8,2.4
296,741,7,,3,8.0
297,742,29,,6,1.5
297,743,72,,3,2.0
298,744,97,,3,9.0
298,745,14,,8,4.5
298,746,58,,8,8.0
299,747,87,,3,0.5
299,748,5,,4,5.0
300,749,37,,3,0.5
300,750,83,408.0,3,0.8
300,751,2,,3,4.0
301,752,38,,4,0.5
301,753,85,,9,1.0
302,754,124,,8,3.0
302,755,45,253.0,6,2.0
302,756,93,,3,2.3
303,757,9,,3,3.0
303,758,58,,3,8.0
304,759,104,,3,5.0
304,760,27,,3,2.0
304,761,77,,4,2.0
305,762,1,,6,2.0
305,763,51,,9,2.0
306,764,104,,3,5.0
306,765,29,351.0,6,1.5
306,766,81,,3,2.0
307,767,11,,7,8.0
307,768,64,,3,4.5
308,769,124,,8,3.0
308,770,51,584.0,3,2.0
308,771,105,,3,5.0
309,772,42,,3,2.4
309,773,97,,9,9.0
310,774,37,,3,0.5
310,775,93,,6,2.3
310,776,22,,8,2.0
311,777,93,,3,2.3
311,778,23,,10,3.0
312,779,97,,3,9.0
312,780,28,455.0,3,2.0
312,781,86,,3,0.5
313,782,37,,2,0.5
313,783,96,,3,8.0
314,784,50,,4,5.6
314,785,110,8.0,8,0.5
314,786,43,,3,2.3
315,787,1,,9,2.0
315,788,62,,3,4.0
316,789,23,,3,3.0
316,790,85,,4,1.0
316,791,20,,4,8.0
317,792,112,,3,4.0
317,793,48,,3,4.5
318,794,16,,3,3.0
318,795,80,271.0,3,4.0
318,796,17,,3,3.5
319,797,116,,4,3.0
319,798,54,,3,5.0
320,799,29,,4,1.5
320,800,95,136.0,8,2.0
320,801,34,,3,0.75
321,802,13,,6,4.5
321,803,80,,3,4.0
322,804,62,,3,4.0
322,805,3,,6,5.0
322,806,71,,4,4.0
323,807,57,,9,8.0
323,808,126,,3,4.0
324,809,115,,3,4.5
324,810,58,461.0,3,8.0
324,811,1,,3,2.0
325,812,121,,8,4.0
325,813,65,,9,4.5
326,814,61,,8,8.0
326,815,6,29.0,3,7.0
326,816,78,,3,2.0
327,817,78,,6,2.0
327,818,24,,3,3.0
328,819,27,,3,2.0
328,820,101,,8,2.0
328,821,48,,3,4.5
329,822,55,,6,5.0
329,823,3,,9,5.0
330,824,13,,3,4.5
330,825,89,525.0,6,0.8
330,826,38,,3,0.5
331,827,52,,8,4.0
331,828,2,,3,4.0
332,829,19,,8,2.0
332,830,97,119.0,4,9.0
332,831,48,,3,4.5
333,832,69,,3,2.0
333,833,21,,9,4.0
334,834,45,,3,2.0
334,835,125,,2,7.0
334,836,78,,3,2.0
335,837,106,,6,7.0
335,838,60,,3,0.5
336,839,91,,3,1.2
336,840,46,334.0,3,8.0
336,841,1,,3,2.0
337,842,36,,3,0.5
337,843,119,,9,2.0
338,844,30,,3,4.0
338,845,114,531.0,3,4.5
338,846,71,,3,4.0
339,847,113,,9,4.5
339,848,71,,3,4.0
340,849,116,,3,3.0
340,850,75,,3,7.0
340,851,34,,8,0.75
341,852,83,,3,0.8
341,853,43,,11,2.3
342,854,95,,3,2.0
342,855,56,651.0,3,7.0
342,856,17,,3,3.5
343,857,73,,11,3.0
343,858,35,,6,1.0
344,859,94,,8,4.0
344,860,57,213.0,3,8.0
344,861,20,,3,8.0
345,862,83,,6,0.8
345,863,47,,9,9.0
346,864,113,,3,4.5
346,865,78,,3,2.0
346,866,43,,8,2.3
347,867,113,,9,4.5
347,868,79,,8,1.5
348,869,25,,3,7.0
348,870,119,630.0,3,2.0
348,871,86,,3,0.5
349,872,36,,3,0.5
349,873,4,,3,5.0
350,874,84,,3,0.75
350,875,53,10.0,2,5.0
350,876,22,,3,2.0
351,877,106,,6,7.0
351,878,76,,3,4.0
352,879,36,,3,0.5
352,880,7,,4,8.0
352,881,105,,3,5.0
353,882,69,,6,2.0
353,883,41,,7,1.2
354,884,8,,3,8.0
354,885,108,274.0,3,8.0
354,886,81,,3,2.0
355,887,52,,8,4.0
355,888,26,,3,4.0
356,889,1,,8,2.0
356,890,102,288.0,3,4.0
356,891,77,,3,2.0
357,892,55,,3,5.0
357,893,31,,3,2.0
358,894,12,,3,4.0
358,895,116,,8,3.0
358,896,93,,3,2.3
359,897,78,,6,2.0
359,898,56,,4,7.0
360,899,44,,3,4.0
360,900,23,560.0,3,3.0
360,901,2,,3,4.0
361,902,121,,2,4.0
361,903,101,,3,2.0
362,904,96,,3,8.0
362,905,77,357.0,2,2.0
362,906,58,,3,8.0
363,907,57,,9,8.0
363,908,39,,3,0.8
364,909,41,,3,1.2
364,910,24,,3,3.0
364,911,7,,8,8.0
365,912,13,,3,4.5
365,913,124,,8,3.0
366,914,6,,3,7.0
366,915,118,643.0,3,6.0
366,916,103,,3,5.0
367,917,116,,4,3.0
367,918,102,,3,4.0
368,919,118,,8,6.0
368,920,105,121.0,3,5.0
368,921,92,,3,2.4
369,922,112,,3,4.0
369,923,100,,3,5.6
370,924,123,,3,3.0
370,925,112,,4,4.0
370,926,101,,4,2.0
371,927,1,,9,2.0
371,928,118,,8,6.0
372,929,21,,3,4.0
372,930,12,280.0,3,4.0
372,931,3,,3,5.0
373,932,37,,8,0.5
373,933,29,,9,1.5
374,934,66,,3,3.0
374,935,59,139.0,2,3.0
374,936,52,,3,4.0
375,937,93,,3,2.3
375,938,87,,6,0.5
376,939,4,,3,5.0
376,940,126,,3,4.0
376,941,121,,8,4.0
377,942,42,,3,2.4
377,943,38,,10,0.5
378,944,89,,3,0.8
378,945,86,436.0,3,0.5
378,946,83,,3,0.8
379,947,11,,7,8.0
379,948,9,,3,3.0
380,949,67,,8,3.5
380,950,66,42.0,3,3.0
380,951,65,,3,4.5
381,952,1,,3,2.0
381,953,1,,9,2.0
382,954,65,,3,4.5
382,955,66,,3,3.0
382,956,67,,8,3.5
383,957,9,,3,3.0
383,958,11,,10,8.0
384,959,83,,3,0.8
384,960,86,499.0,3,0.5
384,961,89,,3,0.8
385,962,38,,4,0.5
385,963,42,,6,2.4
386,964,121,,8,4.0
386,965,126,178.0,3,4.0
386,966,4,,3,5.0
387,967,87,,3,0.5
387,968,93,,3,2.3
388,969,52,,3,4.0
388,970,59,,8,3.0
388,971,66,,3,3.0
389,972,29,,3,1.5
389,973,37,,5,0.5
390,974,3,,3,5.0
390,975,12,517.0,3,4.0
390,976,21,,3,4.0
391,977,118,,2,6.0
391,978,1,,6,2.0
392,979,101,,4,2.0
392,980,112,295.0,4,4.0
392,981,123,,3,3.0
393,982,100,,3,5.6
393,983,112,,3,4.0
394,984,92,,3,2.4
394,985,105,,6,5.0
394,986,118,,8,6.0
395,987,102,,6,4.0
395,988,116,,4,3.0
396,989,103,,3,5.0
396,990,118,547.0,3,6.0
396,991,6,,3,7.0
397,992,124,,8,3.0
397,993,13,,9,4.5
398,994,7,,8,8.0
398,995,24,63.0,3,3.0
398,996,41,,3,1.2
399,997,39,,9,0.8
399,998,57,,6,8.0
400,999,58,,3,8.0
400,1000,77,,8,2.0
400,1001,96,,3,8.0
401,1002,101,,6,2.0
401,1003,121,,11,4.0
402,1004,2,,3,4.0
402,1005,23,687.0,6,3.0
402,1006,44,,3,4.0
403,1007,56,,4,7.0
403,1008,78,,3,2.0
404,1009,93,,3,2.3
404,1010,116,94.0,8,3.0
404,1011,12,,3,4.0
405,1012,31,,3,2.0
405,1013,55,,3,5.0
406,1014,77,,3,2.0
406,1015,102,,3,4.0
406,1016,1,,8,2.0
407,1017,26,,6,4.0
407,1018,52,,8,4.0
408,1019,81,,3,2.0
408,1020,108,84.0,3,8.0
408,1021,8,,3,8.0
409,1022,41,,10,1.2
409,1023,69,,3,2.0
410,1024,105,,3,5.0
410,1025,7,106.0,10,8.0
410,1026,36,,3,0.5
411,1027,76,,3,4.0
411,1028,106,,3,7.0
412,1029,22,,3,2.0
412,1030,53,,8,5.0
412,1031,84,,3,0.75
413,1032,4,,3,5.0
413,1033,36,,3,0.5
414,1034,86,,3,0.5
414,1035,119,327.0,6,2.0
414,1036,25,,3,7.0
415,1037,79,,5,1.5
415,1038,113,,6,4.5
416,1039,43,,8,2.3
416,1040,78,153.0,3,2.0
416,1041,113,,3,4.5
417,1042,47,,6,9.0
417,1043,83,,9,0.8
418,1044,20,,3,8.0
418,1045,57,,6,8.0
418,1046,94,,8,4.0
419,1047,35,,3,1.0
419,1048,73,,8,3.0
420,1049,17,,3,3.5
420,1050,56,646.0,3,7.0
420,1051,95,,3,2.0
421,1052,43,,8,2.3
421,1053,83,,3,0.8
422,1054,34,,8,0.75
422,1055,75,86.0,6,7.0
422,1056,116,,3,3.0
423,1057,71,,9,4.0
423,1058,113,,6,4.5
424,1059,71,,3,4.0
424,1060,114,,3,4.5
424,1061,30,,3,4.0
425,1062,119,,6,2.0
425,1063,36,,3,0.5
426,1064,1,,3,2.0
426,1065,46,267.0,3,8.0
426,1066,91,,3,1.2
427,1067,60,,3,0.5
427,1068,106,,3,7.0
428,1069,78,,3,2.0
428,1070,125,330.0,8,7.0
428,1071,45,,3,2.0
429,1072,21,,3,4.0
429,1073,69,,9,2.0
430,1074,48,,3,4.5
430,1075,97,,10,9.0
430,1076,19,,8,2.0
431,1077,2,,6,4.0
431,1078,52,,8,4.0
432,1079,38,,3,0.5
432,1080,89,341.0,3,0.8
432,1081,13,,3,4.5
433,1082,3,,6,5.0
433,1083,55,,9,5.0
434,1084,48,,3,4.5
434,1085,101,179.0,2,2.0
434,1086,27,,3,2.0
435,1087,24,,3,3.0
435,1088,78,,3,2.0
436,1089,78,,3,2.0
436,1090,6,,3,7.0
436,1091,61,,8,8.0
437,1092,65,,3,4.5
437,1093,121,,5,4.0
438,1094,1,,3,2.0
438,1095,58,393.0,3,8.0
438,1096,115,,3,4.5
439,1097,126,,6,4.0
439,1098,57,,6,8.0
440,1099,71,,4,4.0
440,1100,3,102.0,3,5.0
440,1101,62,,3,4.0
441,1102,80,,3,4.0
441,1103,13,,3,4.5
442,1104,34,,3,0.75
442,1105,95,,2,2.0
442,1106,29,,4,1.5
443,1107,54,,6,5.0
443,1108,116,,4,3.0
444,1109,17,,3,3.5
444,1110,80,293.0,3,4.0
444,1111,16,,3,3.0
445,1112,48,,3,4.5
445,1113,112,,3,4.0
446,1114,20,,4,8.0
446,1115,85,574.0,10,1.0
446,1116,23,,3,3.0
447,1117,62,,6,4.0
447,1118,1,,6,2.0
448,1119,43,,3,2.3
448,1120,110,,8,0.5
448,1121,50,,4,5.6
449,1122,96,,3,8.0
449,1123,37,,11,0.5
450,1124,86,,3,0.5
450,1125,28,633.0,3,2.0
450,1126,97,,3,9.0
451,1127,23,,7,3.0
451,1128,93,,3,2.3
452,1129,22,,8,2.0
452,1130,93,180.0,3,2.3
452,1131,37,,3,0.5
453,1132,97,,3,9.0
453,1133,42,,6,2.4
454,1134,105,,3,5.0
454,1135,51,,6,2.0
454,1136,124,,8,3.0
455,1137,64,,3,4.5
455,1138,11,,10,8.0
456,1139,81,,3,2.0
456,1140,29,597.0,3,1.5
456,1141,104,,3,5.0
457,1142,51,,6,2.0
457,1143,1,,3,2.0
458,1144,77,,4,2.0
458,1145,27,98.0,6,2.0
458,1146,104,,3,5.0
459,1147,58,,6,8.0
459,1148,9,,3,3.0
460,1149,93,,3,2.3
460,1150,45,,3,2.0
460,1151,124,,8,3.0
461,1152,85,,3,1.0
461,1153,38,,10,0.5
462,1154,2,,3,4.0
462,1155,83,473.0,6,0.8
462,1156,37,,3,0.5
463,1157,5,,7,5.0
463,1158,87,,6,0.5
464,1159,58,,8,8.0
464,1160,14,51.0,8,4.5
464,1161,97,,3,9.0
466,1164,7,,3,8.0
466,1165,92,,8,2.4
466,1166,50,,4,5.6
467,1167,32,,3,5.0
467,1168,118,,8,6.0
468,1169,103,,3,5.0
468,1170,63,407.0,3,4.5
468,1171,23,,3,3.0
469,1172,12,,3,4.0
469,1173,100,,3,5.6
470,1174,92,,4,2.4
470,1175,54,605.0,3,5.0
470,1176,16,,3,3.0
471,1177,12,,3,4.0
471,1178,102,,3,4.0
472,1179,101,,3,2.0
472,1180,65,,8,4.5
472,1181,29,,4,1.5
473,1182,32,,3,5.0
473,1183,124,,8,3.0
474,1184,3,,3,5.0
474,1185,96,582.0,3,8.0
474,1186,62,,3,4.0
475,1187,72,,3,2.0
475,1188,39,,3,0.8
476,1189,52,,8,4.0
476,1190,20,95.0,8,8.0
476,1191,115,,3,4.5
477,1192,5,,3,5.0
477,1193,101,,9,2.0
478,1194,121,,3,4.0
478,1195,91,,10,1.2
478,1196,61,,8,8.0
479,1197,85,,3,1.0
479,1198,56,,4,7.0
480,1199,83,,3,0.8
480,1200,55,303.0,3,5.0
480,1201,27,,3,2.0
481,1202,58,,8,8.0
481,1203,31,,9,2.0
482,1204,65,,4,4.5
482,1205,39,76.0,6,0.8
482,1206,13,,3,4.5
483,1207,51,,3,2.0
483,1208,26,,3,4.0
484,1209,67,,3,3.5
484,1210,43,,4,2.3
484,1211,19,,8,2.0
485,1212,64,,3,4.5
485,1213,41,,1,1.2
486,1214,89,,3,0.8
486,1215,67,451.0,6,3.5
486,1216,45,,3,2.0
487,1217,97,,11,9.0
487,1218,76,,3,4.0
488,1219,4,,8,5.0
488,1220,111,68.0,3,8.0
488,1221,91,,3,1.2
489,1222,23,,6,3.0
489,1223,4,,3,5.0
490,1224,66,,3,3.0
490,1225,48,,3,4.5
490,1226,30,,3,4.0
491,1227,96,,3,8.0
491,1228,79,,8,1.5
492,1229,21,,3,4.0
492,1230,5,602.0,3,5.0
492,1231,116,,3,3.0
493,1232,62,,4,4.0
493,1233,47,,3,9.0
494,1234,123,,3,3.0
494,1235,109,108.0,10,3.0
494,1236,95,,3,2.0
495,1237,48,,3,4.5
495,1238,35,,6,1.0
496,1239,118,,3,6.0
496,1240,106,,4,7.0
496,1241,94,,8,4.0
497,1242,54,,3,5.0
497,1243,43,,5,2.3
498,1244,6,,3,7.0
498,1245,123,129.0,6,3.0
498,1246,113,,3,4.5
499,1247,80,,4,4.0
499,1248,71,,3,4.0
500,1249,41,,4,1.2
500,1250,33,369.0,3,0.8
500,1251,25,,3,7.0
501,1252,126,,3,4.0
501,1253,119,,3,2.0
502,1254,96,,3,8.0
502,1255,90,,3,1.0
502,1256,84,,3,0.75
503,1257,65,,3,4.5
503,1258,60,,3,0.5
504,1259,44,,3,4.0
504,1260,40,648.0,3,1.0
504,1261,36,,3,0.5
505,1262,24,,3,3.0
505,1263,21,,3,4.0
506,1264,12,,3,4.0
506,1265,10,244.0,4,0.5
506,1266,8,,3,8.0
507,1267,3,,3,5.0
507,1268,2,,3,4.0
508,1269,1,,3,2.0
508,1270,1,,4,2.0
508,1271,1,,8,2.0
509,1272,2,,3,4.0
509,1273,3,,3,5.0
510,1274,8,,3,8.0
510,1275,10,486.0,3,0.5
510,1276,12,,3,4.0
511,1277,21,,3,4.0
511,1278,24,,3,3.0
512,1279,36,,3,0.5
512,1280,40,33.0,4,1.0
512,1281,44,,3,4.0
513,1282,60,,3,0.5
513,1283,65,,3,4.5
514,1284,84,,3,0.75
514,1285,90,,3,1.0
514,1286,96,,3,8.0
515,1287,119,,3,2.0
515,1288,126,,3,4.0
516,1289,25,,3,7.0
516,1290,33,190.0,3,0.8
516,1291,41,,3,1.2
517,1292,71,,4,4.0
517,1293,80,,3,4.0
518,1294,113,,4,4.5
518,1295,123,410.0,6,3.0
518,1296,6,,3,7.0
519,1297,43,,9,2.3
519,1298,54,,3,5.0
520,1299,94,,3,4.0
520,1300,106,,4,7.0
520,1301,118,,8,6.0
521,1302,35,,6,1.0
521,1303,48,,3,4.5
522,1304,95,,3,2.0
522,1305,109,427.0,6,3.0
522,1306,123,,3,3.0
523,1307,47,,7,9.0
523,1308,62,,3,4.0
524,1309,116,,4,3.0
524,1310,5,218.0,8,5.0
524,1311,21,,3,4.0
525,1312,79,,3,1.5
525,1313,96,,3,8.0
526,1314,30,,3,4.0
526,1315,48,,3,4.5
526,1316,66,,3,3.0
527,1317,4,,3,5.0
527,1318,23,,10,3.0
528,1319,91,,3,1.2
528,1320,111,587.0,3,8.0
528,1321,4,,3,5.0
529,1322,76,,8,4.0
529,1323,97,,3,9.0
530,1324,45,,3,2.0
530,1325,67,17.0,10,3.5
530,1326,89,,3,0.8
531,1327,41,,9,1.2
531,1328,64,,3,4.5
532,1329,19,,3,2.0
532,1330,43,,4,2.3
532,1331,67,,8,3.5
533,1332,26,,3,4.0
533,1333,51,,3,2.0
534,1334,13,,3,4.5
534,1335,39,316.0,6,0.8
534,1336,65,,3,4.5
535,1337,31,,5,2.0
535,1338,58,,3,8.0
536,1339,27,,3,2.0
536,1340,55,14.0,4,5.0
536,1341,83,,3,0.8
537,1342,56,,3,7.0
537,1343,85,,3,1.0
538,1344,61,,3,8.0
538,1345,91,,10,1.2
538,1346,121,,8,4.0
539,1347,101,,9,2.0
539,1348,5,,4,5.0
540,1349,115,,3,4.5
540,1350,20,298.0,3,8.0
540,1351,52,,3,4.0
541,1352,39,,3,0.8
541,1353,72,,3,2.0
542,1354,62,,4,4.0
542,1355,96,96.0,3,8.0
542,1356,3,,3,5.0
543,1357,124,,3,3.0
543,1358,32,,3,5.0
544,1359,29,,3,1.5
544,1360,65,,8,4.5
544,1361,101,,4,2.0
545,1362,102,,3,4.0
545,1363,12,,3,4.0
546,1364,16,,3,3.0
546,1365,54,226.0,3,5.0
546,1366,92,,3,2.4
547,1367,100,,8,5.6
547,1368,12,,3,4.0
548,1369,23,,4,3.0
548,1370,63,75.0,3,4.5
548,1371,103,,3,5.0
549,1372,118,,3,6.0
549,1373,32,,3,5.0
550,1374,50,,3,5.6
550,1375,92,,8,2.4
550,1376,7,,8,8.0
551,1377,29,,3,1.5
551,1378,72,,3,2.0
552,1379,97,,3,9.0
552,1380,14,534.0,3,4.5
552,1381,58,,3,8.0
553,1382,87,,6,0.5
553,1383,5,,3,5.0
554,1384,37,,8,0.5
554,1385,83,233.0,2,0.8
554,1386,2,,3,4.0
555,1387,38,,6,0.5
555,1388,85,,3,1.0
556,1389,124,,3,3.0
556,1390,45,,3,2.0
556,1391,93,,3,2.3
557,1392,9,,3,3.0
557,1393,58,,2,8.0
558,1394,104,,3,5.0
558,1395,27,493.0,6,2.0
558,1396,77,,3,2.0
559,1397,1,,11,2.0
559,1398,51,,6,2.0
560,1399,104,,4,5.0
560,1400,29,35.0,8,1.5
560,1401,81,,3,2.0
561,1402,11,,6,8.0
561,1403,64,,3,4.5
562,1404,124,,3,3.0
562,1405,51,,6,2.0
562,1406,105,,3,5.0
563,1407,42,,6,2.4
563,1408,97,,8,9.0
564,1409,37,,3,0.5
564,1410,93,698.0,3,2.3
564,1411,22,,3,2.0
565,1412,93,,3,2.3
565,1413,23,,3,3.0
566,1414,97,,8,9.0
566,1415,28,52.0,4,2.0
566,1416,86,,3,0.5
567,1417,37,,3,0.5
567,1418,96,,3,8.0
568,1419,50,,3,5.6
568,1420,110,,8,0.5
568,1421,43,,8,2.3
569,1422,1,,6,2.0
569,1423,62,,10,4.0
570,1424,23,,3,3.0
570,1425,85,142.0,6,1.0
570,1426,20,,3,8.0
571,1427,112,,8,4.0
571,1428,48,,3,4.5
572,1429,16,,8,3.0
572,1430,80,359.0,8,4.0
572,1431,17,,3,3.5
573,1432,116,,3,3.0
573,1433,54,,6,5.0
574,1434,29,,3,1.5
574,1435,95,,2,2.0
574,1436,34,,8,0.75
575,1437,13,,3,4.5
575,1438,80,,4,4.0
576,1439,62,,3,4.0
576,1440,3,660.0,3,5.0
576,1441,71,,3,4.0
577,1442,57,,6,8.0
577,1443,126,,6,4.0
578,1444,115,,8,4.5
578,1445,58,201.0,4,8.0
578,1446,1,,3,2.0
579,1447,121,,9,4.0
579,1448,65,,3,4.5
580,1449,61,,3,8.0
580,1450,6,,3,7.0
580,1451,78,,3,2.0
581,1452,78,,3,2.0
581,1453,24,,3,3.0
582,1454,27,,3,2.0
582,1455,101,406.0,6,2.0
582,1456,48,,3,4.5
583,1457,55,,5,5.0
583,1458,3,,6,5.0
584,1459,13,,8,4.5
584,1460,89,34.0,8,0.8
584,1461,38,,3,0.5
585,1462,52,,3,4.0
585,1463,2,,6,4.0
586,1464,19,,3,2.0
586,1465,97,,10,9.0
586,1466,48,,3,4.5
587,1467,69,,9,2.0
587,1468,21,,3,4.0
588,1469,45,,3,2.0
588,1470,125,340.0,3,7.0
588,1471,78,,3,2.0
589,1472,106,,8,7.0
589,1473,60,,3,0.5
590,1474,91,,8,1.2
590,1475,46,258.0,4,8.0
590,1476,1,,3,2.0
591,1477,36,,3,0.5
591,1478,119,,6,2.0
592,1479,30,,3,4.0
592,1480,114,,3,4.5
592,1481,71,,4,4.0
593,1482,113,,6,4.5
593,1483,71,,1,4.0
594,1484,116,,3,3.0
594,1485,75,371.0,6,7.0
594,1486,34,,3,0.75
595,1487,83,,7,0.8
595,1488,43,,3,2.3
596,1489,95,,4,2.0
596,1490,56,268.0,8,7.0
596,1491,17,,3,3.5
597,1492,73,,3,3.0
597,1493,35,,3,1.0
598,1494,94,,3,4.0
598,1495,57,,6,8.0
598,1496,20,,4,8.0
599,1497,83,,9,0.8
599,1498,47,,10,9.0
600,1499,113,,3,4.5
600,1500,78,470.0,3,2.0
600,1501,43,,3,2.3
601,1502,113,,10,4.5
601,1503,79,,9,1.5
602,1504,25,,8,7.0
602,1505,119,441.0,2,2.0
602,1506,86,,3,0.5
603,1507,36,,3,0.5
603,1508,4,,3,5.0
604,1509,84,,3,0.75
604,1510,53,279.0,8,5.0
604,1511,22,,8,2.0
605,1512,106,,3,7.0
605,1513,76,,8,4.0
606,1514,36,,3,0.5
606,1515,7,450.0,6,8.0
606,1516,105,,3,5.0
607,1517,69,,3,2.0
607,1518,41,,6,1.2
608,1519,8,,4,8.0
608,1520,108,522.0,3,8.0
608,1521,81,,3,2.0
609,1522,52,,3,4.0
609,1523,26,,6,4.0
610,1524,1,,3,2.0
610,1525,102,97.0,3,4.0
610,1526,77,,4,2.0
611,1527,55,,3,5.0
611,1528,31,,8,2.0
612,1529,12,,3,4.0
612,1530,116,65.0,3,3.0
612,1531,93,,3,2.3
613,1532,78,,3,2.0
613,1533,56,,3,7.0
614,1534,44,,4,4.0
614,1535,23,15.0,2,3.0
614,1536,2,,3,4.0
615,1537,121,,3,4.0
615,1538,101,,6,2.0
616,1539,96,,3,8.0
616,1540,77,379.0,8,2.0
616,1541,58,,8,8.0
617,1542,57,,6,8.0
617,1543,39,,9,0.8
618,1544,41,,3,1.2
618,1545,24,126.0,3,3.0
618,1546,7,,3,8.0
619,1547,13,,5,4.5
619,1548,124,,3,3.0
620,1549,6,,3,7.0
620,1550,118,133.0,4,6.0
620,1551,103,,3,5.0
621,1552,116,,3,3.0
621,1553,102,,6,4.0
622,1554,118,,3,6.0
622,1555,105,649.0,6,5.0
622,1556,92,,4,2.4
623,1557,112,,3,4.0
623,1558,100,,8,5.6
624,1559,123,,3,3.0
624,1560,112,192.0,3,4.0
624,1561,101,,3,2.0
625,1562,1,,2,2.0
625,1563,118,,6,6.0
626,1564,21,,3,4.0
626,1565,12,72.0,3,4.0
626,1566,3,,3,5.0
627,1567,37,,9,0.5
627,1568,29,,3,1.5
628,1569,66,,3,3.0
628,1570,59,202.0,8,3.0
628,1571,52,,8,4.0
629,1572,93,,3,2.3
629,1573,87,,3,0.5
630,1574,4,,3,5.0
630,1575,126,187.0,3,4.0
630,1576,121,,3,4.0
631,1577,42,,6,2.4
631,1578,38,,3,0.5
632,1579,89,,4,0.8
632,1580,86,194.0,8,0.5
632,1581,83,,3,0.8
633,1582,11,,6,8.0
633,1583,9,,3,3.0
634,1584,67,,3,3.5
634,1585,66,5.0,3,3.0
634,1586,65,,4,4.5
635,1587,1,,9,2.0
635,1588,1,,8,2.0
636,1589,65,,3,4.5
636,1590,66,182.0,3,3.0
636,1591,67,,3,3.5
637,1592,9,,3,3.0
637,1593,11,,3,8.0
638,1594,83,,4,0.8
638,1595,86,367.0,8,0.5
638,1596,89,,3,0.8
639,1597,38,,6,0.5
639,1598,42,,3,2.4
640,1599,121,,3,4.0
640,1600,126,57.0,3,4.0
640,1601,4,,8,5.0
641,1602,87,,6,0.5
641,1603,93,,3,2.3
642,1604,52,,3,4.0
642,1605,59,296.0,6,3.0
642,1606,66,,3,3.0
643,1607,29,,1,1.5
643,1608,37,,3,0.5
644,1609,3,,3,5.0
644,1610,12,540.0,3,4.0
644,1611,21,,3,4.0
645,1612,118,,3,6.0
645,1613,1,,9,2.0
646,1614,101,,3,2.0
646,1615,112,385.0,4,4.0
646,1616,123,,3,3.0
647,1617,100,,3,5.6
647,1618,112,,8,4.0
648,1619,92,,3,2.4
648,1620,105,183.0,3,5.0
648,1621,118,,3,6.0
649,1622,102,,3,4.0
649,1623,116,,3,3.0
650,1624,103,,8,5.0
650,1625,118,255.0,4,6.0
650,1626,6,,3,7.0
651,1627,124,,3,3.0
651,1628,13,,3,4.5
652,1629,7,,3,8.0
652,1630,24,116.0,3,3.0
652,1631,41,,4,1.2
653,1632,39,,3,0.8
653,1633,57,,9,8.0
654,1634,58,,3,8.0
654,1635,77,475.0,6,2.0
654,1636,96,,3,8.0
655,1637,101,,7,2.0
655,1638,121,,6,4.0
656,1639,2,,4,4.0
656,1640,23,366.0,8,3.0
656,1641,44,,3,4.0
657,1642,56,,3,7.0
657,1643,78,,6,2.0
658,1644,93,,3,2.3
658,1645,116,434.0,8,3.0
658,1646,12,,3,4.0
659,1647,31,,3,2.0
659,1648,55,,8,5.0
660,1649,77,,3,2.0
660,1650,102,621.0,3,4.0
660,1651,1,,3,2.0
661,1652,26,,4,4.0
661,1653,52,,3,4.0
662,1654,81,,3,2.0
662,1655,108,49.0,3,8.0
662,1656,8,,3,8.0
663,1657,41,,3,1.2
663,1658,69,,6,2.0
664,1659,105,,3,5.0
664,1660,7,420.0,4,8.0
664,1661,36,,3,0.5
665,1662,76,,3,4.0
665,1663,106,,2,7.0
666,1664,22,,3,2.0
666,1665,53,40.0,6,5.0
666,1666,84,,3,0.75
667,1667,4,,8,5.0
667,1668,36,,3,0.5
668,1669,86,,4,0.5
668,1670,119,134.0,8,2.0
668,1671,25,,3,7.0
669,1672,79,,3,1.5
669,1673,113,,9,4.5
670,1674,43,,3,2.3
670,1675,78,20.0,3,2.0
670,1676,113,,4,4.5
671,1677,47,,9,9.0
671,1678,83,,10,0.8
672,1679,20,,3,8.0
672,1680,57,47.0,3,8.0
672,1681,94,,3,4.0
673,1682,35,,10,1.0
673,1683,73,,3,3.0
674,1684,17,,4,3.5
674,1685,56,73.0,8,7.0
674,1686,95,,3,2.0
675,1687,43,,3,2.3
675,1688,83,,3,0.8
676,1689,34,,3,0.75
676,1690,75,243.0,3,7.0
676,1691,116,,4,3.0
677,1692,71,,3,4.0
677,1693,113,,1,4.5
678,1694,71,,3,4.0
678,1695,114,131.0,3,4.5
678,1696,30,,3,4.0
679,1697,119,,1,2.0
679,1698,36,,3,0.5
680,1699,1,,8,2.0
680,1700,46,319.0,4,8.0
680,1701,91,,3,1.2
681,1702,60,,3,0.5
681,1703,106,,6,7.0
682,1704,78,,3,2.0
682,1705,125,91.0,2,7.0
682,1706,45,,3,2.0
683,1707,21,,9,4.0
683,1708,69,,3,2.0
684,1709,48,,3,4.5
684,1710,97,151.0,3,9.0
684,1711,19,,3,2.0
685,1712,2,,4,4.0
685,1713,52,,3,4.0
686,1714,38,,4,0.5
686,1715,89,41.0,2,0.8
686,1716,13,,3,4.5
687,1717,3,,9,5.0
687,1718,55,,6,5.0
688,1719,48,,3,4.5
688,1720,101,168.0,8,2.0
688,1721,27,,3,2.0
689,1722,24,,3,3.0
689,1723,78,,6,2.0
690,1724,78,,3,2.0
690,1725,6,70.0,3,7.0
690,1726,61,,3,8.0
691,1727,65,,1,4.5
691,1728,121,,3,4.0
692,1729,1,,8,2.0
692,1730,58,61.0,4,8.0
692,1731,115,,3,4.5
693,1732,126,,3,4.0
693,1733,57,,9,8.0
694,1734,71,,3,4.0
694,1735,3,257.0,6,5.0
694,1736,62,,4,4.0
695,1737,80,,3,4.0
695,1738,13,,2,4.5
696,1739,34,,3,0.75
696,1740,95,317.0,3,2.0
696,1741,29,,3,1.5
697,1742,54,,3,5.0
697,1743,116,,3,3.0
698,1744,17,,4,3.5
698,1745,80,152.0,8,4.0
698,1746,16,,3,3.0
699,1747,48,,3,4.5
699,1748,112,,3,4.0
700,1749,20,,3,8.0
700,1750,85,294.0,4,1.0
700,1751,23,,4,3.0
701,1752,62,,3,4.0
701,1753,1,,5,2.0
702,1754,43,,3,2.3
702,1755,110,247.0,3,0.5
702,1756,50,,3,5.6
703,1757,96,,3,8.0
703,1758,37,,6,0.5
704,1759,86,,4,0.5
704,1760,28,467.0,4,2.0
704,1761,97,,3,9.0
705,1762,23,,6,3.0
705,1763,93,,3,2.3
706,1764,22,,3,2.0
706,1765,93,196.0,6,2.3
706,1766,37,,8,0.5
707,1767,97,,9,9.0
707,1768,42,,3,2.4
708,1769,105,,3,5.0
708,1770,51,99.0,3,2.0
708,1771,124,,3,3.0
709,1772,64,,8,4.5
709,1773,11,,3,8.0
710,1774,81,,3,2.0
710,1775,29,249.0,2,1.5
710,1776,104,,3,5.0
711,1777,51,,9,2.0
711,1778,1,,6,2.0
712,1779,77,,3,2.0
712,1780,27,235.0,3,2.0
712,1781,104,,4,5.0
713,1782,58,,3,8.0
713,1783,9,,3,3.0
714,1784,93,,3,2.3
714,1785,45,508.0,6,2.0
714,1786,124,,3,3.0
715,1787,85,,5,1.0
715,1788,38,,3,0.5
716,1789,2,,4,4.0
716,1790,83,561.0,8,0.8
716,1791,37,,3,0.5
717,1792,5,,3,5.0
717,1793,87,,3,0.5
718,1794,58,,3,8.0
718,1795,14,54.0,8,4.5
718,1796,97,,8,9.0
719,1797,72,,3,2.0
719,1798,29,,10,1.5
720,1799,7,,3,8.0
720,1800,92,3.0,3,2.4
720,1801,50,,3,5.6
721,1802,32,,4,5.0
721,1803,118,,6,6.0
722,1804,103,,8,5.0
722,1805,63,4.0,6,4.5
722,1806,23,,3,3.0
723,1807,12,,3,4.0
723,1808,100,,3,5.6
724,1809,92,,3,2.4
724,1810,54,312.0,3,5.0
724,1811,16,,8,3.0
725,1812,12,,3,4.0
725,1813,102,,6,4.0
726,1814,101,,3,2.0
726,1815,65,144.0,6,4.5
726,1816,29,,3,1.5
727,1817,32,,4,5.0
727,1818,124,,3,3.0
728,1819,3,,3,5.0
728,1820,96,211.0,3,8.0
728,1821,62,,3,4.0
729,1822,72,,3,2.0
729,1823,39,,9,0.8
730,1824,52,,3,4.0
730,1825,20,462.0,8,8.0
730,1826,115,,8,4.5
731,1827,5,,9,5.0
731,1828,101,,4,2.0
732,1829,121,,3,4.0
732,1830,91,220.0,3,1.2
732,1831,61,,3,8.0
733,1832,85,,8,1.0
733,1833,56,,3,7.0
734,1834,83,,4,0.8
734,1835,55,62.0,10,5.0
734,1836,27,,3,2.0
735,1837,58,,6,8.0
735,1838,31,,6,2.0
736,1839,65,,3,4.5
736,1840,39,135.0,3,0.8
736,1841,13,,8,4.5
737,1842,51,,6,2.0
737,1843,26,,10,4.0
738,1844,67,,3,3.5
738,1845,43,114.0,6,2.3
738,1846,19,,3,2.0
739,1847,64,,8,4.5
739,1848,41,,3,1.2
740,1849,89,,4,0.8
740,1850,67,212.0,4,3.5
740,1851,45,,3,2.0
741,1852,97,,3,9.0
741,1853,76,,3,4.0
742,1854,4,,3,5.0
742,1855,111,157.0,6,8.0
742,1856,91,,8,1.2
743,1857,23,,9,3.0
743,1858,4,,8,5.0
744,1859,66,,3,3.0
744,1860,48,176.0,3,4.5
744,1861,30,,3,4.0
745,1862,96,,3,8.0
745,1863,79,,9,1.5
746,1864,21,,3,4.0
746,1865,5,241.0,2,5.0
746,1866,116,,3,3.0
747,1867,62,,6,4.0
747,1868,47,,3,9.0
748,1869,123,,3,3.0
748,1870,109,329.0,4,3.0
748,1871,95,,4,2.0
749,1872,48,,3,4.5
749,1873,35,,7,1.0
750,1874,118,,3,6.0
750,1875,106,402.0,3,7.0
750,1876,94,,3,4.0
751,1877,54,,6,5.0
751,1878,43,,6,2.3
752,1879,6,,3,7.0
752,1880,123,466.0,3,3.0
752,1881,113,,3,4.5
753,1882,80,,3,4.0
753,1883,71,,9,4.0
754,1884,41,,3,1.2
754,1885,33,197.0,6,0.8
754,1886,25,,8,7.0
755,1887,126,,6,4.0
755,1888,119,,4,2.0
756,1889,96,,3,8.0
756,1890,90,100.0,3,1.0
756,1891,84,,3,0.75
757,1892,65,,4,4.5
757,1893,60,,3,0.5
758,1894,44,,4,4.0
758,1895,40,161.0,4,1.0
758,1896,36,,3,0.5
759,1897,24,,3,3.0
759,1898,21,,6,4.0
760,1899,12,,3,4.0
760,1900,10,286.0,4,0.5
760,1901,8,,4,8.0
761,1902,3,,6,5.0
761,1903,2,,10,4.0
762,1904,1,,3,2.0
762,1905,1,382.0,6,2.0
762,1906,1,,3,2.0
763,1907,2,,10,4.0
763,1908,3,,3,5.0
764,1909,8,,4,8.0
764,1910,10,333.0,4,0.5
764,1911,12,,3,4.0
765,1912,21,,3,4.0
765,1913,24,,3,3.0
766,1914,36,,3,0.5
766,1915,40,416.0,4,1.0
766,1916,44,,4,4.0
767,1917,60,,3,0.5
767,1918,65,,10,4.5
768,1919,84,,3,0.75
768,1920,90,575.0,3,1.0
768,1921,96,,3,8.0
769,1922,119,,10,2.0
769,1923,126,,6,4.0
770,1924,25,,8,7.0
770,1925,33,38.0,6,0.8
770,1926,41,,3,1.2
771,1927,71,,3,4.0
771,1928,80,,3,4.0
772,1929,113,,3,4.5
772,1930,123,485.0,3,3.0
772,1931,6,,3,7.0
773,1932,43,,3,2.3
773,1933,54,,6,5.0
774,1934,94,,3,4.0
774,1935,106,254.0,3,7.0
774,1936,118,,3,6.0
775,1937,35,,1,1.0
775,1938,48,,3,4.5
776,1939,95,,4,2.0
776,1940,109,262.0,4,3.0
776,1941,123,,3,3.0
777,1942,47,,6,9.0
777,1943,62,,6,4.0
778,1944,116,,3,3.0
778,1945,5,9.0,2,5.0
778,1946,21,,3,4.0
779,1947,79,,3,1.5
779,1948,96,,3,8.0
780,1949,30,,3,4.0
780,1950,48,59.0,3,4.5
780,1951,66,,3,3.0
781,1952,4,,8,5.0
781,1953,23,,3,3.0
782,1954,91,,8,1.2
782,1955,111,149.0,6,8.0
782,1956,4,,3,5.0
783,1957,76,,3,4.0
783,1958,97,,6,9.0
784,1959,45,,3,2.0
784,1960,67,645.0,4,3.5
784,1961,89,,4,0.8
785,1962,41,,6,1.2
785,1963,64,,8,4.5
786,1964,19,,3,2.0
786,1965,43,209.0,6,2.3
786,1966,67,,3,3.5
787,1967,26,,10,4.0
787,1968,51,,3,2.0
788,1969,13,,8,4.5
788,1970,39,419.0,3,0.8
788,1971,65,,3,4.5
789,1972,31,,3,2.0
789,1973,58,,6,8.0
790,1974,27,,3,2.0
790,1975,55,30.0,10,5.0
790,1976,83,,4,0.8
791,1977,56,,3,7.0
791,1978,85,,2,1.0
792,1979,61,,3,8.0
792,1980,91,387.0,3,1.2
792,1981,121,,3,4.0
793,1982,101,,10,2.0
793,1983,5,,3,5.0
794,1984,115,,8,4.5
794,1985,20,141.0,8,8.0
794,1986,52,,3,4.0
795,1987,39,,3,0.8
795,1988,72,,3,2.0
796,1989,62,,3,4.0
796,1990,96,105.0,3,8.0
796,1991,3,,3,5.0
797,1992,124,,3,3.0
797,1993,32,,4,5.0
798,1994,29,,3,1.5
798,1995,65,246.0,6,4.5
798,1996,101,,3,2.0
799,1997,102,,6,4.0
799,1998,12,,3,4.0
800,1999,16,,8,3.0
800,2000,54,337.0,3,5.0
