{
	"businessobject_set_display_name": "Customer > creditcard",
	"businessobject_set_id": "businessobject_set_H_CUSTOMER_C_CREDITCARD",
	"functional_suffix_id": "CREDITCARD",
	"functional_suffix_name": "creditcard",
	"start_hub_id": "H_CUSTOMER",
	"start_hub_name": "Customer"
}