{
	"businessobject_comment": "",
	"businessobject_display_name": "Delivery_Service > web > Default",
	"businessobject_dropdown_entry_string": "Delivery_Service",
	"businessobject_elements": [
		{
			"columns": [
				{
					"column_comment": "",
					"column_id": "DATAVAULT.H_DELIVERY_SERVICE.DELIVERY_SERVICE_H",
					"column_name": "DELIVERY_SERVICE_H",
					"column_name_detail": "DELIVERY_SERVICE_H",
					"column_nq_id": "DELIVERY_SERVICE_H",
					"column_order": 1,
					"column_orig_name": "DELIVERY_SERVICE_H",
					"conversion_type": null
				},
				{
					"column_comment": "Business Key for Hub Delivery_Service",
					"column_id": "DATAVAULT.H_DELIVERY_SERVICE.DELIVERY_SERVICE_BK",
					"column_name": "DELIVERY_SERVICE_BK",
					"column_name_detail": "DELIVERY_SERVICE_BK",
					"column_nq_id": "DELIVERY_SERVICE_BK",
					"column_order": 2,
					"column_orig_name": "DELIVERY_SERVICE_BK",
					"conversion_type": null
				},
				{
					"column_comment": "Full Load Valid Hub Delivery_Service > web > Hr Web Delivery Service",
					"column_id": "DATAVAULT.S_DELIVERY_SERVICE_S_WEB_R_HR_WEB_DELIVERY_SERVICE_W_TRKF_C.DELIVERY_SERVICE_S_WEB_R_HR_WEB_DELIVERY_SERVICE_W_TRKF_VC",
					"column_name": "FV_DELIVERY_SERVICE",
					"column_name_detail": "DELIVERY_SERVICE_S_WEB_R_HR_WEB_DELIVERY_SERVICE_W_TRKF_VC",
					"column_nq_id": "DELIVERY_SERVICE_S_WEB_R_HR_WEB_DELIVERY_SERVICE_W_TRKF_VC",
					"column_order": 13,
					"column_orig_name": "FV_DELIVERY_SERVICE",
					"conversion_type": null
				},
				{
					"column_comment": "Full Load Last Validity Change Time Hub Delivery_Service > web > Hr Web Delivery Service",
					"column_id": "DATAVAULT.S_DELIVERY_SERVICE_S_WEB_R_HR_WEB_DELIVERY_SERVICE_W_TRKF_C.DELIVERY_SERVICE_S_WEB_R_HR_WEB_DELIVERY_SERVICE_W_TRKF_LTC",
					"column_name": "FLVC_DELIVERY_SERVICE",
					"column_name_detail": "DELIVERY_SERVICE_S_WEB_R_HR_WEB_DELIVERY_SERVICE_W_TRKF_LTC",
					"column_nq_id": "DELIVERY_SERVICE_S_WEB_R_HR_WEB_DELIVERY_SERVICE_W_TRKF_LTC",
					"column_order": 14,
					"column_orig_name": "FLVC_DELIVERY_SERVICE",
					"conversion_type": null
				}
			],
			"path_id": "{\"businessobject_path\":{\"hubs\":[{\"hub_id\":\"H_DELIVERY_SERVICE\"}]}}"
		},
		{
			"columns": [
				{
					"column_comment": "",
					"column_id": "DATAVAULT.S_DELIVERY_SERVICE_S_WEB_R_HR_WEB_DELIVERY_SERVICE_C.LIEFERDIENSTID",
					"column_name": "LIEFERDIENSTID",
					"column_name_detail": "",
					"column_nq_id": "LIEFERDIENSTID",
					"column_order": 3,
					"column_orig_name": "LIEFERDIENSTID",
					"complete_data_type": "DECIMAL(18,0)",
					"conversion_type": null
				},
				{
					"column_comment": "",
					"column_id": "DATAVAULT.S_DELIVERY_SERVICE_S_WEB_R_HR_WEB_DELIVERY_SERVICE_C.NAME",
					"column_name": "NAME",
					"column_name_detail": "",
					"column_nq_id": "NAME",
					"column_order": 4,
					"column_orig_name": "NAME",
					"complete_data_type": "VARCHAR(16777216)",
					"conversion_type": null
				},
				{
					"column_comment": "",
					"column_id": "DATAVAULT.S_DELIVERY_SERVICE_S_WEB_R_HR_WEB_DELIVERY_SERVICE_C.TELEFON",
					"column_name": "TELEFON",
					"column_name_detail": "",
					"column_nq_id": "TELEFON",
					"column_order": 5,
					"column_orig_name": "TELEFON",
					"complete_data_type": "VARCHAR(16777216)",
					"conversion_type": null
				},
				{
					"column_comment": "",
					"column_id": "DATAVAULT.S_DELIVERY_SERVICE_S_WEB_R_HR_WEB_DELIVERY_SERVICE_C.FAX",
					"column_name": "FAX",
					"column_name_detail": "",
					"column_nq_id": "FAX",
					"column_order": 6,
					"column_orig_name": "FAX",
					"complete_data_type": "VARCHAR(16777216)",
					"conversion_type": null
				},
				{
					"column_comment": "",
					"column_id": "DATAVAULT.S_DELIVERY_SERVICE_S_WEB_R_HR_WEB_DELIVERY_SERVICE_C.EMAIL",
					"column_name": "EMAIL",
					"column_name_detail": "",
					"column_nq_id": "EMAIL",
					"column_order": 7,
					"column_orig_name": "EMAIL",
					"complete_data_type": "VARCHAR(16777216)",
					"conversion_type": null
				},
				{
					"column_comment": "",
					"column_id": "DATAVAULT.S_DELIVERY_SERVICE_S_WEB_R_HR_WEB_DELIVERY_SERVICE_C.STRASSE",
					"column_name": "STRASSE",
					"column_name_detail": "",
					"column_nq_id": "STRASSE",
					"column_order": 8,
					"column_orig_name": "STRASSE",
					"complete_data_type": "VARCHAR(16777216)",
					"conversion_type": null
				},
				{
					"column_comment": "",
					"column_id": "DATAVAULT.S_DELIVERY_SERVICE_S_WEB_R_HR_WEB_DELIVERY_SERVICE_C.HAUSNUMMER",
					"column_name": "HAUSNUMMER",
					"column_name_detail": "",
					"column_nq_id": "HAUSNUMMER",
					"column_order": 9,
					"column_orig_name": "HAUSNUMMER",
					"complete_data_type": "VARCHAR(16777216)",
					"conversion_type": null
				},
				{
					"column_comment": "",
					"column_id": "DATAVAULT.S_DELIVERY_SERVICE_S_WEB_R_HR_WEB_DELIVERY_SERVICE_C.PLZ",
					"column_name": "PLZ",
					"column_name_detail": "",
					"column_nq_id": "PLZ",
					"column_order": 10,
					"column_orig_name": "PLZ",
					"complete_data_type": "DECIMAL(18,0)",
					"conversion_type": null
				},
				{
					"column_comment": "",
					"column_id": "DATAVAULT.S_DELIVERY_SERVICE_S_WEB_R_HR_WEB_DELIVERY_SERVICE_C.ORT",
					"column_name": "ORT",
					"column_name_detail": "",
					"column_nq_id": "ORT",
					"column_order": 11,
					"column_orig_name": "ORT",
					"complete_data_type": "VARCHAR(16777216)",
					"conversion_type": null
				},
				{
					"column_comment": "",
					"column_id": "DATAVAULT.S_DELIVERY_SERVICE_S_WEB_R_HR_WEB_DELIVERY_SERVICE_C.LAND",
					"column_name": "LAND",
					"column_name_detail": "",
					"column_nq_id": "LAND",
					"column_order": 12,
					"column_orig_name": "LAND",
					"complete_data_type": "VARCHAR(16777216)",
					"conversion_type": null
				}
			],
			"path_id": "{\"businessobject_path\":{\"hubs\":[{\"hub_id\":\"H_DELIVERY_SERVICE\",\"satellites\":[{\"satellite_id\":\"S_DELIVERY_SERVICE_S_WEB_R_HR_WEB_DELIVERY_SERVICE\"}]}]}}"
		}
	],
	"businessobject_set_id": "businessobject_set_H_DELIVERY_SERVICE",
	"businessobject_structure": null,
	"businessobject_view_id": "BUSINESSOBJECTS.DELIVERY_SERVICE_S_WEB",
	"dependent_objects": [
		{
			"object_id": "H_DELIVERY_SERVICE",
			"object_type": "hub"
		},
		{
			"object_id": "S_DELIVERY_SERVICE_S_WEB_R_HR_WEB_DELIVERY_SERVICE",
			"object_type": "satellite"
		},
		{
			"object_id": "no_pits",
			"object_type": "unknown_object"
		}
	],
	"granularity_satellite_id": "S_DELIVERY_SERVICE_S_WEB_R_HR_WEB_DELIVERY_SERVICE",
	"scd_type": 1,
	"system_id": "WEB",
	"system_name": "web"
}