{
	"business_key_prefix": "",
	"business_key_short": "VEREINSPARTNERID",
	"column_ids": [
		{
			"column_id": "STAGING.ROAD_R_HR_RS_ORDER_MK.VEREINSPARTNERID",
			"column_order": 1
		}
	],
	"datavault_category_id": "raw_vault",
	"hub_id": "H_ROADSHOW",
	"hub_load_display_name": "road: HR RS ORDER MK (VEREINSPARTNERID)",
	"hub_load_id": "H_ROADSHOW_S_ROAD_R_HR_RS_ORDER_MK",
	"keys_are_prehashed": false,
	"keys_are_unique": false,
	"staging_table_id": "STAGING.ROAD_R_HR_RS_ORDER_MK",
	"system_id": "ROAD",
	"system_name": "road"
}