{
	"column_ids": [
		{
			"character_maximum_length": 16777216,
			"column_comment": "",
			"column_id": "DATAVAULT.S_RECIPIENT_S_VEEAM_R_HR_RECIPIENT_U_DBT_F_ACCOUNT_H.ACCOUNT_TYPE",
			"column_is_used": true,
			"column_name": "ACCOUNT_TYPE",
			"column_name_detail": "",
			"column_nq_id": "ACCOUNT_TYPE",
			"column_order": 1,
			"column_type": "attribute",
			"complete_data_type": "TEXT",
			"conversion_type": null,
			"data_type": "TEXT",
			"datetime_precision": null,
			"numeric_precision": null,
			"numeric_scale": null
		},
		{
			"character_maximum_length": 16777216,
			"column_comment": "",
			"column_id": "DATAVAULT.S_RECIPIENT_S_VEEAM_R_HR_RECIPIENT_U_DBT_F_ACCOUNT_H.SEGMENT",
			"column_is_used": true,
			"column_name": "SEGMENT",
			"column_name_detail": "",
			"column_nq_id": "SEGMENT",
			"column_order": 2,
			"column_type": "attribute",
			"complete_data_type": "TEXT",
			"conversion_type": null,
			"data_type": "TEXT",
			"datetime_precision": null,
			"numeric_precision": null,
			"numeric_scale": null
		}
	],
	"functional_suffix_id": "ACCOUNT",
	"functional_suffix_name": "Account",
	"hub_id": "H_RECIPIENT",
	"satellite_comment": "",
	"satellite_id": "S_RECIPIENT_S_VEEAM_R_HR_RECIPIENT_U_DBT_F_ACCOUNT",
	"satellite_is_prototype": false,
	"satellite_subject_area_name": "Veeam",
	"staging_resource_id": "HR_RECIPIENT_U_DBT",
	"staging_table_id": "STAGING.VEEAM_R_HR_RECIPIENT_U_DBT",
	"system_id": "VEEAM"
}