{
	"accesslayer_priorization": 1,
	"additional_deployment_parameters": {
		"business_ruleset_hierarchy_level": 0
	},
	"business_rules_view_code": "Derived from column_nq_ids",
	"business_ruleset_comment": null,
	"business_ruleset_name": "Unaltered default",
	"business_ruleset_order": 1,
	"business_ruleset_suffix_id": null,
	"business_ruleset_view_id": "BUSINESS_RULES.TEAM_S_DVB_HUB",
	"column_nq_ids": [
		"BKTeam",
		"HKTeam",
		"TEAM_API_ID",
		"TEAM_FIFA_API_ID",
		"TEAM_LONG_NAME",
		"TEAM_SHORT_NAME"
	],
	"container_id": "H_TEAM_C_dvb_default",
	"dependent_objects": [
		{
			"object_id": "BUSINESSOBJECTS.TEAM_S_DVB_HUB",
			"object_type": "business_object"
		}
	],
	"include_in_accesslayer": false,
	"is_error_ruleset": false,
	"is_unaltered_business_ruleset": true,
	"quick_inserts": {
		"quick_insert_list": [
			{
				"quick_insert_table_id": "BUSINESSOBJECTS.TEAM_S_DVB_HUB"
			}
		]
	},
	"system_id": "DVB_HUB"
}