{
	"columns": [
		{
			"column_comment": null,
			"column_id": "STAGING.FIFA_R_HR_MATCH_TEAM_HOME_U_ZZZ_Q3_SRC_FIFA.MATCH_API_ID",
			"column_name": "MATCH_API_ID",
			"column_order": 1,
			"complete_data_type": "DECIMAL(18,0)",
			"jdbc_data_type": {
				"character_maximum_length": 18,
				"data_type_name": "DECIMAL",
				"jdbc_data_type_id": 2,
				"numeric_precision": 18,
				"numeric_scale": 0
			}
		},
		{
			"column_comment": null,
			"column_id": "STAGING.FIFA_R_HR_MATCH_TEAM_HOME_U_ZZZ_Q3_SRC_FIFA.HOME_TEAM_API_ID",
			"column_name": "HOME_TEAM_API_ID",
			"column_order": 2,
			"complete_data_type": "DECIMAL(18,0)",
			"jdbc_data_type": {
				"character_maximum_length": 18,
				"data_type_name": "DECIMAL",
				"jdbc_data_type_id": 2,
				"numeric_precision": 18,
				"numeric_scale": 0
			}
		}
	],
	"loading_batch_size": 50000,
	"source_schema_name": "ZZZ_Q3_SRC_FIFA",
	"source_schema_or_system_id": "ZZZ_Q3_SRC_FIFA",
	"source_table_id": "ZZZ_Q3_SRC_FIFA.HR_MATCH_TEAM_HOME",
	"source_table_name": "HR_MATCH_TEAM_HOME",
	"source_table_staging_id": "HR_MATCH_TEAM_HOME",
	"source_table_type_id": "VIEW",
	"staging_table_comment": null,
	"staging_table_display_string": "Hr Match Team Home (ZZZ_Q3_SRC_FIFA) [FIFA_R_HR_MATCH_TEAM_HOME_U_ZZZ_Q3_SRC_FIFA]",
	"staging_table_id": "STAGING.FIFA_R_HR_MATCH_TEAM_HOME_U_ZZZ_Q3_SRC_FIFA",
	"staging_table_name": "Hr Match Team Home",
	"system_id": "FIFA",
	"where_clause_delta_part_template": null,
	"where_clause_general_part": null
}