{
	"column_ids": [
		{
			"character_maximum_length": 18,
			"column_comment": "",
			"column_id": "DATAVAULT.S_PLAYER_S_FIFA_R_HR_PLAYER_U_ZZZ_Q3_SRC_FIFA_H.ID",
			"column_is_used": true,
			"column_name": "ID",
			"column_name_detail": "",
			"column_nq_id": "ID",
			"column_order": 1,
			"column_type": "attribute",
			"complete_data_type": "DECIMAL(18,0)",
			"conversion_type": null,
			"data_type": "DECIMAL",
			"datetime_precision": null,
			"numeric_precision": 18,
			"numeric_scale": 0
		},
		{
			"character_maximum_length": 18,
			"column_comment": "",
			"column_id": "DATAVAULT.S_PLAYER_S_FIFA_R_HR_PLAYER_U_ZZZ_Q3_SRC_FIFA_H.PLAYER_API_ID",
			"column_is_used": true,
			"column_name": "PLAYER_API_ID",
			"column_name_detail": "",
			"column_nq_id": "PLAYER_API_ID",
			"column_order": 2,
			"column_type": "attribute",
			"complete_data_type": "DECIMAL(18,0)",
			"conversion_type": null,
			"data_type": "DECIMAL",
			"datetime_precision": null,
			"numeric_precision": 18,
			"numeric_scale": 0
		},
		{
			"character_maximum_length": 2000000,
			"column_comment": "",
			"column_id": "DATAVAULT.S_PLAYER_S_FIFA_R_HR_PLAYER_U_ZZZ_Q3_SRC_FIFA_H.PLAYER_NAME",
			"column_is_used": true,
			"column_name": "PLAYER_NAME",
			"column_name_detail": "",
			"column_nq_id": "PLAYER_NAME",
			"column_order": 3,
			"column_type": "attribute",
			"complete_data_type": "VARCHAR(2000000) UTF8",
			"conversion_type": null,
			"data_type": "VARCHAR UTF8",
			"datetime_precision": null,
			"numeric_precision": null,
			"numeric_scale": null
		},
		{
			"character_maximum_length": 18,
			"column_comment": "",
			"column_id": "DATAVAULT.S_PLAYER_S_FIFA_R_HR_PLAYER_U_ZZZ_Q3_SRC_FIFA_H.PLAYER_FIFA_API_ID",
			"column_is_used": true,
			"column_name": "PLAYER_FIFA_API_ID",
			"column_name_detail": "",
			"column_nq_id": "PLAYER_FIFA_API_ID",
			"column_order": 4,
			"column_type": "attribute",
			"complete_data_type": "DECIMAL(18,0)",
			"conversion_type": null,
			"data_type": "DECIMAL",
			"datetime_precision": null,
			"numeric_precision": 18,
			"numeric_scale": 0
		},
		{
			"character_maximum_length": 10,
			"column_comment": "",
			"column_id": "DATAVAULT.S_PLAYER_S_FIFA_R_HR_PLAYER_U_ZZZ_Q3_SRC_FIFA_H.BIRTHDAY",
			"column_is_used": true,
			"column_name": "BIRTHDAY",
			"column_name_detail": "",
			"column_nq_id": "BIRTHDAY",
			"column_order": 5,
			"column_type": "attribute",
			"complete_data_type": "DATE",
			"conversion_type": null,
			"data_type": "DATE",
			"datetime_precision": null,
			"numeric_precision": null,
			"numeric_scale": null
		},
		{
			"character_maximum_length": 18,
			"column_comment": "",
			"column_id": "DATAVAULT.S_PLAYER_S_FIFA_R_HR_PLAYER_U_ZZZ_Q3_SRC_FIFA_H.HEIGHT",
			"column_is_used": true,
			"column_name": "HEIGHT",
			"column_name_detail": "",
			"column_nq_id": "HEIGHT",
			"column_order": 6,
			"column_type": "attribute",
			"complete_data_type": "DECIMAL(18,0)",
			"conversion_type": null,
			"data_type": "DECIMAL",
			"datetime_precision": null,
			"numeric_precision": 18,
			"numeric_scale": 0
		},
		{
			"character_maximum_length": 18,
			"column_comment": "",
			"column_id": "DATAVAULT.S_PLAYER_S_FIFA_R_HR_PLAYER_U_ZZZ_Q3_SRC_FIFA_H.WEIGHT",
			"column_is_used": true,
			"column_name": "WEIGHT",
			"column_name_detail": "",
			"column_nq_id": "WEIGHT",
			"column_order": 7,
			"column_type": "attribute",
			"complete_data_type": "DECIMAL(18,0)",
			"conversion_type": null,
			"data_type": "DECIMAL",
			"datetime_precision": null,
			"numeric_precision": 18,
			"numeric_scale": 0
		}
	],
	"functional_suffix_id": "",
	"functional_suffix_name": "Default of HR_PLAYER_U_ZZZ_Q3_SRC_FIFA",
	"hub_id": "H_PLAYER",
	"satellite_comment": "",
	"satellite_id": "S_PLAYER_S_FIFA_R_HR_PLAYER_U_ZZZ_Q3_SRC_FIFA",
	"satellite_is_prototype": false,
	"satellite_subject_area_name": "",
	"staging_resource_id": "HR_PLAYER_U_ZZZ_Q3_SRC_FIFA",
	"staging_table_id": "STAGING.FIFA_R_HR_PLAYER_U_ZZZ_Q3_SRC_FIFA",
	"system_id": "FIFA"
}