{
	"businessobject_set_display_name": "Team > Default",
	"businessobject_set_id": "businessobject_set_H_TEAM",
	"functional_suffix_id": "",
	"functional_suffix_name": "",
	"start_hub_id": "H_TEAM",
	"start_hub_name": "Team"
}