{
	"link_id": "L_LEAGUE_T_MATCH",
	"link_load_display_name": "League > fifa: HR MATCHES U ZZZ Q3 SRC FIFA (LEAGUE_ID) TO Match > fifa: HR MATCHES U ZZZ Q3 SRC FIFA (MATCH_API_ID)",
	"link_load_id": "L_LEAGUE_T_MATCH_S_FIFA_R_HR_MATCHES_U_ZZZ_Q3_SRC_FIFA",
	"staging_table_id": "STAGING.FIFA_R_HR_MATCHES_U_ZZZ_Q3_SRC_FIFA",
	"system_id": "FIFA"
}