{
	"businessobject_set_display_name": "Result > Default",
	"businessobject_set_id": "businessobject_set_H_RESULT",
	"functional_suffix_id": "",
	"functional_suffix_name": "",
	"start_hub_id": "H_RESULT",
	"start_hub_name": "Result"
}