{
	"link_id": "L_PITSTOPS_T_DRIVER",
	"link_load_display_name": "PitStops > F1: HR F1 PIT STOPS U DBT (RACEID, DRIVERID, STOP) TO Driver > F1: HR F1 PIT STOPS U DBT (DRIVERID)",
	"link_load_id": "L_PITSTOPS_T_DRIVER_S_F1_R_HR_F1_PIT_STOPS_U_DBT",
	"staging_table_id": "STAGING.F1_R_HR_F1_PIT_STOPS_U_DBT",
	"system_id": "F1"
}