{
	"deployable": true,
	"hidden_in_system_deployment": false,
	"source_type_id": "intradatabase",
	"source_type_name": "Intra / Cross Database Staging",
	"source_type_parameters": [
		{
			"source_type_parameter_id": "database_idbl",
			"source_type_parameter_value": ""
		}
	],
	"source_type_url": "",
	"system_color": "#990000",
	"system_comment": "",
	"system_id": "F1",
	"system_name": "F1"
}