{
	"hub_a_id": "H_CONSTRUCTOR",
	"hub_b_id": "H_RESULT",
	"link_comment": "",
	"link_id": "L_CONSTRUCTOR_T_RESULT",
	"link_subject_area_name": "FormulaOne",
	"link_suffix_id": null,
	"link_suffix_name": "",
	"link_type": "one_to_many"
}