{
	"businessobject_set_display_name": "LapTimes > Default",
	"businessobject_set_id": "businessobject_set_H_LAPTIMES",
	"functional_suffix_id": "",
	"functional_suffix_name": "",
	"start_hub_id": "H_LAPTIMES",
	"start_hub_name": "LapTimes"
}