{
	"hub_a_id": "H_CIRCUIT",
	"hub_b_id": "H_RACE",
	"link_comment": "",
	"link_id": "L_CIRCUIT_T_RACE",
	"link_subject_area_name": "FormulaOne",
	"link_suffix_id": null,
	"link_suffix_name": "",
	"link_type": "one_to_many"
}