{
  "project_info": {
    "project_number": "962390848319",
    "project_id": "chat-flutter-7ae79",
    "storage_bucket": "chat-flutter-7ae79.appspot.com"
  },
  "client": [
    {
      "client_info": {
        "mobilesdk_app_id": "1:962390848319:android:17bd981f6e1f2e5c81198a",
        "android_client_info": {
          "package_name": "Treinamento.chat_flutter"
        }
      },
      "oauth_client": [
        {
          "client_id": "962390848319-lqdv8hpvetuscuqcjodijv3mfhmrsfpu.apps.googleusercontent.com",
          "client_type": 1,
          "android_info": {
            "package_name": "Treinamento.chat_flutter",
            "certificate_hash": "f6e729bc23dd54f381959e41525a3eb7717113c0"
          }
        },
        {
          "client_id": "962390848319-mjo4ttc0vt710sevfindg7dfldch0sdb.apps.googleusercontent.com",
          "client_type": 3
        }
      ],
      "api_key": [
        {
          "current_key": "AIzaSyA3kMXzufQiGnK_TUMsfRgu6NfaL9gUMZU"
        }
      ],
      "services": {
        "appinvite_service": {
          "other_platform_oauth_client": [
            {
              "client_id": "962390848319-mjo4ttc0vt710sevfindg7dfldch0sdb.apps.googleusercontent.com",
              "client_type": 3
            }
          ]
        }
      }
    }
  ],
  "configuration_version": "1"
}