{
  "moduleFileExtensions": ["js", "json", "ts"],
  "moduleNameMapper": {
    "^@tourney-platform/logger-service/test/(.*)$": "<rootDir>/test/$1",
    "^@tourney-platform/logger-service/(.*)$": "<rootDir>/src/$1"
  },
  "testRegex": ".*\\.spec\\.ts$",
  "transform": {
    "^.+\\.(t|j)s$": ["ts-jest", { "tsconfig": "tsconfig.app.json" }]
  },
  "collectCoverageFrom": ["**/*.(t|j)s"],
  "coverageDirectory": "<rootDir>/../../coverage/app/logger-service/unit",
  "testEnvironment": "node",
  "coveragePathIgnorePatterns": ["<rootDir>/src/config", ".module.ts$", ".spec.ts$"],
  "coverageReporters": ["text", "text-summary", "json"],
  "reporters": ["default"]
}
