<?xml version="1.0" encoding="UTF-8" standalone="no"?>
<!-- Created with Inkscape (http://www.inkscape.org/) -->

<svg
   xmlns:dc="http://purl.org/dc/elements/1.1/"
   xmlns:cc="http://creativecommons.org/ns#"
   xmlns:rdf="http://www.w3.org/1999/02/22-rdf-syntax-ns#"
   xmlns:svg="http://www.w3.org/2000/svg"
   xmlns="http://www.w3.org/2000/svg"
   xmlns:sodipodi="http://sodipodi.sourceforge.net/DTD/sodipodi-0.dtd"
   xmlns:inkscape="http://www.inkscape.org/namespaces/inkscape"
   width="56.444447mm"
   height="56.444447mm"
   viewBox="0 0 200 200"
   id="svg2"
   version="1.1"
   inkscape:version="0.91 r13725"
   sodipodi:docname="logo-200x200.svg">
  <defs
     id="defs4" />
  <sodipodi:namedview
     id="base"
     pagecolor="#ffffff"
     bordercolor="#666666"
     borderopacity="1.0"
     inkscape:pageopacity="0.0"
     inkscape:pageshadow="2"
     inkscape:zoom="0.26067445"
     inkscape:cx="-135.40781"
     inkscape:cy="-46.745292"
     inkscape:document-units="px"
     inkscape:current-layer="layer1"
     showgrid="false"
     inkscape:window-width="1366"
     inkscape:window-height="744"
     inkscape:window-x="0"
     inkscape:window-y="24"
     inkscape:window-maximized="1"
     showborder="false"
     fit-margin-top="0"
     fit-margin-left="0"
     fit-margin-right="0"
     fit-margin-bottom="0" />
  <metadata
     id="metadata7">
    <rdf:RDF>
      <cc:Work
         rdf:about="">
        <dc:format>image/svg+xml</dc:format>
        <dc:type
           rdf:resource="http://purl.org/dc/dcmitype/StillImage" />
        <dc:title></dc:title>
      </cc:Work>
    </rdf:RDF>
  </metadata>
  <g
     inkscape:label="Layer 1"
     inkscape:groupmode="layer"
     id="layer1"
     transform="translate(-434.53245,-663.52437)">
    <g
       inkscape:export-ydpi="16.257383"
       inkscape:export-xdpi="16.257383"
       transform="matrix(0.125,0,0,-0.125,-711.72352,1020.21)"
       id="g4182">
      <path
         d="m 142.789,71.3008 c 0,-19.5391 -6.984,-36.3711 -20.957,-50.3399 C 107.859,6.98047 91.0117,0 71.4844,0 L 0,0 0,522.609 c 0,98.012 28.668,164.832 86.1758,200.493 57.3402,35.648 119.6792,53.57 186.8672,53.57 34.937,0 70.227,-6.633 106.059,-19.891 35.664,-13.261 63.972,-32.609 84.941,-57.691 42.102,-54.641 63.059,-124.692 63.059,-209.981 0,-88.14 -20.957,-159.449 -63.059,-214.097 -41.941,-53.211 -95.855,-79.731 -161.617,-79.731 -35.113,0 -65.754,6.278 -92.446,18.809 -27.949,13.98 -50.339,35.832 -67.191,65.039 l 0,-207.8282 z M 382.156,482.84 c 0,54.64 -10.574,96.57 -31.535,125.949 -20.965,29.391 -51.066,44.07 -90.293,44.07 -37.808,0 -67.191,-14.679 -88.148,-44.07 -19.528,-26.508 -29.391,-68.609 -29.391,-125.949 0,-53.211 10.578,-93.168 31.543,-119.68 20.961,-29.39 51.059,-44.082 90.285,-44.082 36.379,0 65.039,14.692 86.004,44.082 20.961,29.379 31.535,69.34 31.535,119.68 z m 200.739,445.039 75.617,0 c 19.523,0 36.371,-6.629 50.351,-19.879 13.973,-13.441 20.957,-29.75 20.957,-49.441 l 0,-652.887 -146.925,0 0,722.207 z m 520.025,-440.91 c -19.53,-9.867 -46.94,-18.809 -81.87,-27.239 -32.257,-6.98 -48.202,-10.582 -48.202,-10.582 -25.258,-6.976 -43.535,-16.117 -54.641,-27.218 -9.855,-15.41 -14.691,-30.821 -14.691,-46.231 0,-20.969 6.269,-37.801 18.804,-50.347 12.723,-11.293 30.821,-16.84 54.653,-16.84 39.227,0 70.057,11.289 92.447,33.687 22.4,22.391 33.5,53.031 33.5,92.262 l 0,52.508 z m 33.51,-258.188 c -29.38,-15.402 -60.57,-24.902 -93.35,-28.472 -32.96,-3.411 -61.99,-5.207 -87.252,-5.207 -50.34,0 -94.41,13.617 -132.223,41.039 -37.804,27.218 -56.613,72.371 -56.613,135.429 0,58.77 17.192,100.7 51.422,125.961 34.219,25.078 78.113,41.93 131.133,50.348 6.992,0 15.414,1.07 25.273,3.23 9.86,1.961 20.961,3.762 33.5,5.18 61.64,8.422 92.45,26.52 92.45,54.652 0,20.957 -10.93,34.579 -32.61,40.848 -21.67,6.27 -41.56,9.5 -59.84,9.5 -19.527,0 -37.086,-2.879 -52.492,-8.43 -15.402,-5.539 -26.515,-15.937 -33.508,-31.339 l -140.636,0 c 5.55,43.351 25.074,79 58.765,107.14 37.797,32.059 91.735,48.192 161.611,48.192 78.47,0 137.23,-13.25 176.29,-39.961 40.67,-27.95 60.91,-67.18 60.91,-117.52 l 0,-191.172 c 0,-55.898 -10.21,-99.801 -30.46,-131.16 -20.25,-31.527 -44.42,-54.269 -72.37,-68.258 z m 148.42,-23.109 0,111.269 300.29,331.629 -212.13,0 c -19.54,0 -36.37,6.629 -50.34,19.891 -13.98,13.43 -20.96,29.91 -20.96,49.437 l 0,46.231 457.57,0 0,-119.68 -295.97,-316.949 306.54,0 0,-121.828 -485,0 z m 855.97,281.297 c -19.53,-9.867 -46.94,-18.809 -81.88,-27.239 -32.25,-6.98 -48.2,-10.582 -48.2,-10.582 -25.26,-6.976 -43.53,-16.117 -54.64,-27.218 -9.86,-15.41 -14.69,-30.821 -14.69,-46.231 0,-20.969 6.27,-37.801 18.8,-50.347 12.72,-11.293 30.82,-16.84 54.65,-16.84 39.24,0 70.05,11.289 92.45,33.687 22.4,22.391 33.51,53.031 33.51,92.262 l 0,52.508 z m 33.51,-258.188 c -29.39,-15.402 -60.57,-24.902 -93.36,-28.472 -32.96,-3.411 -61.99,-5.207 -87.24,-5.207 -50.35,0 -94.42,13.617 -132.23,41.039 -37.81,27.218 -56.62,72.371 -56.62,135.429 0,58.77 17.2,100.7 51.42,125.961 34.23,25.078 78.12,41.93 131.15,50.348 6.98,0 15.41,1.07 25.26,3.23 9.86,1.961 20.97,3.762 33.51,5.18 61.63,8.422 92.44,26.52 92.44,54.652 0,20.957 -10.93,34.579 -32.6,40.848 -21.68,6.27 -41.57,9.5 -59.84,9.5 -19.53,0 -37.1,-2.879 -52.49,-8.43 -15.41,-5.539 -26.52,-15.937 -33.52,-31.339 l -140.63,0 c 5.55,43.351 25.07,79 58.76,107.14 37.8,32.059 91.73,48.192 161.6,48.192 78.48,0 137.24,-13.25 176.31,-39.961 40.66,-27.95 60.9,-67.18 60.9,-117.52 l 0,-191.172 c 0,-55.898 -10.2,-99.801 -30.46,-131.16 -20.24,-31.527 -44.42,-54.269 -72.36,-68.258"
         style="fill:#1c2c4f;fill-opacity:1;fill-rule:nonzero;stroke:none"
         id="path4169"
         inkscape:connector-curvature="0" />
      <path
         d="m 2736.45,930.039 71.48,0 c 19.54,0 36.38,-7.348 50.36,-22.039 13.97,-14.699 20.95,-31.18 20.95,-49.289 l 0,-409.563 c 0,-99.429 -28.66,-166.617 -86.18,-201.558 -57.32,-34.93 -119.68,-52.488 -186.86,-52.488 -36.37,0 -72.02,5.918 -106.97,17.918 -35.1,11.82 -63.06,31 -84.02,57.691 -40.66,51.777 -60.92,122.367 -60.92,211.949 0,88.32 20.26,158.918 60.92,212.129 41.92,54.652 95.85,81.883 161.61,81.883 35.12,0 65.94,-6.992 92.44,-20.953 27.95,-16.848 50.34,-38.539 67.19,-65.039 l 0,239.359 z m -239.36,-440.93 c 0,-56.078 10.56,-98.73 31.54,-128.097 20.95,-29.391 51.05,-44.071 90.29,-44.071 37.8,0 67.19,14.68 88.15,44.071 19.53,29.367 29.38,72.019 29.38,128.097 0,50.352 -10.57,90.301 -31.54,119.68 -22.39,27.949 -52.49,41.93 -90.29,41.93 -36.37,0 -65.04,-14.699 -85.99,-44.09 -20.98,-27.938 -31.54,-67.168 -31.54,-117.52 z m 769.16,-2.14 c -19.53,-9.867 -46.94,-18.809 -81.87,-27.239 -32.26,-6.98 -48.2,-10.582 -48.2,-10.582 -25.27,-6.976 -43.54,-16.117 -54.64,-27.218 -9.87,-15.41 -14.7,-30.821 -14.7,-46.231 0,-20.969 6.27,-37.801 18.81,-50.347 12.71,-11.293 30.82,-16.84 54.65,-16.84 39.23,0 70.04,11.289 92.45,33.687 22.39,22.391 33.5,53.031 33.5,92.262 l 0,52.508 z m 33.5,-258.188 c -29.37,-15.402 -60.56,-24.902 -93.35,-28.472 -32.96,-3.411 -61.98,-5.207 -87.24,-5.207 -50.35,0 -94.42,13.617 -132.23,41.039 -37.8,27.218 -56.61,72.371 -56.61,135.429 0,58.77 17.19,100.7 51.41,125.961 34.22,25.078 78.12,41.93 131.15,50.348 6.99,0 15.41,1.07 25.26,3.23 9.86,1.961 20.97,3.762 33.51,5.18 61.64,8.422 92.45,26.52 92.45,54.652 0,20.957 -10.94,34.579 -32.61,40.848 -21.68,6.27 -41.56,9.5 -59.84,9.5 -19.53,0 -37.09,-2.879 -52.49,-8.43 -15.41,-5.539 -26.52,-15.937 -33.51,-31.339 l -140.65,0 c 5.56,43.351 25.08,79 58.77,107.14 37.81,32.059 91.73,48.192 161.61,48.192 78.47,0 137.23,-13.25 176.29,-39.961 40.67,-27.95 60.91,-67.18 60.91,-117.52 l 0,-191.172 c 0,-55.898 -10.19,-99.801 -30.46,-131.16 -20.24,-31.527 -44.42,-54.269 -72.37,-68.258 z m 649.66,-23.109 -73.46,0 c -21.13,0 -38.16,6.629 -51.6,19.887 -13.25,13.441 -19.88,30.461 -19.88,51.421 l 0,285.59 c 0,33.512 -10.22,58.051 -30.46,73.45 -20.25,15.41 -43,23.109 -68.26,23.109 -25.27,0 -47.66,-7.699 -67.19,-23.109 -19.53,-15.399 -29.39,-39.938 -29.39,-73.45 l 0,-356.898 -146.91,0 0,327.519 c 0,95.118 24.91,158.75 74.53,190.981 49.64,32.258 104.64,49.629 164.84,52.5 61.63,0 118.24,-16.133 170.03,-48.192 51.77,-32.261 77.75,-97.3 77.75,-195.289 l 0,-327.519 z m 385.03,281.297 c -19.52,-9.867 -46.94,-18.809 -81.88,-27.239 -32.25,-6.98 -48.2,-10.582 -48.2,-10.582 -25.24,-6.976 -43.53,-16.117 -54.64,-27.218 -9.85,-15.41 -14.69,-30.821 -14.69,-46.231 0,-20.969 6.27,-37.801 18.81,-50.347 12.72,-11.293 30.82,-16.84 54.65,-16.84 39.23,0 70.05,11.289 92.45,33.687 22.39,22.391 33.5,53.031 33.5,92.262 l 0,52.508 z m 33.51,-258.188 c -29.38,-15.402 -60.56,-24.902 -93.36,-28.472 -32.95,-3.411 -61.98,-5.207 -87.23,-5.207 -50.35,0 -94.43,13.617 -132.24,41.039 -37.8,27.218 -56.6,72.371 -56.6,135.429 0,58.77 17.19,100.7 51.42,125.961 34.21,25.078 78.11,41.93 131.13,50.348 6.99,0 15.41,1.07 25.27,3.23 9.86,1.961 20.97,3.762 33.5,5.18 61.64,8.422 92.45,26.52 92.45,54.652 0,20.957 -10.93,34.579 -32.61,40.848 -21.68,6.27 -41.56,9.5 -59.84,9.5 -19.53,0 -37.09,-2.879 -52.48,-8.43 -15.41,-5.539 -26.53,-15.937 -33.52,-31.339 l -140.63,0 c 5.54,43.351 25.08,79 58.76,107.14 37.79,32.059 91.74,48.192 161.6,48.192 78.48,0 137.24,-13.25 176.3,-39.961 40.67,-27.95 60.92,-67.18 60.92,-117.52 l 0,-191.172 c 0,-55.898 -10.21,-99.801 -30.46,-131.16 -20.25,-31.527 -44.43,-54.269 -72.38,-68.258"
         style="fill:#3c86ce;fill-opacity:1;fill-rule:nonzero;stroke:none"
         id="path4171"
         inkscape:connector-curvature="0" />
    </g>
    <rect
       y="416.67093"
       x="-631.93176"
       height="420"
       width="420"
       id="rect4186-3"
       style="opacity:1;fill:#000000;fill-opacity:1;fill-rule:nonzero;stroke:none;stroke-width:39.4070015;stroke-miterlimit:4;stroke-dasharray:none;stroke-dashoffset:0;stroke-opacity:1" />
    <path
       inkscape:connector-curvature="0"
       id="path4167"
       style="fill:#ffffff;fill-opacity:1;fill-rule:evenodd;stroke:none"
       d="m -421.7683,432.54731 84.4475,48.75625 84.45,48.75625 0,195.02625 -84.45,48.755 -84.4475,48.75625 -80.13124,-46.26375 0,-51.25125 17.87625,10.32125 c 20.75125,11.9825 41.5025,23.9625 62.255,35.94375 20.75125,-11.98125 41.505,-23.96125 62.255,-35.94375 20.75375,-11.98125 41.50374,-23.9625 62.2575,-35.94375 0,-23.9625 0,-47.925 0,-71.8875 0,-23.9625 0,-47.925 0,-71.88625 l -44.38625,-25.62625 0,51.25125 c 0,15.42 0,30.84125 0,46.26125 l 0,46.26125 c -13.3525,7.7125 -26.70875,15.42125 -40.0625,23.13125 -13.355,7.71 -26.71,15.42 -40.06375,23.1325 -13.35625,-7.7125 -26.71,-15.4225 -40.065,-23.1325 -13.3525,-7.71 -26.70875,-15.41875 -40.0625,-23.13125 0,-15.42 0,-30.84125 0,-46.26125 0,-15.42 0,-30.84125 0,-46.26125 13.35375,-7.71 26.71,-15.42125 40.0625,-23.1325 13.355,-7.70875 26.70875,-15.41875 40.065,-23.13 l 35.77499,20.655 0,-51.25125 -35.77499,-20.65375 c -20.7525,11.98 -41.50375,23.96125 -62.255,35.9425 -20.75375,11.98125 -41.50625,23.9625 -62.2575,35.945 0,23.96125 0,47.92375 0,71.88625 0,23.9625 0,47.925 0,71.8875 l 0.0263,0.0162 0,51.25125 -44.41062,-25.6412 0,-195.02625 84.44812,-48.75625 84.44875,-48.75625 z m 0,153.75125 17.87,10.31875 17.8725,10.31875 0,41.27375 -17.8725,10.3175 -17.87,10.31875 -17.8725,-10.31875 -17.87125,-10.3175 0,-41.27375 17.87125,-10.31875 17.8725,-10.31875" />
    <g
       id="g4227"
       transform="matrix(0.125,0,0,-0.125,-705.0267,301.41805)"
       inkscape:export-xdpi="80.512749"
       inkscape:export-ydpi="80.512749">
      <path
         inkscape:connector-curvature="0"
         id="path4229"
         style="fill:#1c2c4f;fill-opacity:1;fill-rule:nonzero;stroke:none"
         d="m 142.789,71.3008 c 0,-19.5391 -6.984,-36.3711 -20.957,-50.3399 C 107.859,6.98047 91.0117,0 71.4844,0 L 0,0 0,522.609 c 0,98.012 28.668,164.832 86.1758,200.493 57.3402,35.648 119.6792,53.57 186.8672,53.57 34.937,0 70.227,-6.633 106.059,-19.891 35.664,-13.261 63.972,-32.609 84.941,-57.691 42.102,-54.641 63.059,-124.692 63.059,-209.981 0,-88.14 -20.957,-159.449 -63.059,-214.097 -41.941,-53.211 -95.855,-79.731 -161.617,-79.731 -35.113,0 -65.754,6.278 -92.446,18.809 -27.949,13.98 -50.339,35.832 -67.191,65.039 l 0,-207.8282 z M 382.156,482.84 c 0,54.64 -10.574,96.57 -31.535,125.949 -20.965,29.391 -51.066,44.07 -90.293,44.07 -37.808,0 -67.191,-14.679 -88.148,-44.07 -19.528,-26.508 -29.391,-68.609 -29.391,-125.949 0,-53.211 10.578,-93.168 31.543,-119.68 20.961,-29.39 51.059,-44.082 90.285,-44.082 36.379,0 65.039,14.692 86.004,44.082 20.961,29.379 31.535,69.34 31.535,119.68 z m 200.739,445.039 75.617,0 c 19.523,0 36.371,-6.629 50.351,-19.879 13.973,-13.441 20.957,-29.75 20.957,-49.441 l 0,-652.887 -146.925,0 0,722.207 z m 520.025,-440.91 c -19.53,-9.867 -46.94,-18.809 -81.87,-27.239 -32.257,-6.98 -48.202,-10.582 -48.202,-10.582 -25.258,-6.976 -43.535,-16.117 -54.641,-27.218 -9.855,-15.41 -14.691,-30.821 -14.691,-46.231 0,-20.969 6.269,-37.801 18.804,-50.347 12.723,-11.293 30.821,-16.84 54.653,-16.84 39.227,0 70.057,11.289 92.447,33.687 22.4,22.391 33.5,53.031 33.5,92.262 l 0,52.508 z m 33.51,-258.188 c -29.38,-15.402 -60.57,-24.902 -93.35,-28.472 -32.96,-3.411 -61.99,-5.207 -87.252,-5.207 -50.34,0 -94.41,13.617 -132.223,41.039 -37.804,27.218 -56.613,72.371 -56.613,135.429 0,58.77 17.192,100.7 51.422,125.961 34.219,25.078 78.113,41.93 131.133,50.348 6.992,0 15.414,1.07 25.273,3.23 9.86,1.961 20.961,3.762 33.5,5.18 61.64,8.422 92.45,26.52 92.45,54.652 0,20.957 -10.93,34.579 -32.61,40.848 -21.67,6.27 -41.56,9.5 -59.84,9.5 -19.527,0 -37.086,-2.879 -52.492,-8.43 -15.402,-5.539 -26.515,-15.937 -33.508,-31.339 l -140.636,0 c 5.55,43.351 25.074,79 58.765,107.14 37.797,32.059 91.735,48.192 161.611,48.192 78.47,0 137.23,-13.25 176.29,-39.961 40.67,-27.95 60.91,-67.18 60.91,-117.52 l 0,-191.172 c 0,-55.898 -10.21,-99.801 -30.46,-131.16 -20.25,-31.527 -44.42,-54.269 -72.37,-68.258 z m 148.42,-23.109 0,111.269 300.29,331.629 -212.13,0 c -19.54,0 -36.37,6.629 -50.34,19.891 -13.98,13.43 -20.96,29.91 -20.96,49.437 l 0,46.231 457.57,0 0,-119.68 -295.97,-316.949 306.54,0 0,-121.828 -485,0 z m 855.97,281.297 c -19.53,-9.867 -46.94,-18.809 -81.88,-27.239 -32.25,-6.98 -48.2,-10.582 -48.2,-10.582 -25.26,-6.976 -43.53,-16.117 -54.64,-27.218 -9.86,-15.41 -14.69,-30.821 -14.69,-46.231 0,-20.969 6.27,-37.801 18.8,-50.347 12.72,-11.293 30.82,-16.84 54.65,-16.84 39.24,0 70.05,11.289 92.45,33.687 22.4,22.391 33.51,53.031 33.51,92.262 l 0,52.508 z m 33.51,-258.188 c -29.39,-15.402 -60.57,-24.902 -93.36,-28.472 -32.96,-3.411 -61.99,-5.207 -87.24,-5.207 -50.35,0 -94.42,13.617 -132.23,41.039 -37.81,27.218 -56.62,72.371 -56.62,135.429 0,58.77 17.2,100.7 51.42,125.961 34.23,25.078 78.12,41.93 131.15,50.348 6.98,0 15.41,1.07 25.26,3.23 9.86,1.961 20.97,3.762 33.51,5.18 61.63,8.422 92.44,26.52 92.44,54.652 0,20.957 -10.93,34.579 -32.6,40.848 -21.68,6.27 -41.57,9.5 -59.84,9.5 -19.53,0 -37.1,-2.879 -52.49,-8.43 -15.41,-5.539 -26.52,-15.937 -33.52,-31.339 l -140.63,0 c 5.55,43.351 25.07,79 58.76,107.14 37.8,32.059 91.73,48.192 161.6,48.192 78.48,0 137.24,-13.25 176.31,-39.961 40.66,-27.95 60.9,-67.18 60.9,-117.52 l 0,-191.172 c 0,-55.898 -10.2,-99.801 -30.46,-131.16 -20.24,-31.527 -44.42,-54.269 -72.36,-68.258" />
      <path
         inkscape:connector-curvature="0"
         id="path4231"
         style="fill:#3c86ce;fill-opacity:1;fill-rule:nonzero;stroke:none"
         d="m 2736.45,930.039 71.48,0 c 19.54,0 36.38,-7.348 50.36,-22.039 13.97,-14.699 20.95,-31.18 20.95,-49.289 l 0,-409.563 c 0,-99.429 -28.66,-166.617 -86.18,-201.558 -57.32,-34.93 -119.68,-52.488 -186.86,-52.488 -36.37,0 -72.02,5.918 -106.97,17.918 -35.1,11.82 -63.06,31 -84.02,57.691 -40.66,51.777 -60.92,122.367 -60.92,211.949 0,88.32 20.26,158.918 60.92,212.129 41.92,54.652 95.85,81.883 161.61,81.883 35.12,0 65.94,-6.992 92.44,-20.953 27.95,-16.848 50.34,-38.539 67.19,-65.039 l 0,239.359 z m -239.36,-440.93 c 0,-56.078 10.56,-98.73 31.54,-128.097 20.95,-29.391 51.05,-44.071 90.29,-44.071 37.8,0 67.19,14.68 88.15,44.071 19.53,29.367 29.38,72.019 29.38,128.097 0,50.352 -10.57,90.301 -31.54,119.68 -22.39,27.949 -52.49,41.93 -90.29,41.93 -36.37,0 -65.04,-14.699 -85.99,-44.09 -20.98,-27.938 -31.54,-67.168 -31.54,-117.52 z m 769.16,-2.14 c -19.53,-9.867 -46.94,-18.809 -81.87,-27.239 -32.26,-6.98 -48.2,-10.582 -48.2,-10.582 -25.27,-6.976 -43.54,-16.117 -54.64,-27.218 -9.87,-15.41 -14.7,-30.821 -14.7,-46.231 0,-20.969 6.27,-37.801 18.81,-50.347 12.71,-11.293 30.82,-16.84 54.65,-16.84 39.23,0 70.04,11.289 92.45,33.687 22.39,22.391 33.5,53.031 33.5,92.262 l 0,52.508 z m 33.5,-258.188 c -29.37,-15.402 -60.56,-24.902 -93.35,-28.472 -32.96,-3.411 -61.98,-5.207 -87.24,-5.207 -50.35,0 -94.42,13.617 -132.23,41.039 -37.8,27.218 -56.61,72.371 -56.61,135.429 0,58.77 17.19,100.7 51.41,125.961 34.22,25.078 78.12,41.93 131.15,50.348 6.99,0 15.41,1.07 25.26,3.23 9.86,1.961 20.97,3.762 33.51,5.18 61.64,8.422 92.45,26.52 92.45,54.652 0,20.957 -10.94,34.579 -32.61,40.848 -21.68,6.27 -41.56,9.5 -59.84,9.5 -19.53,0 -37.09,-2.879 -52.49,-8.43 -15.41,-5.539 -26.52,-15.937 -33.51,-31.339 l -140.65,0 c 5.56,43.351 25.08,79 58.77,107.14 37.81,32.059 91.73,48.192 161.61,48.192 78.47,0 137.23,-13.25 176.29,-39.961 40.67,-27.95 60.91,-67.18 60.91,-117.52 l 0,-191.172 c 0,-55.898 -10.19,-99.801 -30.46,-131.16 -20.24,-31.527 -44.42,-54.269 -72.37,-68.258 z m 649.66,-23.109 -73.46,0 c -21.13,0 -38.16,6.629 -51.6,19.887 -13.25,13.441 -19.88,30.461 -19.88,51.421 l 0,285.59 c 0,33.512 -10.22,58.051 -30.46,73.45 -20.25,15.41 -43,23.109 -68.26,23.109 -25.27,0 -47.66,-7.699 -67.19,-23.109 -19.53,-15.399 -29.39,-39.938 -29.39,-73.45 l 0,-356.898 -146.91,0 0,327.519 c 0,95.118 24.91,158.75 74.53,190.981 49.64,32.258 104.64,49.629 164.84,52.5 61.63,0 118.24,-16.133 170.03,-48.192 51.77,-32.261 77.75,-97.3 77.75,-195.289 l 0,-327.519 z m 385.03,281.297 c -19.52,-9.867 -46.94,-18.809 -81.88,-27.239 -32.25,-6.98 -48.2,-10.582 -48.2,-10.582 -25.24,-6.976 -43.53,-16.117 -54.64,-27.218 -9.85,-15.41 -14.69,-30.821 -14.69,-46.231 0,-20.969 6.27,-37.801 18.81,-50.347 12.72,-11.293 30.82,-16.84 54.65,-16.84 39.23,0 70.05,11.289 92.45,33.687 22.39,22.391 33.5,53.031 33.5,92.262 l 0,52.508 z m 33.51,-258.188 c -29.38,-15.402 -60.56,-24.902 -93.36,-28.472 -32.95,-3.411 -61.98,-5.207 -87.23,-5.207 -50.35,0 -94.43,13.617 -132.24,41.039 -37.8,27.218 -56.6,72.371 -56.6,135.429 0,58.77 17.19,100.7 51.42,125.961 34.21,25.078 78.11,41.93 131.13,50.348 6.99,0 15.41,1.07 25.27,3.23 9.86,1.961 20.97,3.762 33.5,5.18 61.64,8.422 92.45,26.52 92.45,54.652 0,20.957 -10.93,34.579 -32.61,40.848 -21.68,6.27 -41.56,9.5 -59.84,9.5 -19.53,0 -37.09,-2.879 -52.48,-8.43 -15.41,-5.539 -26.53,-15.937 -33.52,-31.339 l -140.63,0 c 5.54,43.351 25.08,79 58.76,107.14 37.79,32.059 91.74,48.192 161.6,48.192 78.48,0 137.24,-13.25 176.3,-39.961 40.67,-27.95 60.92,-67.18 60.92,-117.52 l 0,-191.172 c 0,-55.898 -10.21,-99.801 -30.46,-131.16 -20.25,-31.527 -44.43,-54.269 -72.38,-68.258" />
    </g>
    <g
       id="g4349"
       transform="matrix(0.47619043,0,0,0.47619043,227.61226,452.32232)">
      <rect
         y="443.52435"
         x="434.53244"
         height="420"
         width="420"
         id="rect4345"
         style="opacity:1;fill:#000000;fill-opacity:0;fill-rule:nonzero;stroke:none;stroke-width:39.4070015;stroke-miterlimit:4;stroke-dasharray:none;stroke-dashoffset:0;stroke-opacity:1" />
      <path
         inkscape:connector-curvature="0"
         id="path4347"
         style="fill:#3c86ce;fill-opacity:1;fill-rule:evenodd;stroke:none"
         d="m 644.69591,459.40073 84.4475,48.75625 84.45,48.75625 0,195.02625 -84.45,48.755 -84.4475,48.75625 -80.13124,-46.26375 0,-51.25125 17.87625,10.32125 c 20.75125,11.9825 41.5025,23.9625 62.255,35.94375 20.75125,-11.98125 41.505,-23.96125 62.255,-35.94375 20.75375,-11.98125 41.50374,-23.9625 62.2575,-35.94375 0,-23.9625 0,-47.925 0,-71.8875 0,-23.9625 0,-47.925 0,-71.88625 l -44.38625,-25.62625 0,51.25125 c 0,15.42 0,30.84125 0,46.26125 l 0,46.26125 c -13.3525,7.7125 -26.70875,15.42125 -40.0625,23.13125 -13.355,7.71 -26.71,15.42 -40.06375,23.1325 -13.35625,-7.7125 -26.71,-15.4225 -40.065,-23.1325 -13.3525,-7.71 -26.70875,-15.41875 -40.0625,-23.13125 0,-15.42 0,-30.84125 0,-46.26125 0,-15.42 0,-30.84125 0,-46.26125 13.35375,-7.71 26.71,-15.42125 40.0625,-23.1325 13.355,-7.70875 26.70875,-15.41875 40.065,-23.13 l 35.77499,20.655 0,-51.25125 -35.77499,-20.65375 c -20.7525,11.98 -41.50375,23.96125 -62.255,35.9425 -20.75375,11.98125 -41.50625,23.9625 -62.2575,35.945 0,23.96125 0,47.92375 0,71.88625 0,23.9625 0,47.925 0,71.8875 l 0.0263,0.0162 0,51.25125 -44.41062,-25.6412 0,-195.02625 84.44812,-48.75625 84.44875,-48.75625 z m 0,153.75125 17.87,10.31875 17.8725,10.31875 0,41.27375 -17.8725,10.3175 -17.87,10.31875 -17.8725,-10.31875 -17.87125,-10.3175 0,-41.27375 17.87125,-10.31875 17.8725,-10.31875" />
    </g>
  </g>
</svg>
