<?xml version="1.0" encoding="UTF-8" standalone="no"?>
<!-- Created with Inkscape (http://www.inkscape.org/) -->

<svg
   xmlns:dc="http://purl.org/dc/elements/1.1/"
   xmlns:cc="http://creativecommons.org/ns#"
   xmlns:rdf="http://www.w3.org/1999/02/22-rdf-syntax-ns#"
   xmlns:svg="http://www.w3.org/2000/svg"
   xmlns="http://www.w3.org/2000/svg"
   xmlns:xlink="http://www.w3.org/1999/xlink"
   xmlns:sodipodi="http://sodipodi.sourceforge.net/DTD/sodipodi-0.dtd"
   xmlns:inkscape="http://www.inkscape.org/namespaces/inkscape"
   width="210mm"
   height="297mm"
   viewBox="0 0 744.09448819 1052.3622047"
   id="svg2"
   version="1.1"
   inkscape:version="0.91 r13725"
   sodipodi:docname="product-vs.svg">
  <defs
     id="defs4">
    <filter
       style="color-interpolation-filters:sRGB;"
       inkscape:label="Drop Shadow"
       id="filter4565">
      <feFlood
         flood-opacity="0.470588"
         flood-color="rgb(80,80,80)"
         result="flood"
         id="feFlood4567" />
      <feComposite
         in="flood"
         in2="SourceGraphic"
         operator="in"
         result="composite1"
         id="feComposite4569" />
      <feGaussianBlur
         in="composite1"
         stdDeviation="4.2"
         result="blur"
         id="feGaussianBlur4571" />
      <feOffset
         dx="-8.7"
         dy="2.9"
         result="offset"
         id="feOffset4573" />
      <feComposite
         in="SourceGraphic"
         in2="offset"
         operator="over"
         result="composite2"
         id="feComposite4575" />
    </filter>
    <filter
       style="color-interpolation-filters:sRGB;"
       inkscape:label="Drop Shadow"
       id="filter4613">
      <feFlood
         flood-opacity="0.470588"
         flood-color="rgb(80,80,80)"
         result="flood"
         id="feFlood4615" />
      <feComposite
         in="flood"
         in2="SourceGraphic"
         operator="in"
         result="composite1"
         id="feComposite4617" />
      <feGaussianBlur
         in="composite1"
         stdDeviation="4.2"
         result="blur"
         id="feGaussianBlur4619" />
      <feOffset
         dx="-8.7"
         dy="2.9"
         result="offset"
         id="feOffset4621" />
      <feComposite
         in="SourceGraphic"
         in2="offset"
         operator="over"
         result="composite2"
         id="feComposite4623" />
    </filter>
    <clipPath
       clipPathUnits="userSpaceOnUse"
       id="clipPath4692">
      <rect
         style="opacity:1;fill:#000080;fill-opacity:1;fill-rule:nonzero;stroke:none;stroke-width:5;stroke-miterlimit:4;stroke-dasharray:none;stroke-dashoffset:0;stroke-opacity:1"
         id="rect4694"
         width="1630.6963"
         height="579.38177"
         x="-1641.2305"
         y="144.31299"
         ry="0" />
    </clipPath>
    <filter
       style="color-interpolation-filters:sRGB"
       inkscape:label="Drop Shadow"
       id="filter4613-7">
      <feFlood
         flood-opacity="0.470588"
         flood-color="rgb(80,80,80)"
         result="flood"
         id="feFlood4615-6" />
      <feComposite
         in="flood"
         in2="SourceGraphic"
         operator="in"
         result="composite1"
         id="feComposite4617-3" />
      <feGaussianBlur
         in="composite1"
         stdDeviation="4.2"
         result="blur"
         id="feGaussianBlur4619-1" />
      <feOffset
         dx="-8.7"
         dy="2.9"
         result="offset"
         id="feOffset4621-7" />
      <feComposite
         in="SourceGraphic"
         in2="offset"
         operator="over"
         result="composite2"
         id="feComposite4623-5" />
    </filter>
    <filter
       style="color-interpolation-filters:sRGB"
       inkscape:label="Drop Shadow"
       id="filter4565-9">
      <feFlood
         flood-opacity="0.470588"
         flood-color="rgb(80,80,80)"
         result="flood"
         id="feFlood4567-6" />
      <feComposite
         in="flood"
         in2="SourceGraphic"
         operator="in"
         result="composite1"
         id="feComposite4569-2" />
      <feGaussianBlur
         in="composite1"
         stdDeviation="4.2"
         result="blur"
         id="feGaussianBlur4571-1" />
      <feOffset
         dx="-8.7"
         dy="2.9"
         result="offset"
         id="feOffset4573-7" />
      <feComposite
         in="SourceGraphic"
         in2="offset"
         operator="over"
         result="composite2"
         id="feComposite4575-8" />
    </filter>
  </defs>
  <sodipodi:namedview
     id="base"
     pagecolor="#ffffff"
     bordercolor="#666666"
     borderopacity="1.0"
     inkscape:pageopacity="0.0"
     inkscape:pageshadow="2"
     inkscape:zoom="0.42610075"
     inkscape:cx="-866.33908"
     inkscape:cy="-249.08748"
     inkscape:document-units="px"
     inkscape:current-layer="layer1"
     showgrid="false"
     inkscape:window-width="1366"
     inkscape:window-height="744"
     inkscape:window-x="0"
     inkscape:window-y="24"
     inkscape:window-maximized="1"
     showguides="false" />
  <metadata
     id="metadata7">
    <rdf:RDF>
      <cc:Work
         rdf:about="">
        <dc:format>image/svg+xml</dc:format>
        <dc:type
           rdf:resource="http://purl.org/dc/dcmitype/StillImage" />
        <dc:title />
      </cc:Work>
    </rdf:RDF>
  </metadata>
  <g
     inkscape:label="Layer 1"
     inkscape:groupmode="layer"
     id="layer1">
    <g
       id="g4696"
       inkscape:export-xdpi="80"
       inkscape:export-ydpi="80">
      <image
         clip-path="url(#clipPath4692)"
         width="1495"
         height="663"
         preserveAspectRatio="none"
         xlink:href="data:image/png;base64,iVBORw0KGgoAAAANSUhEUgAABdcAAAKXCAMAAABXM4OAAAAC+lBMVEUAAAAdHR3MIXIAAAAAAAAA AAAAAAAAAAB7ADQ0NDQ7OzszMzMsKys0NDQ6OjozMzMrKyszMzMzMzMzMzMyMjIzMzM+Pj4zMzMz MzMzMzMzMzMxMTEzMzMzMzMzMzMzMzMyMjIzMzMzMzMyMjIzMzMnJycxMTEzMzMzMzM8OzsyMjIz MzMzMzMzMzMzMzMzMzMzMzMzMzMzMzMyMjIzMzMzMzM0NDRISEg1NTUzMzM0NDQzMzMzMzMyMjI0 NDQyMjIzMzMzMzMyMjIzMzMyMjIzMzMzMzMzMzMyMjIzMzMzMzMzMzNOTk4zMzMzMzMyMjIyMjI2 NjYAAAAyMjIzMzMzMzMzMzNNS0wxMTExMTFLS0s0NDQyMjIDAwMBAQEBAQFLS0sBAQEBAQEBAQE0 NDQSEhJSUlIAAADPAFn39/cUFBT9/f0zMzMxMTEYGBgVFRUzMzMaGhoZGRn39/cbGxsfHx8UFBTs 7OwYFhZOTk5+fn5NTU0cHBzl4OL19fXu7u4YGBjd3d1oaGhOTk4dHR3Nzc0jIyOYmJiCgoLZ2dm9 vb0YGBgpKSmkpKStra1PT09ycnK9vLzm5eWCgoK7u7vy8vKsrKygoKDNzc0iIiIXFxfU1NRqEDbF xcWqqqqMADuYmJi+vr6pAEiheYosFR/RAFpMEytYTFHSAFozMzP////PAVn+/P3NAlnUCF/53enY IW/XGWvnd6fzudLHBVjVDmPxq8n87vS/Clf99PjmbaHEB1jrkLfWFGf75e7++PrbM3vKBFnfTIvT A1zhUY7yss7phK/rirO5Dlf2y9776vHpf6zeRoftlrvdOX/mcqTeQYThWJPjXZbKA1jvo8PkZJva LHb30OGzEFaYFU3ZJXPzvtXuncD1xtqtFVZbEDD42eb0wdekFlP31OOtDFHwqMf88PZpDzV4ED2K EETx5+vIGGSjD07fydO3BVGUKFZjJUDZt8WzgJacPmfFobGwNGnFiKLOM3WMX3K+WoWqX3/PbJd4 QlnrsspjEF3KAAAAqHRSTlMAAwJxPw0hXbAHDiILRAneEfjMambGGRuad9UWVf2A0DPu2iqfEybj hREf9PHrlYyJub9HS/tZFE/+P3V7OTayo49SqsKvcae7rG62H2IuMUFeeVvnfr0lZVYvO18oGUcq bGNRZJE4Mmz2gvmRPVGbfGN76zkya/SMTEdASvbaz6LovbSbf3HPx5Nrq6Jg1XiLRZ5t3rOQL+Ss wMXAvLadqKSB+dtq1OGSO7YxAABxUklEQVR42uzYPWrjQBiAYc90MSalG58gJ5hLpA+4cuVDaGsX EajwNrnuzo+kBINJwu5KKZ4HfRqB7PblQxsAAAAAAAAAAAAAAAAAAAAAAAAAAAAAAAAAAAAAAAAA AAAAAAAAAAAAAP6T0CaEDQA/TgwhjhPm5/cjTm/uinEj8AA/Qgz/jN0dYGUxhsnD3wpVlHaA9cR4 E/THrN4/t9u1o1zFQ2FnB1hPnKte8txsi3xMD7vxXs77ph/Xtis7wDqmqj+2bD/dk1KeTz1l27LC CzvAOkJWNvWW9DQ5pA/2+3x9UYv7tu7sIcQNAIuKsWZ9ty1NP+yb5+96eX6X/z+X3cYOsLD6Dabu 6imNQX/5gtOp3m61lyXtKZWw29gBFhZjzXqremv6aXSs8vFNNe9j2W3sAAubs37Yl6iPNT/f0+Wr TXc7s/Px2Mqe0lbYAZZVv62XrF/f3q7XrhuGMvkafg19na7vh2Gc/nLpy1zqNK8f/K5eu3NJe1nZ 28au6/xh795dnIiiOI6b8bkiIgg2a5v/QIi19Vpor+IDdBiwGUFUMkOKLXYb15W4gvhAEOTODYIG Vo0YYiWihaRQ8VFY7iLiAwVtvJM7mSSoO6Pk3hT5fuD2W/04e87JGQC2FHRzXcX6fBhWq+qFgXp+ EAbxc4PQd4Mgfq6fPt8beL7r6uclz585fUYlexrsmydosQOAJU4S6wszgadI/aSQUor/JsMLp86c 6Qa7Gp7SiQEAK9IuTKk0G3piePxL53ecSoJ9UgU7LXYAsEMvrqvm+lTVE0Mk/Qt7dibB3unEULED gBWO/j1SaWE6kGKYvMrcQLCT6wBghV5xLG07V3XFUEn/ci/YS7TYAcCKgtPtwsy4YtjK185u36GG p2knhlwHANOcpFyfmg2lGDbv4tyR7b1ODAU7AJjnJLsw5+Z9MXwnr5zttdjjTgy/TgIAo+IPT+su zGzgieHzKr1ODD87BQDznO7QdKEqhQnuJToxAGBRMjTVO45GuH2dmPhmLwU7AJiTHhBQO46eMEAv sW+lYAcAOwqOPuO4bWrGE4bIk5fnjuxidAoANqT3vmYDKUzxytfSTsy2ST06dUh2ADDAcZKhqd5x NMWr9I9ON3JOAABMSbvr074UxgyOTrnYCwDGFJJYn9JDU1P0EvueU3Gwc04AAIzRub5pY+drGlKY JFliBwALejuOoSfMkv41ltgBwKx0x7G0MO8J02RlTp8T4BI7AJiS7jhOh1IY58ZL7IxOAcAcp/9r GubJ8pX+JXZ+nQQAQ1ZQ9B3HaU9YoJfY+SYeAJhSSL+mUbWT61JdYt/NOQEAMMTpDU19YYdX6e7E cIkdABRT3fXAE5a4fBMP+EcOkJdK9WR1fd4T1ni/nROYcIBsq8bWjZtAXtHNqFZrterLP99KYU3z 049Xr96/e/n48d1Go95q1WqR+kuALMcmlIIydv/hkevIL471Wqve+H7nnrBo6esXleudYL9LsCO3 Y8ViccuWtWvXbto0MV7dO3Id+UVRHOv15fuLwqZm+cdHFexJrtfjXI8igh1Zru+LrVu3f/9kUWX7 GA3cj90E8omScn350Z2msEqWVcGeBnurXauR68h29YCyZs2Joyrc9xfXjtGOLLmOnKK0XH/wUFi2 9C3txDQanYKdTgwyXT10aP369YdVth9VwT65ZXwqdnIduemhaePpLWGb/DDYiaFgRw4bVq8+ePDQ +sPHD5w4qiv2CXIdSPWV69+fLQrrFj/1d2LaBDty2LB3rw72A2vIdeCPukPTF1JYJ5c+d3YdX8a5 3qBgRzad66vJdeBv0h3H5bdNMQLNwU4Mo1NkIdeBlfWGprefiJF4MrDE3maJHRnIdWBFesexrXYc n79uitEof/6oOzG6YG9TsGNF5DqQIYp0F+bNohiRZm902qATg0zkOrAiHetxuf5QjIpc+vZxcImd WP/F3rk2q05DYfj3+iP8NX5ZEzstBQuClCJwQO4Xga1cdG/x4P06XkedMcmbvXajgBR1rJrnw2Ef StO0XXlYTdPguIDzusNxAZ7v67XvlxXxj2HfOn3did1xEed1h+MS3AtTvPfEP0f1q9/O/+W87jiL 87rDcQmex7HviX+Swdd2T4zrYnecx3nd4ThH+knT7uAf9Dp6YvB0EhJ293SS4wLO6w7HWV4mHuO4 T8Q/CmZif88NYndcgfO6w3Ee7l0vVcU/ip5O4As3nYDjKpzXHY6z8BjHnwJxDQ8lxb34LUFJ4wmw L7Ymk86wL7KAmdjddAKOK3BedzjOwWMcR79cl653SLEWv6VFionQlJpkWG9FBuyZ2N1PJznO47x+ A+0iqI0iOk1HLqRTRHK1CdFIvrTpz7AoFlfyZY4NnQGL/ypqxeKc/hZ8eThmpNjUioWslZIynckC fPqreZl7YboNT1xDiTR3wqaBc70TEq9oVd/LdOs03ROTv+kEmkXFdNEJKTsIV6ZJZ2mh8S3Q+m6h gA3ctoehDtcR5Rzn9cz44pFq77RNngkxoFOEcqUh0Vi+/DkP9YW4ky8lKQ06Cxb/VTTgrb+BSAhR Vwd2idw2AwMhnhH15HoR/dXwj9+Nrp6ed0OKqbDpYS91zj8li5XIwPEre/6vnCXsNWHwyjHdQkkw UzrLUhgStL7sjLCB2/awacI15zivZwZeB9sToeW8ng1uKM9FrrzOYxzrA3ElMHjoCYs1SaC9MgFm LK7Hq5hB7Oank3KWsNcEE9wg9kxeB9s2Zcd5/b/Nn/K6VzkKTZd+xyWv9/v91V/h9WW//5z+Y17f CEljRlmA16fysP4dXscYx5+Qrl/DwDfnP80dSdA7kxQI8NmPq+J67N/Ee/PNfI11VNarVoTmOd1A uVJRq3vypUZngNfR+m6z85/2ui+jbUo5x3k9Mz7yrnahpwL5hJ/h9QvA63+aa70erkP6M4SbmP4e r7fDTcReX8iXebZKwet/A+lp17fXap3rPxcMK2QiBNd10veSZ0bxS5GBCs/ELr2et/m/arjaimuJ dPOtEScuRRkfsJj8sC5fA8rOTV73NwX/0ev/CpzXM8JeJ+RlE5K0F88a3mBfjEnSKksFJuVyRJLJ LqhWD704LpfLBVL/zk95vbUMkuNdr8BvNMf3cr1uvCmrgiKsJ2nKv2Ro9crlHnXKUmvVcnki36uT ZiT/HBKA1/1hQyWSOy660LurJI1lk+rlcoekVbv3SeXZjEBUfBh4jWcrrl44HqgGNPR/5/VwuE99 dF4udzelakcfoVqp4TW2U30EOrJKuvSV3h7e0EdtvTyqdHYFr89Lqrmt/N/ta7dcXoT1IKnspz6B AipV9OH1hfygT21V7nopT0RpToZN/VCt3o83atmIssC969Mgg9cfECEVwUBxxt8rHLijTuPRibC6 bRA77pzmSuzwuqSu/0BQNJJKf/gk+U3v7lgNluZUDMvl1egueVrMXucASxrlRZvSwOuSPv7gcKs9 NamZbnX1tVlDBmAtaBD4ndf9lVx98FCMOOj8zvaom4hhsfeEqD6bmHy9LKutA77n1/oyvOohAWhg u1LLdvQP4ryembTXpyZDawYCHBdEVBQgJOljAQYdFRLn+tfDBwG8rtnE7nG9lS4o5B4fVU7L9K8P BYgbfMtOuXFBGvyv0hcgWZGmmJhNre6FKEpFmroXSbGoCBCYoO5UBbg7/sbrNb2Eu066cp0GhvqN GgJU5oRhf0uS3JkCtrIykTp63qMMtdfNSrG9rx29rw8DLDzEpJhzpaqp/vW2SohNmWW4YGj+m6hr gRplQ6frr7ey/ZoGVLITgHN0c9cUPqthwYQUs4zTCUivv2d62HP2cBJ7fWWCcH0nQNUc+nbdE6AU m0joy3fOeJ0D7N7KkdnrY3O4WwMBGiPSxM8E8Oo6DGQ5eyHOeX3G0aqzjpaKHrM6qh1tBfD26f71 riyyb/bPjOY6CPBQl6XRP4jzembSXu+iqc4SwdTSXvf7/H71gtcLDcHsSNIuiUe8K7weDVGsLMnD qDoDigHG972nkhMtcw7aCaHqhupEb84TjO31umC8jjkW8PDCs/ogVF0rsk6h6bWK5eLn9rb+0OtM Ce+nsL3ODO06etm9jm6YT+pHkQVcN01+1zUDlzc5bCT9sqIksuDp6QSehsTkMl8fo1k0q9bp4LCG qyPi2DvhdTvAEngT2Pk6hxsHIsWBFRza6+Ks11ue3UJaIsWECI2YsbzOVFSFCpWnijivX0sOvR7d 66vssKICaD5pdeUfXpNmPfl+tdeLdGgm9VFTdTGc93r7oBr5ajKaBvpSHSHj7VrNOQL/nNdnvUBv yA8T09U4ROINjNf3o8ifqb+qIaJW1rXZGntI0gtq2zPVJHsI+GTcmnR2ssBGRBQrqZVmftS5g1WZ ufno/EGVvDFhfhgWqJmoT86bnWdqL2Zo7/JlZRLWBfZgrSqwbPrhIoAPi6r9yJ056XVvPBvVTT4c V61K2V6vDid6w5W22dllp9l5LkRmr+OZpE/mB5GJCs7rk1qOeAPFIKGciNvx8Jt4JmHP1Z1TeL29 URdJSUyR+qLeLiajYcPseU/ZtTiaLLZoQfB6aeoT8+T1FdrAZNVXR5XVz/3rzZ36diAdbt6yM2nV qzrEUeqhNpvVDjrC4XVvuSBge70gF3pl2Xh7R1nrtQma+8VEh2XZNMbKtOBvet7vvb7tTKZHU5zK 5oPaZDKV++u8fi358vp+NFp0G7DKmMOkoPug+b5pmCDtlQwveH2FNF0S7XW6HVf50q53zuv2OMfn JrdoyBUjYkqqgkjfxwjGO67rLNFR38Qbrfl8IuXD9R15ukl0uWr+1vJ6u/GYRbWf4zPdx3FnW/5u qWEwSJzoTZfNQMAyLinK/LH4HnWr46ic9Hrx8WCs8DJ+qpTtdV2nB3wB9LlHe3Wr17/fDUQ2oI+h fQEGlfN3btH7k7+J93jnNFezf+nxMFUeD9Pl8xjKE9wnKiTSt0q8WNZEqPQoDXtd3TlJRjrAdjjf AF6vVPlysIQ0XdI8ys8hap75ugy57BjB63NiLK8/5xhZD2S14fVGTEgfGnipoHet5VleR8CjuDJW vIt0QPed168mX15/pFEg/yg1T0D6w4vZ67VU/Dyc9/qex8dRU5tplcq6767y+gShNsILU+K7drqd BLRJyRm5faxCcLjhrfcILPUGDk9VK3hpr4+4QuQ3m80190lRQasWPIdfy2rT7aMYeOJAflVtRL/0 Ccz+0OuersQESwK501wp2+umyKk+SGFqZ8uZvY6pYXDTNAt7VEw8MjOHU8F73BxXxK3o38TTD53m bPavmmAaIVFDp9N8IgtU5KOh04IevB5RGvb6HC1F0b7HVQ9HJvPQ1s8KLAn0dLMrI21HeGihV1ET g+X1KHmKkanuJ2xx+JV0PM5TkbOzvM53h6UA+lg4Ic3aef1qcun1/QY2TCrgqOUGr+NMxwRWZ73e 9vSQXaBdO9YuB8VrvK71P2irkPYKZMBiaMZUJppzQgn1FFEXWVjNfxyADKqqij7yTfCQ9voQxmYQ 5mrbc8hYggZUQ53XUt5jWUTYwpprbB0M/sjrDa5xnaJ0pfaW13HhjDrM9dZXBOa3ef37kieysjZH CwSkiBO2vMFfPPyJmdg/feet/HWwP3m9FOI0ppvFgnT3mCHRkblFO0nBXq/bbYCHF6a87u18xEg6 ZjfUSDUnTwcWbq4zaa/PfrP6RHt9xRuKqJeqyMjyOp/reyEOROlbswfn9WvJl9cbQrLUrXQkbBbs dflSJcPorNdjYVNXek7I0PmN1+envI6vjVGc4I4kU+KANt6tIacA6Grx61DXfSg/YlMIkcCD52mv 1/kri8s38T9NNcICqt0eyC31ZL3lstUO3zUzNB/Qt7zOG2WvI91CgzKFGsq/8fqSD/bCHCowucXr rxeGQXavj/mECM45p8IQRMSs68ebe9i5gz1Hcwmo4NoVa2Z+mKawmUrxWQTa6wFZwOuINo+AdSKh 226xNh/F2KjNjPiMcY9Q1WoW7HUUbdPRXp8/xbjOh9oE1r/1OpKovd4NdDaBkvP6teTL6+UeX+RP hM2cvb5EB4LkUr7uC5suUuvUeiHFli9+53WMmF5CqSlKT6GGQnHPEoSPGXOhN8D9x6mwCX20C3A5 X2evLyybogHVpcvvRNXfCFEeQLBNHAlg5ev2vsLrd9hJzteXBOx8nVecaa+39L9gdFO+PttWRWaO +tRFSXrGmAMv3Uf0RFS/xetfffHR25++b7yeox86rVn6LQibmoxGi8NFr49TiYOVjfB4GDAXNk2q CIvdRa+PhM2IWny92dMbqvNJPJGvh48tI4DdOSyd168lZ1737yAmtOBD4QmfvT5MBXr5fP+6Gj2z LjAR1VJCKunoibiLYXjS6zoIq7KgB0pTeuqX8Rsq7JqsPkr34rc7FfUVpMJ2V3hCd2UfTRuy+9db rGUDh/matQtTz0hL3NM7cK9ek8gctXuTB9n96761r7/zuu64rURcqfNeL6BVoyYZvY6nTT/ZJiI7 uAx5Do0/1ocJJpRi7mVP11/68MOP3n7/rTfy7fV2RcbmJhXWuO1dYMKLXl/xCdOW9CICttcRbqXC E21lWW9SYOILXsdUPvt04/2d11epSN+d9zoWmsYWJ87r15Izr9O6ilF80uJ85RarCUTJeB0xd48Q nInzXh9yx0O7JguIMAodIbIQiJ6KuYHZvj/pdRgOEcngS6GEDfXYickEdW1or9f7/b0P78Wqv+SI LHwtK9LBWnjExxoPg9uw1SaqL7smy6kwP/AAhRmPpr8TkgXKM23sGe+1PR5GZ+/Y18Npr9efKvUg Lnid7nhnm9Wb8vVPVocbxI5LpBY7Hip6YtmkJ1bZfw/v5w/g9bwNdITXmR0f8mhaLE7bOqnow88t zJR71uvWMJQpTjKwvW7CbYImIAtdoBpLc3DlO+E5r4MHrnQoP7yi33k9fhrU1vIueb3zNPhs6e6b Xk3evK7jZxASRmJ79WYUdyAo9rp2V7AK/c2wesHr0UAVOIujmQqyLaFJDGqhv0bfd4iSSuuoWRKn vY5PiHuyKGnNdOJoopYmBVQ6GW4eR40XMWgwXgeyIEimUpRLa0dEd6jqvW/FMY9fByioWiz4a1VX r8lhjobh9db+ppvwF95UIOWaoPoS9L8+m0WoScrrvK/PxCmvc6UiVOqC1xemjoXpUWT0OqYRkFM5 NkR2tLfbA4FLE6RvFvtaRI+Us6brP3ypvP4pvP56bvN1PTJc7CZR3LrTpsWuHuYFGdbqxFzO12lo ho03lwIDy4HtdRNu1e7aD1cNnGP/XpUxChH0h/Zpr+/HigVN1AVkTzbeeaDa5u+9Trqyssmse564 4HWkXNtRFM1Kbvz69eTO6/QMI63snKsPM8HroWWFE14Hk6pgdJ4eHUSaEKYC57zeOqGu0u/mn2rb bxVp46UfCVwKBoqci3PPmy6tYjjM8Zf9+CUud7cE2SGDR8M12F7nfT3tdfgaXPY6nMms6Hp0vv7m K6/9+OCJzKDzp25NNwGY5PmMQCHbBl74+st3Tb6ex/Ew8DroeNbjpXZYe3O66HU7UhfE2F63ww1p /boiDEj5T3odjO2T8+Cf8Lp/J5hLXscDeUyD/kGc17PDXo8Hj10J8yObT8Uve53W9wIktdNeB5NA GA5K6+kJY+4QPRy9d+e87ifovmCw+DmXhE7C6Jkw9DA/TE2Aku766HoCeD3S8FQsW4yHYdo9/qgs hcNcMU1SS8Az852z1EcMDD0BlnvL69a+nvI6LRKu1EWv+89553HpcDXI19989Y2fKtnFjkfDmqy5 e3GKZ0ZO+0xFf/XDu/C6mvkrXzM6wuspRgMWJvY1ZlcflToveh1zJPHELQx7namxT3dttLqDMARK 65e9TivOqso+nfA6xQ/ciC96nWYVAfrPcOn8j+G8fgN+EATaH61AMiFJPDwoe5RMAI6DoG8+O+2r 1ljehPKja1L/1qTR5ItvFVnbeyoeam0yLB70FHJNjp6OKmgwjOSqM+nJIFC5yTII9gTmZvgfg8XD du0gdElkaJUSNYVRi7ZBoFLY2VZ1g0/Nljfjhmp2z/njoX7jvtbuBsGO0qyXAz1TpPmRIFmxmEBB r9MYqyWgEwQFc8jWqQIqaqfn9FzWk4+Kva8j7Csf+CFvQFeqpytVlAuk1+W/OAIT+VcHO6t2zis1 WxhScT1I2F/9/NuvBiIzuGy6EwN9UGeXnmCCH67mxZdkui69/un7uhsmVxM6LhCaKaLinWoWD6lH +J8pizbq4WN8PpCNLGNJhsnzijrL3ZjS1BFoKQr1QIc4b7y90pdZd0WE0yEI6pRiEgATLqHKcERS wnfSDEFHiKqYGyM3YoRhKuBV+G5JEfd03A/9Pi5P/zGc1/8y/E3oZ1tg4xcK/u/esNLgaBPSeWQo JaeWY8W2VXK4sb9V7IJj/i+/EdNpQuujl9Y5W0B0rsp/tCY2cOVx3aF//3rg9dc+f//HzxKRlQMp pgI2eS7OAH2sxPUkn32JdP3T/A2HuTKs23zKb4+PyyFux/jVq2faDRu78aBvrUf/IM7reYe9fhEk hTtypGirLK6n2+scgzSzoMX+yqufv/PdxyIzE5KE6naydde0pJHVsqZGzqJ12QvD6XrOutf/7yy4 3yfaIwT+OZzX8861Xi/pB4UcaUaeamrjYvcBY3Yy8fJjwv7tZ57ICroSkLIVBYPck0Ve4+VX8vHX P6fS9dfy1Q3zf6e9VVH2bFjcVXAH9x/EeT3vXOd1PJ5BDgtrau4FZQJ3TnXC/mP2QexJTBJc2gd2 Gv/4s9b8Y6c7cTWfaa3n82lTR7wXzD6ifxLn9bwz17+D94cs9G/LOQDT3ArQv+ngmIT9u489kZEp AftJ9SFpkKF7K9IMxJV4H8sxjmaQI0bDuG6YXOEPK0JT7fr0j+K87vhvU1j1xr3amm6Be2K+SkRG 7rmMsmB44oRJ/VmpZ+rUEtfywjd2uv66S9fzhj8qjsfDzj9uded1h+M8ck5H2RPz3k/Zb53OCITe 5Uej2ofre9d/eBzj+Piz1S5dd5zEed3hOAsn7N8cRUaeEyiKNMcNAaYnruX4DY9xNL3refpRDUe+ cF53OM7Bt06zDmLnZwkCYREUyKJ22xjHx2dNczPnlyNnOK87HGfAr2vIhP2d7LdOi6QYCcAMFvSE vxNXY900zd2zpo6c4bzucJzjZfNw0vvvfVUV2QjiSPJM/I79PCJNXBuIq/E++9Ie4/i66113nMN5 3eG4iErYdU+MJ/4qku2y293try4Qv6YBr/NN0zzNvO7IHc7rDsdZpDp5ELv4x+AxjnzT1PWu/8re /b00FYdxHO8stdQ5BoG7WBeCbOBuDQrBAqEgKgu76Ifp3IbZ2eiHurl5sVoqFkgSKKFlRWUGh/MH 1JX4N3TTVRfRRUhdBF3UXd/vNk9muaOw79nF3q+/QLz4+Pg8z3m+KIFcB0oqjE7lOYFVo3LWraHp h7dchoENch0oTRbsIti//hKj00pZ/2fH8T07jtgWuQ6UsLkT86NinZjV7z+3DE3X6MJge+Q6YKNY sH/+Jc4JVMb6q82HYTj4BRvkOmCjULC//fxRnBOoiHfsOGJXyHXAllxiz9//emdUgJn9uWXHkU+S UBK5DtizlthXDeeZDE2xO+Q6YK84Ov0kzwk4rXAY5sumwzBrfJKEksh1wIZ1TqAynZj0lsMwa3Rh YEvmeqQqc33g9TXhpfRc2g+UtLS09CprGs4yv71ZXl5eWVlZkvYDO5HJl+tVmOsuTat31wb66/qG kjXh2L5oNBKJ7AW20dPTkxmcnNUNR5np+8vLjx8/nrk5mMnE4/EeYS9gJyJTXcZ6MiVy3ev2aNWR 63v2/BXs4Vgstg/YTjQaHYvsjU84XLDr829kquemMvGRkcjY2FhU2AfYiQnhmpqhVLFcr6Zcl8Hu F8nelxoS4Q6UEA7fiA3fepZ2MtjN7IRI9ZmpzMj08MUbQlioAXYgOSRDva7f762mWBfBXkj2Wq+/ XxC/gDrg//rEH/++VLLmxsMnuuEcfV6kek6k+pWuQ03JZCqVEj+G+GEAG/11/YI/IELdU19NsS5p +Wz3uIVaYHveQMDva2xNHnl0J2E4xEwsTMzM3MyMDF9q72xpDTaGfD5/IOD11gL23EK9zPQqS/Ui DbAl//x7m4Op8Re64ZT0vWOFWG86enkgJDK9rcEjiy9gh6oz0oFdLFB52pqD1+ecK9gXJmdyg/Hp K4c6uy+cbj7c1uD2VNt/1ACgjCbUuwOh7vFHt50JdjN7bzEnyvWLXR1XBwq57qmnAAOAcnG5RMHe 4G9MjT8dNZygz08u5gZHps+3H728Eev1motcB4Byfsrm9bUmHerEZCcWc1Px6YtHOroHRKwfbqML AwBl5ZLB3hBodGh0Ojp7qjg0bSmW69W3rwYAamma7MQ0B3vnHFhi18WOY25KDk17i7HuprsOAELZ R6feUOu48iV2eRjmuByaHug617JpaOraAwAob8Ge78QcejFqGkolFk7JHcdNQ1M3XRgAUBLsnjZf UPnoNHH3vhiaZgpD0wtiaEoXBgCUcP1ZYjdUSs9OyqHpifNN7DgCgEIy1zW5xH507qluKJSezO84 njmSH5r6D/OlKQCoUTgn4G1u7VDZiTHFYZic3HE8eK6FL00BQClNEKPT0NnxR+ousevzE4vFwzDW 0JRcBwAlrCX21NyTUUORtBya5g/DnKVcBwDVtMI5AbnEbhpK6PP/2XFkdR0AlLDuf4WUnRNILGwc hum9PHCaHUcAUMy6xN6rZnRq6tZrGtaOo4cHEgBAGWuJva9JyTmBxN2N1zR6+dIUANSzzgn4g0ou sZtZseM4xWsaAOCkwhK7T8mbePI1DdGFkUNTdhwBwCFasRNzVoxOTaOsTP2voamfoSkAKGctsfuD nWVfYk/Pnszlh6Z8aQoADtI23sTreFDWTozccczdlEPT9k5e0wAAB2lasRPTXt5L7Pq9kzLWh7uu dxdW19lxBABnuArnBGQn5jd7d8ybNhDFARxfSCOwYzEllVgikaCGoUuGTInY2AB16URaghgMihHU jl0JpBijlsFKFlRlyTfgQ/bdnSGGQgcU2Rn+P997d8D+dHo6zm+xYZ+T7nxuPPsP4TtNv+OMIwBA nKLXCRiG0TV+GHPDEdF1HMOIhDNyumEYI+81PM9xPM/gMaK19+w5s2nQc3kX5rqALgwAQLwYE4fY 1ZOff15eZrPZ4yONhd8R0ykNMpYx5uGPx34YFX/sP4QR+IHowgzvql8XFwigCwMAEBMWnomxh09P n9zPH08np345KJcDGZVJUKn0gkogI5iImEx6i9ik3XY7g/6wXluUdRxdBwCIjyL/ndSwzIO9juu2 d+XScGlwHSrr5mGtSGUdXRgAgLgp4T0xafOgufel06FBXDEoNhnIGAx4omnF3qDZvO+bF9dF0VvP 6ujCAADEisl3J6l22mwd3N5LzSbFL0r/6ofPLaUtWubQsgslUdY1vKoaACBesrDv59WGlR5+M7mW TDTWDGnIBaG0Ks2fC3rqll0tlvKyB4PmOgBAzGSLfT9/86Fh27ZF6tahVa/XLfHQ5ztr6cq6omHz 59WJnGpCtVotFNTSUf48i7IOAJAMJo+x529KqqoWSaFAQ6QiJ7Mqk7qutOKYo5u+cnKzjt46AEAC FCZuitH2c7mzPDkixxRyjqCfKKIu151d5s6opou9Oso6AEBiFJLJ6JqWJefbiN+yG2maRmm51hdV HW+qBgBIBGOiGcPpuvYfemSp65Q4ylEZQVGwWQcASBJThExI12UQmUP6ct5OkXC+EQAgUYwoSxmO JoVPu2AMLRgAgMSFtX13TCSGrToAwLvBeFXmSYYSWW7+SknRlBJrPqVS2KcDALxX2HQDAAAAAAAA AADAX/bggAYAEAQAGBHYtIHpbUkACsD2HwAAAAAAAAAAAAAAAAAAAAAAAAAAAAAAAAAAmCpflwHA Vvd3JwAoduqABgAAAGFQ/9bm8IMQvPI6QIvXAVq8DtDidYAWrwO0eB2gxesALV4HaPE6QIvXAVq8 DtDidYAWrwO0eB2gxesALV4HaPE6QIvXAVq8DtDidYAWrwO0eB2gxesALV4HaPE6QIvXAVq8DtDi dYAWrwO0eB2gxesALV4HaPE6QIvXAVq8DtDidYAWrwO0eB2gxesALV4HaPE6MHbqQAYAAABgkL/1 Pb6CiBevA7x4HeDF6wAvXgd48TrAi9cBXrwO8OJ1gBevA7x4HeDF6wAvXgd48TrAi9cBXrwO8OJ1 gBevA7x4HeDF6wAvXgd48TrAi9cBXrwO8OJ1gBevA7x4HeDF6wAvXgd48TrAi9cBXrwO8OJ1gBev A7x4HeDF6wAvXgd48TrAi9cBXrwO8OJ1gBevQ+zUgQwAAADAIH/re3wFEbx4HeDF6wAvXgd48TrA i9cBXrwO8OJ1gBevA7x4HeDF6wCxUycrDQRRFIZPlmmCdouiUUGcaIMDzjiigoLDxoWI7n25/y1N qUnQ2CRgJ2h5vl0VVHHv5o+Lu25mFhd33cwsLu66mVlc3HUzs7i462ZmcXHXzczi4q6bmcXFXTcb gAS40Q89Aaf61gZQ1SnworY7QMHiKhw+a5By2FLbJllDx8COgilgUhohuFfLM8CapAtgUU0zOXAi bQFcqCXJOg+LnQBHKhZ+zdXDNEyobRZ40ptbYFc97L+vPAdj+k3+TNfToKoS1dK0oVI0Ps/WPIyo W5KmiYanmjZVZP2Lpuu1aWBFRcrveuWBcxV1fUktZ11dDzdX+uj6eqWTJXf9f3Q9I8jyy+OaynEF 8yrFPEH2MFFPJC0Dm+q2DaManjrBWv447rj3KZquLwHXFRUpv+sHcFTY9dWa3s3sfe16HVhIWl3v ZPTSXX9l78yaUkeiOH7yGDCsKsi+gyCLMlggV0FBcCm3cqmx9PE+OlV+rXzL6XN6CyMoOsyMM8O/ bglJOr3l9K9PTprc/xXXURH39+Q6KpP9ZlxHDTdhqXn07+O6y7Ks0BuuP7MPrw/+Wv1mWVcORzwD M7lu34Ai5STXn1psswCK6wPgcnf+LVyPsguQX3J9EVy3k+a35bqdWfl+XLfHsNTfK831kNvtg+jt xplFVlt2u90GoAw3k4DD42j0GAUp3+NG8JJSILiO3C5wyHNU74dHbsF1k+XhmuQ6D65XLkEqfzQa 7RL8eXU2wdgPbvxMgZZ5Hdy4uJLFu90hOBhleTPaZ92LsjiPaTPWDV6BaMk6CK237I1ZXGeIPgGu AG1prueLbEebE5hS+n1ASuDG3Fz3YJ+uHHVHbRPb0jzrPrsdXHdd1Aa1YAiUVrBNbt6mObleeO6e /WJSSYC6DHYffZQX2+NZcv1PcT2zGrzvt3D+/35c964GX3N+6jwjlUqF4K0KqVQW/jYR18MbiR32 EQ/BUn+jNNcJG6UGOSV3MXRsFfqa7NsOMaIXx8PxnrCObgU3z6OQxU/ijNbNHe1q1XIz4zAeDK7v KqsbxG3UA/f7M7bdPfLSHq9Ms5JI8x18XN0zz4mB9RYnnJqf+9H5jE3kPqtQXiERh9G21grN4vpa S9pfljE96eA6dUZCEbgztO1VkLUczs91i32076iLm3DEO2inILl+VOU9FnYBabJNc3G9mbRR1Zs2 +2sArG9TeGm0jMMshOs0Cm71/W3oJlE6k26HO5VyQ2i1lHiOis2UcCfKirObsdfGxm8GHixLrpsq YZ59cwFk2bbrZwlIqbNS4iIKK+yQAR721zSs10Z335jkuriqRzbauuB6CDG+eVMqrZb/yHXjYMTq mQcXZUuZ+y5YQXnkweN9aXQASvnd+0b3gM4O0d8ylFkrb33zcP1axFrboGcbKnVTZFgOlhK7Poen eI+Nw2Nu6dv8aPywDCjjnqW+xHV5qxmPcZr3AdVn3x4xaIKHSZU2EBy5ksYUrpdsqfgsrhNT6yB0 VFEndAUxIx25K8xHTsSW6huc636buJ4tqlvkIjEwKEOhpuY6z7UHs7h+fI6nohq2nVtzcB2T9wzN 9VVBWGxV9fUzXFd97C/Fba6qm+faUq2NEBicbZqT6wmVRY+4bkYkKGdwPRsIBGLwWf2/uQ7MUJOE yVPe3ZG2fNQ+Tvjp2t6Ldh0DySuicJtiok5mWdqc5HqB7ekC6hnTkeXXM3YcmH6JcGN53SczTSEh +dQdyE7jOjDXICPjMA2282eaRlTYnIjDHGV4tht77K8PnvAOhBJWduE2zesoyB4Nt2h7zT1k1aI8 wo0Wpe3OyfWfnB9RqhW1Cm/uAdgIqx3yrM4Eww/9onEBEbvxlDgWMvth5kHCUl/hOpN/GMCuvTPB yIjniCusZ4sGwFEcITQc3mGyA3Ye2x/fQfhcvOX6M7nV4fo5XrcZXL9Fh9oALqtFpe+k5bjOcOg9 7NCFfcW5PINJkicRrEiNuI5qtSHvpfF1EsAjyECTZRMf4t7gBNeZHbdnc32X5UHeDDvDcnD9gtUt swma6z6/3SmIZwcvG5/hOiqJjURVdpJxtcoGFXg5HHb43dFkm2ZwvZQi1QXXVynT4cmdTTJodrvb abGd5nSup/55iH5brq94vd77KVw3Kvw6/LJlS5UE11tyR4Kdzg77yWiubd7n5Yw8XI18wPWWTVy/ V/P0juC6LuMuNIXrBvsS0VzXFTrVXHf6XDuK63HhU9VkkZUrmru8MmkxI7iuM92Yi+sm2nZ2Ktd1 VgT2aFJ1UJFzPR9QrmRgyfWvcz0QAnCj+VmcfTfiBj7BklWZneKKJeNoC3102KMrm494vYk3z01X WOJOF5mdzczkOs4XUeDyFJHVLgDzR5yVUwYgiAcNllcdv4UIovZxCI3tgeV+wLleeWZJXnBGP8Ch c87tLUV1drG6NSa43rfvjNlc97CGYS4WTmQOrlfYvyw4uA7HNJZp+jj4JNdbjMBmjlygPMD+Ftuz grnKu6AnpHIMCxZtCvVmcV2LuJ5H0BxiEOcxzbneZ5lHYZUBqrDk+lfGxeEUrt/zG9kDP/Jn+zjQ ERWmy+Q/71XxIpcBDqXF93m00UPUSp6e48V5n+tMHS/ADT28Pz/FEwXXUZlTKjM8hesjNGMH19Hz Oi7i57XmOvV4uneKA15yHd2gY6+A6vGDXzgXrgxWJTnYRtPiXCfInp9XsbHRD7neCx9jyjFM4zpl 1aP+qGwCGDu8sHNe2Jj2UHupT5dc/zrXyQm94POnr4I8JAS3QtxkVkFdF4uMLGdOXw9zoSMs7sp0 rpNunaO7pqMKh9y6bwBF2L6HfItxzQCUx0uX/V5EvU1WRDUEKGMNGUhjZWC+WefoqqBlzeQ65Hgl +miADq6LYjTXMY7pNQA/MvBJrg8ozuqX/VXnzsy2bu1TB+uLbUrLNs3H9ZHuw70Och0b19l7b52j ezAYNOGT+v9y3fujniPqtsFIsr7dQBPLRpilRDnXI2V23gNvQaFDbKRrXTS4zRWf0HobH3N9WEbn CGuwguE+r+Y6pW3HmcVPcr34o5EjUt86uV69AjDQi3hRXN9M42EPLhQraq63rllCqtjQxWOA8Sj3 7DMp7Iyag+vJdYD8GlrsnOthcuYsrgei7ECAAjVkocUDLCxMXOd7qngnam7El1z/OteLgDoQHAvT c+xoi7NoB93nVa4tvMQedCzTuaYxhetjZij5j9avx5mZbapttcTE8JL5ZXhQRFJwB27RQEQFzmlE 3ItCLcdvm5rIQMrD3ur/YkxyfRXDJ7O5jhlVTQo8XTq5Hmdf3U6uk6N+TQPzdZLrzydOuaZwvSuf t26psdzEXMWdhOhp49rRJmsurtMEHJW1JK4/kod4716uX/+CzHA4/Dh9nePQgKaiFITYkS7nugVI YYHRbRo/FAwb8Uvuz4Iwuo/iMGWxmQNSwa+4PlTX1zd1nWPAUFyXPZmP0wggrk+4UFm/4vop+Utb OKIkkw/AqDJPugykgeb6vhxopTm57q+ZM7hOwZ42+W1wwkZWCkg9zvWh9ksSS65/lesSpG5xAa7I 4IJkbERHp44BmhUeeHt8y/UhOrJCN7O4XqJsuDKaWeg1d0zcEwahABpkwp5UnrheFncHFnB5OsTA vS0ehLzRXKd8hvAO1ymwfoQTSBIU10VFkx4H1+m0HORZmN09yfXJSkancP0CACj3otPGtx1W28Aq Cd6TzM4Mrh9apBpynY4nnQUaeOdB6pWXXF/g+vWACArWN7iYqT5wFpnA5MNAjcBVl4x3ywVQpr1c oc4HXM/I+I1bjgnF9ZK6hXVP43qyDIrrkptwx+qsuH7KDDgEXH3F9R+ASjIGq/dotOFSTwGQFVyX Kcp0TGkvwJWd5PpWmkNiMI3r0rcp0J2RQd4b1z5x3dOijiWtVJZc/zLXCRv6AqwhKNYE7qv2hE7w eozJ1ju3Tq5LbHk/5LoxVBYNXu6IKNS6IOMwmyFmV7InVZZcJzQ8SQbGiYFQ7vNx+KvmOprpM5BG SEJl2euS61DHv9tUK+d6mJzwnDTXn9jRlSBW+rNc35UdFHmX69im31Sb5loPk3Ege4NzHW6TfO7d XHJ9AVxvpYuRtcGzyQ1Yi6y9J4lnxIljdNOYhCsRknxytsv7AdeHwDFcVIFNxfUNZWdZB9dF3U5/ ekBznQ8P5bIR1yfHZlBxPQiiyDt1i3hLxrmrypBcr3LQ6jEhfG7SwZvnpivP6GOlpnBdti9PU8Q6 7yjVhWNyMEsKKUuu/0muk1nIlbpHHRFWDyD5BkojQEW7GYzAveE6+QQfvkegjOa4Jw1qywQUoSc9 4cGbzDCGZIPJgZapuN525H2gTD8/iiDRHFx/YSzWjwN21R3fiuA6kd9/GafbZyfXVzCnC811PjJv A9g1k1zPxpwy5+a6jsPQd7+JbVpVTzfn4vqQ9ZvMY0xcR+3nKgiOJdcXtM5RXyQtomFPhby3RFij i7ZTE1GVPTShWVxPcMoqru8ob0boV8511TejN1zXV9XJ9by0Ns31AG4InXGuq6o9YArN9TYZ5yTX VaXic3FdXuIzQW/ULmWrx4CJRyT3SUYLuY49c7/k+sK5blaZqdoChiW60g4dWBYjOTndnj9yPaif 15crM7kORzgi1iX4NrSF9AEyCpdkxCWavR/AKeK6iB8mDQ20DUhZ1m8AxjZatuK6WVWRnWusn2zi HUiuE/YimHyS63DpZ6y9cnI9QQn9Pmm+MzQ/19W9xBVrzc5km+bjekmTw+1HruO7G8o8npZbcn2x XA/TYg+lxDSu59kphwyHfR1s4MrrOIwzoPFDc11EtFs+6RwtjOt0X7ECXLl3uS6ftIno7Ltcj1pc rilc36dTXep9AqtTuW74NbmzlNbV0S/sMJdxmIVxXYQ+XhQqtpoUzsik0+kCWmU8S8bpNya5Lpbc lUw054g9m+tkrjsGmgWu9yNMNXHp+QHnepXM4hbvgAv8nJoHIZxjFUhorpPTPUCLMkYdYmCfwfcK 8CNuKq4/am/Cg8XdALj6NIlornfVa2KcXOcTVcbl4HpBLAteINcrR4R1L69AD7OnNp115uN6IS7z CNGyXyPKZ8J1tv9lyfXFcv2IWKQ1jeuQ4+vCU3JZVjqqIm2a6y5b3k+eTHI9qKkaqiyO6yMVTYey /32uG1sUwiOFp3H94/Xr8kuXuB3gWU3lOmzTMFcpxnRr4Rd7RsvnpovjehmtslNwPN4O1Oq9Fjm7 RJO7w2P0W97EYeigXQw3en77Pa6bSRFCowzsSO1wDT/r6ndJa4eHSfnCc3caUd9vhItYclRwXT3X T48bNX7SBlxgypcBvfFFcX2bm5Gese6SOFziVw6uh+L0Wsc3XIdjSqC5DoTO9uK4jkq+1LfjfE0D ZCu6TfNxHWqUR61xzDvdwDPsnXoGDy/Xr39W9BbzmVw3M3KdozuJl3Aa16l71Vn09J3G0s+W5joP ysSb6HfENdelcxQfGTgO1+zFcX29wvgZNLDmAft9rpNFrbnJYYp/ieu77ssm/ab0EiAgrL/pn871 R/E6SjBebeI6zWzeFP81+pLri+M60ewEhOq20qkJ4MmIjUr2DdcFY0iR2Vzn9Oq0Qf22jpQzONe1 znEPPFV1PPMKHFyHmF8dSNM6x4jY9KcE12mSGoGUcWJLjUByXfpMfXjLdV+RnA7N9SBi11wg171x W6joJlNWbaqm5+O6uT3R6Qa0ZZ9uw5LrC/ldktYe/S77OLyNn9vT/XVYc7zTedNLPxMK9/HTyfUG 7t8OU1rNdXnzWByHT/z2ArkOPyjbfvjBb3/E9SiuZW49hPto/Z/nulZPNKfzEB527OlcN4a8g8a8 sLFw+zpruVxk+bukhXLdoisgdSRYu9U1QHkRdnFv6nt6L+44WBO/vMd18qzTbiJcRFDtRq18LHHL qyQMIIUGgn3HZR1fJ+0HbFKgkCEGru9wIjZBcT1h+/Og5Km3+DzwCIrraj35FK7Db3F8yKu5Hm2h MS6Q67VmUUxiok0Huk3zcR2MREV0unjv102ad5dryfVFcx1iFVtqZ3MG129sx0PKyzuZfivj5LrP K3Y7/HUZjpAKLJDrkNPZfsB1OKjqn/b/Ca4PfTjGIrKd07kOoYjyzqr8+VfZK/f4I0uuf05GLBZD JDdjMY4nk+24lCiPxQxH0r373Phw1wVCVn0cfvZQ9J2dk4cJeY4Ox7lRGdZjmEee/XWD0m9sEzjY 2LcrkXsi1280Tf2mRAid5QYvz46My6u1Qbib1YtPPCD0xE6uNw1sRoH8qcY4fLEiSviNXvoyAKfW g7VxvW1OdgKsxESLr2MxnNGu2DZv7x77tsc/AHh/EYALbEcU3leWp4nG8ByRO80e1DshyvUKPI+1 ce71CpT2nW3SF4gUUh1KNVgHku/2BTudjtIQXw2PG/uUnlfBisUsUPJRJp/VkuukbK8j3A4TZnC9 S6uapEJj7pYkL3ua6yoeYhdjTq6TLopint5fANf1r0pWhc/1Y+8jroO7Z5PWCsOvcr2TDBq8/Q8c 2u0ZXAdfOC4K82MLaA93vzJPy/d+/TdEXF+gmuiuLvXt9G25bliWVQCta8tKwaTKPxvhxKMLSFeW tQekPcu6BPkCuarHecKv9VrCMjBtFuASzxAeTbj+aJqsRB/AvqMg07qvHa6G6L+lcf7nNGX2jZwW VeLBm5oX2Iehl645b/jMZqJ2+Os6+CjJpso2ZVlPgMIDwlVwB1md9ww8VnCkAAvb8J7KFunSBUr7 97X67QrWLyprNdnToZ9UWEov7Vp/boRLv5iQtawrWOpfr0VzfWAXl//N4jfUt+X6AnRDK1q+iXyJ DgY3vq9WG41GU60t6pRhqf+gFsx1oz+4gKW+n/7LXE/SOw+/iX5n735aowbiOA7/9lh3WXbF1iLY LigWDx7EImVVpJ4U0V70IPUt+MLyLh2z9c9FWnqafHmeS5Jhcgsfhgwh26H5Uf169+vV+/nn5fLy 47jTSqKx68QL7vqLoacF8nb8FKVn58NfJ5brmR5tNk+KeMFdf9/Wn/08w9vhwffq26v1cOWuf97B hAV3fT6fd7Tq3FtU9w6+7q+Hh18+fLMVBlMW3HVuY6npMHW6DpBF1wGy6DpAFl0HyKLrAFl0HSCL rgNk0XWALLoOkEXXAbLoOkAWXQfIousAWXQdIIuuA2TRdYAsug6QRdcBsug6QBZdB8ii6wBZdB0g i64DZNF1gCy6DpBF1wGy6DpAFl0HyKLrAFl0HSCLrgNk0XWALLoOkGUqXZ+tdurK09VqUbXXRmYF 0Jzda16eXi7qxjbtjn+mt6vTGi3b6baus5t00Q53qiNT6frZsLM+Phrb/mwY3lZ9aiNvCqDZ/52J wxtX9qhNv19/tKvnNTpop4/rGrM26bDqdTvMqyNT63pzcqHrwH+73hwvdP0ne3fWnDQUhnH8zWWg NA2lJYAU0i3I1pUOtArUKpV2rDpWRwcvvawzfq33W/rmHDYXLC4jgTy/i5yEQoeBmX/LycJ8dZ0r O+g6AEzsutin6VxZlrX+512XRxfQ9b/quvPgdcexZWWP6Cafj6LrAPBt18sr6y/PmdmjPzJ910fQ 9T9WHzyvx1n1lp3GYjf9rpsf2++unbpBA5EnG9XCgyWKxmJNAoCw8LveH3mZlPp2zkt363TkOAXy mS9aaS9XfUlnjrMqP3ccZ+WericfHVreWiFDVcfxk/LwS9xLV/2QG/Lo1+j633ed4uotG83DrFqs bMZIMTfK7LutbzDnCADCYtD1Q+aaQWI3ztqFpHeTxGOLlewXuVNrqvn1RzYr7qmsnBBFLfbZ9Unz 61v5/C79rnB0/YFlWfmfdf1a1iJjXW9wX+0NicjT4XYcXQcIE931ZKrRr/OuywOu7rqkecCesusO D5Szqus51tzkhK5bzIf0u8LRdT/ZvZ903ZSiV2jUdZEudM49Ge2XRPRM3dK+tGRA1wHCRLrecGss PDVLkmapRaFeL0gvVNcjFX/sHJ9sy70mdN1zlHa/669ZHHw6fv+cfSfUlOVa3fGLNFdd304krlKp jf39O+eUZmJy1/Mt9WqPdz1FYrmt/9AeyVB+QuKjja4DhMra+Id33Yf0OolMTnVdBbhlkuiVJnV9 QJfGsHR6xKru+gNZ1sl4n0g0g9T14uXFxcHz5/F43LKsEv9K2qRZ6TmOE/226xXLs1mUi+Ndb5Ni 5JgbSeqq11x5ga4DhMoaD10vEx0wZ7dI2a2prkslSjuknE3X9Z4Ml6S1VdfzfhnfRH5x/HovFsvT f3fHU6oF53CSOg+5pzTe9SaNMn5C7qjlhoeuA4SJdN3e398+bOjcusxr1Hfod93IMj8jLTOp6+W4 ktNd78gQI+2VaozxlIX97Dhg5yXJ85rOBgWG3/UsC+88Q990fYm0l7J+tqRfZq2LrgOEyeB4mHyZ 2TYNXWbN8bu+w8zn1Feear9pQYYiaUnVdcpcs9JaDlTXaf2Wp5EzKTD8rt+VmGsvSYx3/SFpTVnv RGRRpb4Wug4QJrrruuK8RTZzd6wGm2Q2RqU3alN1/Yv6TVpTdV2cXtos9oLVdXqV5fvZNxQcar9p Qhabke+6fkTalZpZLzM/xTwMQCgNu36nzkRPM9+apCxV1Py6JUuDlBhP1fUTGa5Ie6S6rmQe1Zi9 gHVdnsf9UhQgquvqIMbud11/auj3zWKu7VCLuXFKymvsNwUIlUHXi7fM2QztMXOBlAKrrldlSJDP jE/X9R3p921S3+Kqrp9fXFT1B4BS0LouhbzPmkGzFIlGo+b3Xd/xZLga77roZmQ7eShrl/p+lSMS xy66DhAqer/pXcvWeS76Y/uGaLfKYlMfFpMtJMmIxXm6rpMjo/c6QksfLFZd76oWRW8lLxO6nkil TmgmHlr8a/YWzcB9x6/Hssz24/GuC/ug/c6WsRRVp6OK9GU7jfOSAEJmjYdKfsBWdSBsVjaHMxWl LCvdKbq+ssm+Mmsn0iJhczDPS7op8S9d0Qzc23X1ycobv05vKc199hGJlTiuIwAQTqOuW03ynWUH 247uOhW4r2Uxt+/tuojmuK+grw+zzVrLCF7X6Q1PpGetZ+D+rps5Wbk2Rl13I+0G++JNUsxCiX1W DNf9AgiVA9dnxdsnJmk3F34OytWdK9eNk693UGNmr7MsQ4EoJQ8Y67psdUnJyGpVJ6WTZpE7plvX fUJkJCzZrKQMWZU7nRN1ZBjres51WzQrDk9WmvlOgGQsFntIQxnZTOrbRURdp1dtnBJFVwt7nTwN RZ68PX97ZOI6vQBgbvW2TBoXuent6n8VP9CU1puP12lMtLdlUDCZcZ4oQQAAC6bquu7FEomkxWwH 6rum/5VihSc4IACARVN01TnriUS1rI6BXEjHWf6pcpIAABZOr8xD3QCdUP9PbfBPvSEAgAVUfNZg pXwW1Bnyv2Zc80+0CABgMRVXnYv23pOFnFvvW7H4B5UMAQDAvGra/L0HBAAA82uVv9MmAACYZ9v8 jdsVAgCAebac43HHBAAA8223zCMOAQDAvKs3eMB7SAAAMPf2uK9xRAAAMP+MQ9buCAAAFkHGY5+1 RAAAsBAe15g5+5kAAGBBnDHzPgEAwMLocnpRr1oJABBKSzl8ZxwAwELBPlMAAAAAAAAAAAAA+Mre /fWkDYZRAH96SQsFdNJNEAUEZ1H3h2oUtQO2TOcydHGYLXi5yy3Z13q+5U6hrODmFm86rOeX2PM+ 5TUhXpyLUioRERERERERERERERERERERERERERERERERERERERERERERERERERERERERERERJdRm bsQIRxtrmYUzdvgCEVFC2a7rppBF13UQBkYTmUMKOK5bR6TDXQXXLfxhl/unXfHb0pGDbGdN4BnW pkyr48zz8QtzWey5wWAwRGaQKeSTwaCH6GN0kdeDwSKiiNEXIqJbfFHVFvJKNYtoYHyC7IadmFc9 QVxjbCOXVJcR5xjPkI+RBhKxjlhEriFXVRckblGvw8rhvex1S1WPJHqDTdXXiEuMF+O/fhXRx/hW iIgeVK+r7rHXieiBSlivV0t7i0+zqrphiLO2tmbINANnHPY6ESVbwnp9SSC9Onq7jUwmYwj0j7qD YwEDZ6yoNs0MpGTE3h90y1/u3vbsdSKaN0nsdTlT1c+T6zD2iQZe1H+7DtNBdiSQKm9pIL9Tl7th rxPRvElkr++p6uKk19/p2MvZXh/vWk4LFBd0IluTGBU9zyuy14novvX6zvb2J4lB1OvfVLUV9nof x0oni2NmttfdimqzJmAHtb7ypnOaR24UJD49VfXY60R033q9o7orcQh7vX60q7plh73+dVSd1unp aW+m142XOF5KYIDVcg0LNzjXkb9hrxPRvEtYr+ez2YoCii/s9R6OO/bv9zke4vBYAgZ+Y7sggfSy 6gqWt2OvE9G8i6HXL7vdZxKHLZ04eCaTXi8GZ5vveqnZXr/Iq67iHLQx/hAIK/SDxMY8Pz832etE JPes12ODBl9RyL9qTz1HoNfUwKfSTK9nUfaWjFyHtRlwsX4qd8L7YYhoviSs1xeuwmKOel0a602F g9Z0r2/g5zrq9UzU69hxB+x1Ipo3Cev1JaeiutKa7nXYXFzF+urmdZj891/XYcpT12EeyR2w14lo 3iSt16WkqttO1Ov7pVJbJFVV3Zj53PRzsM+68bmpHXxu6sj/4lYqlbfIMnITuVGpPEaUMA6R7yuV JUQN4yMhIrpFIfxmzLHnXSDSGC1kDWkgW553jnAw5pBDz2sjTIwuso8UQPQRLtJEtj1vKPGKel3W FWH86vUF1aYjBnp9dabXpYPj8ubMfY7OFVYdISK6z9KWZdnIgmU5CAOjicwhBVzLKoa7UkhnvCsV 7qqHuxB1hDm9K1IMdsUg7PU0Klyj+2Ge47jdWcXx6Wyvp5cRL4zoe0nrL/LIbFHiUyuXy41ozGH8 jmwhbeRRuVxC9DG6yA/l8hmiiPFYiIgexv3rSwh/V/WgN+n13IaOZc3ZXpdaE7kjUFjQiWpD/o33 rxPRHEtgr8uRqm5ZYa+LtaSBN67c6HX0JZzNPPera8pfsdeJaO4lqdfbmYwvYGSgET2n9xjP6R1G z+mNXhhicYEE2xt0yyVT4tWqVqvtaHQwPkIeIk3kQrXaRexj9JEn1ep7RAPjRyEiukXO930T2fD9 PiKFsYB0kQYSYSHq4a7aeJeNsRjukmhXEZlG9n2/JhHL9/nvOImIiIiIiIiIiIh+sgcHAgAAAABA /q+NoKqqqqqqqqqqqqqqqqqqqqqqqqqqqqqqqqqqqqqqqqqqqqqqqqqqqqqqqqqqqqqqqqqqqqqq qqqqqqoq7NpbbxJRFIbhNZfDeWBaKHYqAy1UTlIOBkqtSBWhRiyRNjb10ktN/Fvfv3QWe+OAlhpP YzTruSFfyyRNSd4As4UQQgghhBBCCCGEEEIIIYQQv089k2mTb5TJnJOvncnUSQgh7nTYaByT722j 8Yp80UZjj3zhRqOR9qfhzcfkSzUaj0j8Egv4RL4j4Ih8l0CFhBDiTh3ghHxXwEvy7QFV8kUBvPan CeCcfEngjIR0XQjxg6Tr/zHDAi7XX4/x+uthGSSEEHcwvup6c73rh+vvD1vrXY992/UJiZ9n7NQA dM4e6N3Nw7NV0LPQdADEhySEEJsY/TkAaxDSu52Fp1nUs3DFHcm39UzsVwDU+noan2p8cSam9y5H qDcOU+DaSTaeZOwE3Wrk/TpEP+jUu6hFgTqEkjSItR01a2Vi5ZqaTpuEEOI7HXm23pF5eq0jHVU3 IwnlkhY+QDnSWe+pWTqgoM2wVB3SbR4CeEA/6ALAGwpSuQP0slUAr4jFAcTnAPaJ7XPi8wDy8lWM EOKujuQrql+6IyWOeeZLR1z+Wdbg+QqAlXUAK82z4ABO3gLQ5WmUOEIugIcUtBm+cKL/cNdTAN7T 9hx4znO6KLp5BdSIVYFshA4BFEgIITZ25C2la8DZSkeawHzZkfuRRROLPF8ClSJ1l+8mTwA8onCV r/HcAKhTJAnkKWjc9av9J1sWgPhv63p5Z2cn2IBystNEF7Y95Nle/IepYNu26c0QgDpRwptlEkKI WzUAbBNFdUc42deqI4Y3H6iOHHgzTZ4scN97eGfbpzzrAEJELdvu8nwEoE302rbfUtBm+p11Og7g MS0YhYub9K1dT5xGpzFatX18XKQl8zQaVM1Du7u7RfKN1u9D5wBMyFcB8iESQog79AHY/jwFMFg/ cpeN+PsKsIr+3NMx1aIAMvSNaDSASqque1LLDxPpeg2e7LnpjbZrAXDdRfG7zxwAlcmU2I7rbhWP egDiM2LGicujS0QfXde9pj9pCmBE6yF3MlPSYjUA46hB2hGA/CxGQgixEYe8Uy+SFuGkvTxeDTmy 1+ZqyGujg9WQW0/DpCUqAJ7f3HI8fkB/mN/1XQAp73FYhZYtegvKR6LQBFrnfHk+v7p6O3iAhd4s iO/Xddd9L8CSKVPNFFh8b1vNU4tn1Qu/EEJsMgHbeqU7MgLLn9xT87HFs/ahoMtd4mmdRUk54tlr zgw1L8Gy/cRf7PpE3cUdOvBULXhK6ZWuG2N4HBfMVl33dKrwOFOiYwA9Xm7kb3TdzDhg+bDa5xUw t6VmtATWOSEhhNjAHPTAsmW1+xWwmk53aw7W0e0J38fCwCAWmaiLk9u0sGeBzW/+StcPo93UFYBK iNIVAJkwGRf8B4/pQW4A4DgXoU8A7rdMMq/jgFVWXe/tRKi4pQ7yNABEF0+7CaDrsVwud4/WFOou PEk9Dy7jPCv6Web7LbAWCSHEJtNMFZ4tPbcPSzyrBzo8qSTYBSndlw7PSz1z+1WeYz3TjRLPWoh8 r3O5Mv1pM/geqoP1e8RiSQ76l/umkSqQTxAru8AH1fX6YveAsXrilIxEImHqrgfOtC1191drcdn7 fvibAJ6QEEJsFjvnjuRIM9oc55Ef5mdrpzK29wHMaSnS7wAokmYM5wDeU5DWu940ieZA3PDvINS/ dH0I4DCnnAFx1fULYiUgS3QNoPJiaK6cXw/eGwApf4Yd4IU/zTxQIiGE+Mze3fWkEUQBGD57ucuH ixVF6EKBWFREoQoRQa2utogBJI2kRi97iQl/a/5lz9k5SKZgTZoI1pznxgwLBmLyspmZdf9mxdwW kze3xUQL5qbwUzy8be6pqQEyQjo3ZteT6xZAStGpOCtg6p+6PlKmcND1LpBM8CmtiiI7e84Cun7s +/4RT7u3AVwcBnnf0V+sQ98f8h+gBEIIMcs9huORt9dxR4K8x/R1Sru+fwaook/QP+Bhh9dHQwAR HJ6AXmnsAKzhsI9Dy6PrlOaJuz7qhVwLSIinYca5zjx1vaxM20HXQ0C+6G8vK51VJBleQNd5hoXe 1IHeZ1pw9MajMr1DvbS7mqVpMyGEmOWRZ1i4I3YV0xbWHdkEgAulqnndkQscbuqAW3F82ALYVzrg Z3oG2/Gwhbae6mjCnPWNAkfrk4kju6hUhbuu9/uUlib0+foakAF1nUQ7cYXW5991q0ATSbe0HL3j 4tjHYS69G+O5ojb+zO4FCyBpEEKIWSyaDK80/XFHrnCYvN0tBh3hCpaDjtzyWX010VzmhdJols4u m5f0pDDvesyMggidwJyZXQfsciw02QG+zl03LrxiZteDBdMoQKSOH20OXV8tl8v3MHHoKZbmtV02 AGQvK1baAiGEmOm8bnQktGN2JGN2JKGYdwyoX1esAShfVOz0j9vs3cGU1+16B4eZVUARfFPFNe66 npXxHoC0W61We6rrjhec3lsY1MtF7F//qEteT1j6eE4FLlJA3Gs9LHwCIYR4Ro1Lzh3pLelhXHdk Y2B0xBp6isT6nM+ijtDQAnJcUIGBu7DrkpgVD2YsfnSuPP7WGXf9qEozHd/uPrQUBv/zVNcp/CpR 8+lli+g6bLQ9pQZ5YHaNFq0jMHZDc2MPNgghxLNSDepIF1i0Tx3Zh7F9mkz/ZQPr0vU9Zylga00c XueBhTslpXIYoUV3HVJJ9SRh/N+vjqfGYucw3fU7xQrOHLoewjt31OT+pkKIsf/j/qa5paU9eE1m 15nzlfudXQGj63CTU1ruCGZ0HUaeznoX/qHrct9qIcRb8B7uW93D9cceGPLpQTJzteJA4ACfEIWA dZiI55a/12wgETzgAPlZLjcAdYfx3KBBj4X4t75Mui6EeEveQ9ffky3XtWEi7LphmLBdV/bCCCFe 4JodccyORM2O0D5A64UXi9/swYEAAAAAAJD/ayOoqqqqqqqqqqqqqqqqqqqwd7c9SYVxHMf/PAQ8 GFhSaiBpSEI3RDrIIiwM03mzWS2XL8Fe2O9ddt0gViujJay17+eBF+eMc/TRd+yS/Q8A/FZ8mNEV 0mHKwdVy37/HHc1YkAovfyf+CfEXAQD+TlXSI7vCJ0kv7WpxMO+IRuMS5zXGA7dTcaD7C7dkDQBA 1wEAdB0A/lf/QNdteXl5na4DwPV2/XmSFFNLtfMXR+4g1Sqdl04zl11Pn/U+7j9qp+zCzGv3jqUZ yyZJd8yuV+eebG/5J+Elybw5K1vnpWPzkiRZoesAcL1dr0ilBXmrqaP4or530fW5WXmj52enSw15 79s1qTBW14+eKti5kZc2zdKrHTn9IvswADCprncUvato6MWw6x0NbZyYk+mPjgtjdr2d11BhI3T9 tqJyiq4DwGS67pR7T+/Ky78arPll3nfdK9feboczh2b2Ss5CbzAr76ddLyTB6bDrh3V/bXO1GfO+ aesdqdG7J+mUrgPApLpecutnX95K1Szn630w7Podc3I9hedvt9zSaJtzkP9V10di13f9lYtmNr8f u/5a0oktNnd3z+g6AEyo642UOW8k1cw59C9i13sWpMpSZ952JLUt+DRe17NuKafNS5dD14/9XTN8 zxEAbIJdv2VeTVISCuybHNPdtegg7Js0pLJFqbWxun4zfDqPTkLXM+/Dbs/mDF0HgIl1fd+8t6OO 16VB7HrOomVJbzMxw9HOL7rezwYvY9dL3yQ7G7puSUXewwO6DgCT6vrOqOsrP3Q9Y1FX0t6DeEX0 aqzvw9Tcsm5RNXbdio8a8jbpOgBMvesti/Yktf35/mgfZqyuz/nrvtuH8WYOCpLKdB0Apt71fiqG eFbauOE/o3e+WHCmsbpevbxHKv7f9NnSUuIOClKergPA1Luud/fdcfGpwpm23xdvmfOsMl7Xre/W N4tmlllV6PqutFENXV+j6wAw/a6r3ux9zPvVb5M35SwMBgvSmF3v+mvzzd7+xZ76lqTKoOx/OV0H gGl3vb6goXzLnBuFP54jsPnDHIHcPUVri3QdAKbd9YcPep3Y5K4F6Sd1ebPJ2HO/un15ndVMnPtV 3I13rPI9RwC4VrkkSapxTu+heevuxIx5x+FUMUmem2X9kN1lG8m8Lm2XWuk4p9f/TNI24o6OLEiH EbzRyt6Tx3PZyzm9R1vbH56b598Ub5IzAAAAAAAAAAAAAAAAAAAAAAAAAAAAAAAAAAAAAAAAAAAA AAAAAAAAAAAAAPjKHhwIAAAAAAD5vzaCqqqqqqqqqqqqqqqqqqqqqqqqqqqqqqqqqqqqqqoKe3Ag AAAAAADk/9oIqqqqqqqqqqqqqqqqqqoq7NhbU9pAGAbgL5cJhwCCtdBAjRARATkEJmqRSlE8jFZH 2yljL72sM/6t9192N5sYULTa6gh1n4uYZLObL2T3ZUSSJEmSJEmSJEmSJEmSZlpX1xP0CAVd1zdJ kqSpdaJz6X43G6KHfdH1+pOHbtJDwuyKa/orm6xrIkyCqesDItrR9UOiDmtxaALR7Nu4eXCLntkF G9immZMAKvQIGQBFmiamzpipejVCT1bX9X2a4GW+4bbcShN7+Z5CzyuqB97RHUN2+itJb4UNX2uT HtQH0vQUDoAePUQDsE1/pYaRdIkDDRFMOaIIgDZNkBp7gCZ8xiY9JzH0kGbO7Oa6Ad+ORk+UBlI0 wct8ElfwpTL0rMIIhOiOSwAdkt4KG4Efs5brcetfc11IEslcf3SuR5PJ5BZNEwM3urOS6+grRDLX pZdhA9ir5XfOAZSjM5br6I7lei+Z/PBArjuseTx8v/sPHpa5Pp7r85EPJ/M0quT0OiqNCzmORVPA APRa9UsOTHPqcz2xsG+KSp+TWqvVdgDU2d+YzPW3zgZwQETRVJDC4Y2281EhIRaLKUrEicZSgBmL kcJOqMSpvIlI48fzTrupEaM12441muuhuWI2GaKRHlyU7fm5XvpwZGco8NVpRzQxrruNksoKWpqU 67CDXHev1cZz/ZiXJQYRzePhu8sr6QcpHL314Cp/HPudOGS8Ji3Ytex20689yscvDUOxHoAjfkdu iZVQIArzEoKiVkRR3la5ajvH9NqCXHdS6wDWUzZxR8BqqA6mnFVG0iz0HUx/iV6dAewRUwSQJ5fC ZtFGmAT24YdJuWj3jumG2nxfex9RRnP9nc1etniP/jYcufVmLHZNxhtRswBssx2/t1Ma7308bHeU O7l+7VVa9KesP7+iQb+h6He3LqHQ5AuCr6cVGtEb+99TvRj2vGGU2AGAZky9Z4X595D+FyLXvTnx nhhrEAdTyWrEqAAuc0jXICghAJ+IawOIEKWBb1UDQPxa0apu37Tt5/pZ3gB3uETMmejBbAMIu7k+ 2OEZYgwyXjhuLoOJ/wrngCwR29aSFXfQjdu5vgyY6v2/w6i7YqiqxhqKk36H2fXL/DT64EWNGIVX X+Nn1uuWGByOWGYGsBrjl8yZYIzGFXmpktg1cAqhyK9I6mBanwtdYMEt6kB3i1pY6QNrRA2genoO xmzSawpyPTqAr6qIXG8tQhgEuV46h2uxRK8ryHW15YW0lq2AiQ8s4g6BfHsZjO6QMFeBOL7JdScB 92WHakBKvM3MQhzM8pxCwmkajLE//xnYJxOubtAbexbvR5QF0p0cmMXdSbm+BKBKxIfoE7cCdzqs AYmrNJjKHAkn/XUwjeNtYJm4Tt0Ak+v8BMr35Xopv+refq3g3k5Ijqywbb7CvhHxdbbVEF/kEZL+ Dze5HvFm3FEcHtPycr2MP+R6GcJaCsL6pReYZXjKkYm5HjALxMwn4GmYfq5XILSat3L9rCVKmZzr md/snVlT6kgYhr9cIigERdaIIArK4ool4oKiuJVbDVrH0stz6VTN33r/5aT766RBo8OpmXPUM/1c KIR0p7+k++nQaZIEFInMe16/gdwQPenA56TX9ZbrYSKh6y4J7gA8iw0cQdGaUV6vtTDo9bFVKDIJ 9vq8nyaeZ6/rrTg50mx3u905+nVor1vHcLGjVSj3XEJQjUqZHPpeLwlr1Nn1v5iIu3NuA7xuVaVU 6SoKhf3AXtc7+Q+5YgcKx2avWyko6vue18t+NveLssM7hiK6Nux1q+GnPva8XrXBHAR4/RuAXrDX a02/Agn+aoGprSmvtx0wdudtrx/WoCjPDnk9OdTC2OsJG0zrc10PN/x7r58IUbrqbclGXXYARLPs dfyT14FmsQamXhRJ7Wn2OmDfn6w1AdQW3vK6nZFpS6LlxGUNzvQhYK8LomVZQ61hr18fANXkG14P JQayes/rHQBPbjQDgZez7HXAKRbgckEUqgP2mDBAFHDCRJG8DJcL32avC7TXrQspxIwsvPS6dcSF 4iXK6/AMUo+Qj8hlm34d2utTADKiC91NyDKw12cmaOwEwLHv9T6QmbASLJtfSwzAcoDX/+C+N1wX iuoXbQDOuvS63skFoehl+f7suAyAvX7AtZg7L/Y6J8pU4bIqql6Xa6vMZtjrK4Op2eu6LbT2hr1+ PHl31gTq04Fe1+mcK3U0dM5lr5t1ohnW/xteX2+KZNGo+Fdf0l4fbmHsdVXR5TbRI8PvwIYwau7y Lg7AnqfpKmCfTxDNV1pASXk9/hiKheNANBymQK/fZ4lu5ZjFlEXTQl7nyuurwrtL91z9A71+HCPK OUA1RLQDoP5gEc0mBrwenXUXlP202utjfeDkDa+3ARQ2LaLro2Cvq8DFhppZytYAu+cGHhOBd5TX j5JEORtw5rmhPxHnf6ZCWLsWCzJAM8wr2OkkhW9F/OGYdHN1KkS0cKG8PgmgdusuuVob8Hr/kWhO 2OLwE3jdKgP9LAkiGdmjXaqAaaIGRH2vl4F8hD6AQK/nc7e9M4fPTe4BlJaIrM06UA6x1+vbRAtF XmHOAexvlhhJs9nisy3AESOP06lBr69duVH3bK5RW1BVJHzGXk/uAWiEp+naAZzKokytvd68tGh+ FcBB0HyYzBW94XV706LsGu/k+RrQWvZzLvMSlJJEY3fNN70+Vgecv8QQeropWp4VTgM4DI/pFraX GPB66zlLlOwAsM0g+2/BBjTPrMsHkswAzjSPw2T1fJhgr4e9E99j0oOHWxBndCSYECstBXqdJ+Gs ykysOmBfcYq89vqfRGyX3guvs/2CvV4G7GsShOLBXtc0uBlv6sCT0uvVeXJp8EaW1FnhCc8siNlA nKPL1v0sKno+jCx7i8O1VtnrUaC5y0uOtNc3yCXH8XpsxOPxa/qlsNeFqzrjTAqwJ+SevyVVBWq+ 14Xc6qkbi349Y+7O6QXPc8yEpDs7JNlrAZfs9Zx3LWWFj+gTSSbZ4h0+FREcaK8fhViXvORe97xd 4XV9Bbmk6+ay9vqKdzHmPsjr1ZVQsNe5FoT5TKite7AGe32Ha5Lg2xte52TnOsArbz7McAtjr/M/ SUq+NPwGDHj9dELWs3qO+SbbRIhHId73epkEPQDfSVCVdXJLtx4p4G+BXj8mryLuSqc0tHfZ66rq XgGovPC6LFTeCvL6la7+NP4PXr+PyMALDxz495aIw4LXIC9Vez4Wvpc+P1IRNXLMKhBlE+wNeH26 padTz8niLGjj0K7v9ablNeQGfSTs9ScMMyfj3yDBPtD0bRbuQ19U/Fi018tX7MZ2jikCx+x12QVP 83hfFCgSY0Wls+tAVMUxVvW9vkfMGuAsjjXFgWeWWkNe7+vUkRp7XZ2O8NeaIK8Dp1aw12dJUJCl WAXsRZLMN4GyLIsdIybzltcTgL2Zk/xhA2nP60MtbMP3ej9EEq7bht8Az+uFI9E+LQdDrEivp/7J 63nf3VskiAJr7PUFEnCqyoDXn32vp/y0G/QgDcqEHM/rURIkARy88vpVEzgP8vqWdCtj2e94vZA4 Dwh8WXq9S/68HuKMe3SuyljBMBNySdL3Opv7nBR9ICU/eCLGqnpeL7BOWDkfCHt9EsM80qXvqA7g aJtlO7b6mvehaK9XM8vTxBYfICOXVLlSyY7VcnhXezElVEVUnHpeL5BiB8DVHGuQyQx6PTJ46FZ9 r8+RIA8Uh71eiSWv23UAt8FeD5OgCOTVX0Vcer08oN7nt7xexxAl3+sPALZ0C1NePyHFkdiE4TdA eH0mOUbMGIZJyZbQeOn1GRJ8972e0J5/4fUwMUnZSWz6Z34p3+sHfo3ckAYZ1zJWXs9z0QK8zlW7 kA3w+h+DP/yovuH1ih945FXglt9Yb7gJykjjsp1a/I1jiGnp9eyA18fZ4kxU5Hk4OIZe97weJUnr c3hdlLEf1yzRpVSCoDTgdUG2XQTQ+vDfJjnAUThmEbOGIfrS632/JpzQxKCHU0CCptmqjD8fpk+K cwB7s4PddHzQ69nBqnnse33JazbRV/NhuFJ1pLfj3EC01+eJ/MocHbA4z4cpABekqLzldRtDHPte vwRwo1sYe32oU6qT4TfAmw+jDWifai5fez3pL+iN4PUtYvhcN+cZkrqBXt+Q9ZJZwLDXI8FeX+wD qQCvi7+TxITfnQ/D1IYD/0aWfwq37ZX6XLzw8m0DyJxqrFdev5IRMBFH5PYIoE3MNF543fkor1vh cFiUO8pXRR0+nppgr8fcVBaLaJM+FD0fhjkBkDj1SUmvl7XXpRszA4ZOkOVI+TFRz+tOVrsfySUA z1qJA1635LVJRdH3epJtHOx1i0d1Mt6nc9rrsQGvD043KsvXmYHz//1Ar3MIzqmmrbzOzf27bmHK 63FieNDI8Bvwwuv7QGuONK+9PgavEp+M4PVVfRaDPSnbO14j0OvzDhC3SHIwmtfpCXBar72+2NRZ rYzg9eMXgQd5fawGVIFChFxmX87cfuV1qwBEQyTpydwiNpBRhZr5PF6vAdEIXau9eAZgRRZyKh6P L7/l9Ut2CP+o+IMI9vo37j01r7y+L2ub5Iavicb1TJB1sNf19ZxpsYOk9Opjflenvc7D2UveCcwo XmepXshGZcsqchvkdX4/rnMuE5X0RKmwHex1vZKGvc69tm5hyuutR5X+w6/xGH6G1/ltRlbIuXw0 mom98jpPNBEGvLJH8DqWLWGOO8jESQDFRa7FAV7nodGUrOdbzZG8zo0Kr7zObbcks1q3R/D6+lDg xfkgr1MD0K09DrTOpRdXotHoziuv82necYRcdmuc2wmAjizUePXTeJ1WAUSPC+rCSViUtViZbK8B aM6+5fWFFlCb6ZXlLNEPItjrsQJQXZd15ozv2Tzsda5tdemy6z5bvCd0nJSyjGqvO0/k/cCtwo5d XZSp6sNenwSQ59TFkbw+v5HhvZ1SX/8i+SCv8/zL6IKslmXpddb7lYzzCG95fc9PtpRwd8GS8ro6 1g2LW5jyup/hbt3cROZ3QXtdn1jbnfZ5yZYj4gFeTwGoLZ83qhjB69IQlQx4SIZno8+cn7Xe8Pps U6ywPLlzCozq9WsnyOvc7ZTdrFZbGMHrdDYY+DIFen2uxT+5kuyJFfOVyRkRVD0Z4PWlmvjkebK9 74BzW5CFOphMX7TwvtcP3ea4R7+GGwdMPybjrcGjeUtveZ1OoDigX80Yd6TBXucC435mclmoMB96 6XWWLZz9du+sCbb4hLB5tXTe69jQXgcSd5ONAoD+Ik9nRaFx3uZUA14PFXXqf/K6pqB+u9fqnFei CPY6dWW1PO/xPS7KyszNs/a5LFew17mRNrvp81QVXK3Y6y9bGHtdZtjj6f9nZPgdeOn1yBF8utYr r7OtmFG83ofHsjSeA0Ww1+m7v0K1MKLXqRHodbr1s7ILI3h9Yg0+Z6Fgr9M9BuT7YMOjtk0BXqcN 2xdknXN7aEJh1wO8/kG/S8rxIa3vkmThHkxxnN72emQfkpJFv5rg35tqZlrwiIYpwOvZIjzKXH3n 6vDoe17X1GT821UoWv0Brw+nLo/q9eoGtypNkNcXM4PlKg6Xvf+m10P78FmNaK+/bGHsdU1+kQy/ A8rrGqtShaS6Y1GQ1+mRZW3/Ncp8mLjKrE2SS5sNsvyG12kjCkn5MT+q12P1QK/TupfVdnwEr5M1 4wV+Z9ErrweNws/GwSTmKNDrtJsBx7u1r3K7KULSHz/6PF6n7M5F/GInRh57lf34WikXIsFVOp1m R22k022iCff9towzdZRIjVjIX+p1OoyC6WYpyOsU67L67fMVVX3Da9BLlNd3qpDE1TG/zivNb3aG vU5L9yp1rzKa1539K6KBGwZ18sFep7ETVdJJnkFJFFNLnIPLN71OVrugSrQSIu31wRa2m/e8nkmp HDtjZPgtCLuNdJaGmP/eWTvqTk5z/XA/XyfBH+n0d5Isnh8nVith0b7FyF06rUYp5HvBVDq9yVlb 1lbq/uislyTF0sx+Yr+9KD4LUcj9yz3BgvsqTILQQ+r0qDsVoct0+pHoKZ1+IoFel2Xrvs0Sc5OW 26PbdPqSaMl9N8dJcqnVo7OpiMhkmz8eDnzvReCXnXs/cPID1xkuOMAqDfDnihvN840uUsTLeoEk 1kbjInHci1HOy806TK0mzibHxP50E26m06olttPpDWLUzjQ/6Q6E6wLvdH/XPdAQ1pa73/cr1yR5 SKcnSdJLp7dIciUq4l9LtO1VX3oUB/OOl6heOts+Tlw01sln/dnNtp2lLZlPRPVwOnVYpf7T/YQd yQfYI5kW9C7HY35JD0tHa6ltupUh3ch2IdC19ari5jwTtvpAR1WOu/3ExcqVqCQ9YvxWdE2KsdvS qdvylmigcw5oYTwf5mrFjWvmE9xy2WD45aQAmFuZ/j8QXv/wC8K0OzU1dUOSP/hk/L+GvW4w/G/J 2mZ67/+Gz+H1PXlHsXmi0GUVqMVIYrxuMPxnzMiBdsP/gs/hdfoLLk65WB18ALHxusHwXzHBd301 /C/4JF6ntg2FPUkK43WD4b8iNj4+bq4s/V8Iu0f7U3Ti4UYfLvVSmH4Ke+Pje2QwGAyGX0lydjb5 8XdDNhgMBoPBYDAYDAaDwWAwGAwGg8FgMBgMBoPBYPh4xJOQ5ukdxtwVQvQ+/GAkH/fd9PBzlt6H V1p0/5kZHQbDV+Bq1mUha9GPEnLTJeljmJu8m7wmybRbjDF/KtnsBBFduwH5RVwizbX7zhLxXoUH 55xl3SWR1zKbnb0mhc7/l4tt4Z+ef/NthAcp8K0JffghWPrh/u+hb4u5AyBMBoPh81MHU278oKSX AMzQR5C8gCBxRS5tfR+vA/UA+SZwz2oeduI1cEsTYJrF0paS9CSAPXpJB7A/wc8XjdcNBsOPe92j vvs1vD4dBVOb/TGvN1CboAloio/G68brBsPvRx0+5fkv4fUzuNhwyVg/4vVQQbyZwADNTeN1lEYa XzdeNxi+DnWgOL5xO1MA0P4KXs86QH2Pnzu89yNe3wRm2euJ8cPLnbUWAFsYMRSLxSx6ScRd+om8 vpXLhSe+Nzor2+QG8XBQep6a1l6P9PbjiZOnCb2XLg86z9/naS6XGx/R67t/pUoVN/fDXG5Jvq+U Dg7lfsnlcrPG6wbD16GubgX3CGCNJLM7qc5Bbowke7ncLm01uo2nCBGNL3dKf11rr1ubZ/nM6k5Y 2/DQXeNujuZdF4QWciKxRL9MTjW6qcksG0f+tb51+KO9v0qdgy2LNnK5BaL1XG6ObpZPUr0lGmBc PbjsDsD3H/H6PfLEXj8mwZ9RdcofdssWy7p/bnRZZ0Xgh8SR7qxm4p1Da8Dru3elzsqW0uh2LndN e5VOyXvC0s/wegFYiUJwHJIlB+wZz+vtPiTlLXUUnm0ICn9UgPhIXn/MQ3I/bQObRBNnEOTDZhzG YPhyeF6nPhCVck1AUmhb5HICXJxCEJ1LHkGyn1VeT8UhsVe8S5B1CFqpbeHAK6Ea/kRk8UREY6km BLUn3zj5fSkSmlUbzi9EgTZREXhe5ezvSPPIllGM7vVwC+e+13lJAcCWGoeZKADViPcEVDz44zDW jA1JvON5/UY5sP/de/xl5wQC55mj/Sle91mtQlFhr2taU+Qyn4fCyY/o9T+aUGSa8nCceG9DxusG w1fD87pV4wcJbdrwOLbY6x7RDBRxi72O4XWpBI+MdOAagBupUIfve571s2hlPOO0IEWiH/xfLiiv a3rkE2sCTnvih71egR0b8joLvaO8TsveEzdiNtC3fK93oGGvnzvwSLHXNcvE/Byvrz3v2xDUOo0M gGbS8/pR+3KmKJbsqU4UiUaD9R7o9XxOMqW8vieyLZwcdAsQbMrN1mUGm8brBsNXQ3ndElrrEm03 hZRTy2dVlhR7PXNQKkPQPF5eFR5+8rwevds8X4XLHRGl4VJsLCv5ZOmBtcFi2VEKbK0dHMQHjQMn v00LVaGr7orckPZ68TlVBp9Je6Sk2BrX2usHU5LT97xulXFCL7w+ZgNRz+th74HWwnUz5Hm9B5eL 8z8qZc/rhy1R9NTBsc3lZK+XG42iMi39HK/zxq5tAP0lIqsL4Bt7nU/TrRRk5FvCydvkclgN9rpG HaAjACdjYpd02es5AA8U63a7xusGw5ejDtRT3dMCXLbIygDOJbnEVgFnQXidT8bHhIqdDSK6BHCm vN4JkUuuCVSzlK0CzqQlhJpnB1ploBYi+b8aI2mL/i65bNS0cfrXapbLRYyIQgcDXu+6iccSANbJ J5aAJLHHXte85/UNYFx7XZEHHM/rdAE4SXZcM+l5fbEANHMy4THHFCkD9ha5TMdF2Oz1tQhRaJ+H /H+W12s8MKY6UZoDUGGvp0hiJYBWkvb1V5jNUbzOG4lbnEdcen0bwNm0medoMHxJ6vA5JVoXrtCP jFtmjUgT3wI4IkEUiLPXi5aeRzdF5zpxsiocyB8ccrbPJNWJ7SHjcEqieQcoTpDk2Pe6k/VWPSdN 5KAKQfPyB7x+hqj1yuurACY8r2/wZpdaQJc8rz+xRWXKqIhJLpkkSdaWKdbUdqUMV4j5CV4/4n3t WTvUAkrs9WtibqWTq0CcFNGRvD4pz86ZB5GH7L3gHE3OG68bDF+PutZ6jIeoz1JMFMiz1yPk8uhL 6x7os9fTxGRbQIfOAGeemBR7fbopLCo/EUqoAomXxmErbQ24e9f3epQEe8qtmuxOUYr9ejSvs4Lv 6P3zdUsEzPra9r1eGogpLWM6AdBJMWXgQnrdJkGSBfizvH5Bgh6AWRJUgRP2+oT+RS16Y5yCOXvD 6/cxyQJ7vTKg7LD0Ou32Iaj2jNcNhi9HHajGE6vd5XXWwBAF6fUmeV/7d7zz6QJ7fWsgl1VKSBEz 39nrIrkdy9py5IZibxmH3fpITKjleT3vm6ZCLxjPCL+y17diksY7Xm/DWaJ3x9c5qyvKABnyvb4K 9EmxIWM6whAZ6fW6n3fp53n92Pf63AuvxwZ6xMkhr1+MMB+GP18iZo69TvMVNvt343WD4avB1009 uhiiKsVc9dt7m43se32TFDVgf8jr58rrfwL41lNjOe8YZ0quwsTgef2I5RPkdUraQDlwPkyVE3KR D0iSYZO9PR9GmMwGlq+EGrXX94GqRUwuyOtF6XUVt/NBXt8amBy0QTX9rcjqj+T1KTlcxjz5x9U6 PAWQMV43GL4aw15fEaZL+0y+63UtaSHDZ+rKAXHGn+udB9YySjRDxqkPGWdjYBxm/V2v53K5DRLE gVqg1/tCRt5494x3Ipt75fWlwfnrappmeRmoRbTXGwD+JAG/zsrIGmmf28/g9XiIBLEyYI/Rsb7O PImRvB7WeVhF6fXNqakcX0O2jdcNhr/bO7/npIEgjm8eQ1CaAE2xRX6LFlARcWxrqVbpIAwgU+yM g4++OuO/9f0v9W4vQFKkfahTcPbzxBxhc/vyyc2R2902wl6fAThb1PWu3OD12hPSdLUgU9rufHGb vc7aCVaDy8bph4zDWyIx0qTXej1hdrxt1vcKr18BR6Vg4JvZ7m/YUa//rPJ504XXOwBczoG9zs+b tMU5uTqnA7ZcUNb82SZ4HYNDdanHlm4BqOsl92Xtdl6nXhBjtwvt9SaQHZOVAxLidUHYNsJe17sM ZSXkfEK7er3XUVVKrZQBJCyKFQC8iClBFhF4PV4Af6vQxrm0iKyhGzGOiuGVVLT3WOt19XXTIecz gJcrvM7mKx5bsZMs4O7oSdTxgRiuD/Mt+TQNAO1ZqO6XB/AzwXjdLF97jpr7lHOyHqksVdhjNXK6 EV5HO931sgAKvnl8ojoYTIFben1UUzG8broN9nofQG1QVKmK1wVh24h4/YnSsJtr5gAWyXqvA4lm 2gWA4M12uJ+aRWj257ZFcrkWY6N31bhmHF9L6BFHW+f1sVaPchjquyu9Hq9q0y2d/xwGKozWc5xQ yOsTft1z4XVzUCvrNRPznE5d5TyPs9yjDfB63YOhrveMYq9gcD/dzuv0ugbDK11HwM6BSeyI1wVh 24h4nTpVBJw9vMnrTRiOLkjx9QiGATvQiKkQJybeg6EWNU6nAYPXWOd1GmbBuG9ppddpVJinYJud nTSt8HrxmMJet9UczkNep0s3mlOrgICytQleb8Sft6G4KpHGyvAUc51b1/0qnUHR/mBz3a/KZyh6 vrznKAhbR9TrVDGnfqYpi27yev77lAX5mphWDorGZDb3+kHIytaFWaqPrxnHf88r8b1YYq3Xg7Jb Xof+4nXyu1lTuiyYeirq9aPqxwP7Wr+kl0DVCnudxr1oTv4euz7xhugfe53bDXJzP5bqPnf7mw9V 8vnRn9E3774OnaWfPeg/7p9aqndfiTv42TRHdT4kjbXUKdC/fPdrsq/D6s0rJ/W4PyYFX7SrgwiC sPkcOo4fVcmXZCY1M3rbdxyHR/98iAVDh9zy2Fb+yPzI04LS95N+y9ZXc4Q04Pq0wPqZzCTz+k9H P9JReef84mSyS+TrO/k8M77TDi0zGmZSWjncTZk1RxU9I8Z/c9J/EAR+gVqMAhyNb63s/PyQ2zjP E2cOJ5GcKN5KZoYdYnii8wYUgiAI/zfHAMp0r1hTlEkQBEG4G84AjOheOQdmJAiCINwJT7j67b1y 8PIxCYIgCHfDHoAHJAiC8O/5DVt0fqEfQ279AAAAAElFTkSuQmCC "
         id="image4198"
         x="-1610.7893"
         y="-43.98774" />
      <g
         transform="translate(29.388955,-105.92317)"
         id="g4680">
        <rect
           style="opacity:1;fill:#0066d2;fill-opacity:1;fill-rule:nonzero;stroke:none;stroke-width:5;stroke-miterlimit:4;stroke-dasharray:none;stroke-dashoffset:0;stroke-opacity:1;filter:url(#filter4565)"
           id="rect4201"
           width="1245.7142"
           height="62.857143"
           x="-1509.9281"
           y="143.58669"
           ry="8.427371" />
        <text
           xml:space="preserve"
           style="font-style:normal;font-weight:normal;font-size:40px;line-height:125%;font-family:Sans;letter-spacing:0px;word-spacing:0px;fill:#ffffff;fill-opacity:1;stroke:none;stroke-width:1px;stroke-linecap:butt;stroke-linejoin:miter;stroke-opacity:1"
           x="-1460.042"
           y="182.23615"
           id="text4577"
           sodipodi:linespacing="125%"><tspan
             sodipodi:role="line"
             id="tspan4579"
             x="-1460.042"
             y="182.23615"
             style="font-style:normal;font-variant:normal;font-weight:bold;font-stretch:normal;font-size:27.5px;font-family:'URW Gothic L';-inkscape-font-specification:'URW Gothic L';fill:#ffffff">Retail equity based crowdfunding</tspan></text>
        <text
           sodipodi:linespacing="125%"
           id="text4581"
           y="182.23615"
           x="-668.04199"
           style="font-style:normal;font-weight:normal;font-size:40px;line-height:125%;font-family:Sans;letter-spacing:0px;word-spacing:0px;fill:#ffffff;fill-opacity:1;stroke:none;stroke-width:1px;stroke-linecap:butt;stroke-linejoin:miter;stroke-opacity:1"
           xml:space="preserve"><tspan
             style="font-style:normal;font-variant:normal;font-weight:bold;font-stretch:normal;font-size:27.5px;font-family:'URW Gothic L';-inkscape-font-specification:'URW Gothic L';fill:#ffffff"
             y="182.23615"
             x="-668.04199"
             id="tspan4583"
             sodipodi:role="line">Peer To Peer Lending</tspan></text>
        <path
           sodipodi:type="star"
           style="opacity:1;fill:#ffffff;fill-opacity:1;fill-rule:nonzero;stroke:none;stroke-width:5;stroke-miterlimit:4;stroke-dasharray:none;stroke-dashoffset:0;stroke-opacity:1;filter:url(#filter4613)"
           id="path4604"
           sodipodi:sides="6"
           sodipodi:cx="-1228.2894"
           sodipodi:cy="-72.691818"
           sodipodi:r1="281.75821"
           sodipodi:r2="244.00977"
           sodipodi:arg1="0.74837805"
           sodipodi:arg2="1.2719768"
           inkscape:flatsided="true"
           inkscape:rounded="0"
           inkscape:randomized="0"
           d="m -1021.8188,119.03087 -269.2721,82.94742 -206.4705,-191.722681 62.8014,-274.670109 269.272,-82.94743 206.47058,191.72268 z"
           transform="matrix(0.25909514,0.07429007,-0.07924798,0.24288568,-577.65803,279.55403)" />
        <text
           sodipodi:linespacing="125%"
           id="text4664"
           y="186.23615"
           x="-918.8667"
           style="font-style:normal;font-weight:normal;font-size:40px;line-height:125%;font-family:Sans;letter-spacing:0px;word-spacing:0px;fill:#ffffff;fill-opacity:1;stroke:none;stroke-width:1px;stroke-linecap:butt;stroke-linejoin:miter;stroke-opacity:1"
           xml:space="preserve"><tspan
             style="font-style:normal;font-variant:normal;font-weight:bold;font-stretch:normal;font-size:43.75px;font-family:'URW Gothic L';-inkscape-font-specification:'URW Gothic L Semi-Bold';fill:#000080"
             y="186.23615"
             x="-918.8667"
             id="tspan4666"
             sodipodi:role="line">VS</tspan></text>
      </g>
    </g>
    <g
       id="g4251"
       inkscape:export-xdpi="80"
       inkscape:export-ydpi="80">
      <rect
         ry="0"
         y="793.83392"
         x="-1786.2026"
         height="726.48737"
         width="1722.4907"
         id="rect4232"
         style="opacity:1;fill:#000080;fill-opacity:1;fill-rule:nonzero;stroke:none;stroke-width:5;stroke-miterlimit:4;stroke-dasharray:none;stroke-dashoffset:0;stroke-opacity:1" />
      <rect
         style="opacity:1;fill:#ffffff;fill-opacity:1;fill-rule:nonzero;stroke:none;stroke-width:5;stroke-miterlimit:4;stroke-dasharray:none;stroke-dashoffset:0;stroke-opacity:1"
         id="rect4174"
         width="597.26001"
         height="81.63205"
         x="-1658.3037"
         y="890.76074"
         ry="40.816025" />
      <text
         xml:space="preserve"
         style="font-style:normal;font-weight:normal;font-size:40px;line-height:125%;font-family:Sans;letter-spacing:0px;word-spacing:0px;fill:#000080;fill-opacity:1;stroke:none;stroke-width:1px;stroke-linecap:butt;stroke-linejoin:miter;stroke-opacity:1"
         x="-1625.7682"
         y="942.18518"
         id="text4176"
         sodipodi:linespacing="125%"><tspan
           sodipodi:role="line"
           id="tspan4178"
           x="-1625.7682"
           y="942.18518"
           style="font-style:normal;font-variant:normal;font-weight:bold;font-stretch:normal;font-size:32.5px;font-family:'URW Gothic L';-inkscape-font-specification:'URW Gothic L';fill:#000080">Retail equity based crowdfunding</tspan></text>
      <path
         sodipodi:type="star"
         style="opacity:1;fill:#ffffff;fill-opacity:1;fill-rule:nonzero;stroke:none;stroke-width:5;stroke-miterlimit:4;stroke-dasharray:none;stroke-dashoffset:0;stroke-opacity:1"
         id="path4184"
         sodipodi:sides="6"
         sodipodi:cx="-1228.2894"
         sodipodi:cy="-72.691818"
         sodipodi:r1="281.75821"
         sodipodi:r2="244.00977"
         sodipodi:arg1="0.74837805"
         sodipodi:arg2="1.2719768"
         inkscape:flatsided="true"
         inkscape:rounded="0"
         inkscape:randomized="0"
         d="m -1021.8188,119.03087 -269.2721,82.94742 -206.4705,-191.722681 62.8014,-274.670109 269.272,-82.94743 206.47058,191.72268 z"
         transform="matrix(0.25909514,0.07429007,-0.07924798,0.24288568,-613.38421,1039.5031)" />
      <text
         sodipodi:linespacing="125%"
         id="text4186"
         y="946.18518"
         x="-954.59283"
         style="font-style:normal;font-weight:normal;font-size:40px;line-height:125%;font-family:Sans;letter-spacing:0px;word-spacing:0px;fill:#ffffff;fill-opacity:1;stroke:none;stroke-width:1px;stroke-linecap:butt;stroke-linejoin:miter;stroke-opacity:1"
         xml:space="preserve"><tspan
           style="font-style:normal;font-variant:normal;font-weight:bold;font-stretch:normal;font-size:43.75px;font-family:'URW Gothic L';-inkscape-font-specification:'URW Gothic L Semi-Bold';fill:#000080"
           y="946.18518"
           x="-954.59283"
           id="tspan4188"
           sodipodi:role="line">VS</tspan></text>
      <text
         sodipodi:linespacing="125%"
         id="text4200"
         y="1064.9629"
         x="-1380.2374"
         style="font-style:normal;font-weight:normal;font-size:40px;line-height:125%;font-family:Sans;letter-spacing:0px;word-spacing:0px;fill:#ffffff;fill-opacity:1;stroke:none;stroke-width:1px;stroke-linecap:butt;stroke-linejoin:miter;stroke-opacity:1"
         xml:space="preserve"><tspan
           style="font-style:normal;font-variant:normal;font-weight:bold;font-stretch:normal;font-size:31.25px;font-family:'URW Gothic L';-inkscape-font-specification:'URW Gothic L';text-align:center;text-anchor:middle;fill:#ffffff"
           y="1064.9629"
           x="-1380.2374"
           id="tspan4202"
           sodipodi:role="line">Invest di Koperasi/UMKM - Imbal Hasil</tspan><tspan
           style="font-style:normal;font-variant:normal;font-weight:bold;font-stretch:normal;font-size:31.25px;font-family:'URW Gothic L';-inkscape-font-specification:'URW Gothic L';text-align:center;text-anchor:middle;fill:#ffffff"
           id="tspan4206"
           y="1104.0254"
           x="-1380.2374"
           sodipodi:role="line" /><tspan
           style="font-style:normal;font-variant:normal;font-weight:bold;font-stretch:normal;font-size:31.25px;font-family:'URW Gothic L';-inkscape-font-specification:'URW Gothic L';text-align:center;text-anchor:middle;fill:#ffffff"
           id="tspan4204"
           y="1143.0879"
           x="-1380.2374"
           sodipodi:role="line">Bagi Hasil</tspan><tspan
           style="font-style:normal;font-variant:normal;font-weight:bold;font-stretch:normal;font-size:31.25px;font-family:'URW Gothic L';-inkscape-font-specification:'URW Gothic L';text-align:center;text-anchor:middle;fill:#ffffff"
           id="tspan4208"
           y="1182.1504"
           x="-1380.2374"
           sodipodi:role="line" /><tspan
           style="font-style:normal;font-variant:normal;font-weight:bold;font-stretch:normal;font-size:31.25px;font-family:'URW Gothic L';-inkscape-font-specification:'URW Gothic L';text-align:center;text-anchor:middle;fill:#ffffff"
           id="tspan4210"
           y="1221.2129"
           x="-1380.2374"
           sodipodi:role="line">!! !! !! !! !! !!</tspan><tspan
           style="font-style:normal;font-variant:normal;font-weight:bold;font-stretch:normal;font-size:31.25px;font-family:'URW Gothic L';-inkscape-font-specification:'URW Gothic L';text-align:center;text-anchor:middle;fill:#ffffff"
           id="tspan4212"
           y="1260.2754"
           x="-1380.2374"
           sodipodi:role="line" /><tspan
           style="font-style:normal;font-variant:normal;font-weight:bold;font-stretch:normal;font-size:31.25px;font-family:'URW Gothic L';-inkscape-font-specification:'URW Gothic L';text-align:center;text-anchor:middle;fill:#ffffff"
           id="tspan4214"
           y="1299.3379"
           x="-1380.2374"
           sodipodi:role="line">$$$$$$</tspan><tspan
           style="font-style:normal;font-variant:normal;font-weight:bold;font-stretch:normal;font-size:31.25px;font-family:'URW Gothic L';-inkscape-font-specification:'URW Gothic L';text-align:center;text-anchor:middle;fill:#ffffff"
           id="tspan4216"
           y="1338.4004"
           x="-1380.2374"
           sodipodi:role="line" /><tspan
           style="font-style:normal;font-variant:normal;font-weight:bold;font-stretch:normal;font-size:31.25px;font-family:'URW Gothic L';-inkscape-font-specification:'URW Gothic L';text-align:center;text-anchor:middle;fill:#ffffff"
           id="tspan4218"
           y="1377.4629"
           x="-1380.2374"
           sodipodi:role="line">Pertumbuhan nilai penyertaan</tspan><tspan
           style="font-style:normal;font-variant:normal;font-weight:bold;font-stretch:normal;font-size:31.25px;font-family:'URW Gothic L';-inkscape-font-specification:'URW Gothic L';text-align:center;text-anchor:middle;fill:#ffffff"
           id="tspan4220"
           y="1416.5254"
           x="-1380.2374"
           sodipodi:role="line">Pembayaran SHU/Dividen</tspan></text>
      <g
         transform="matrix(1,0,0,1.1615882,0,32.28799)"
         id="g4504">
        <rect
           style="opacity:1;fill:#ffffff;fill-opacity:1;fill-rule:nonzero;stroke:none;stroke-width:5;stroke-miterlimit:4;stroke-dasharray:none;stroke-dashoffset:0;stroke-opacity:1"
           id="rect4230"
           width="18.961584"
           height="117.70634"
           x="-936.49158"
           y="845.89154"
           ry="0" />
        <path
           sodipodi:type="star"
           style="opacity:1;fill:#ffffff;fill-opacity:1;fill-rule:nonzero;stroke:none;stroke-width:5;stroke-miterlimit:4;stroke-dasharray:none;stroke-dashoffset:0;stroke-opacity:1"
           id="path4386"
           sodipodi:sides="3"
           sodipodi:cx="-889.08759"
           sodipodi:cy="938.59271"
           sodipodi:r1="91.471924"
           sodipodi:r2="79.21701"
           sodipodi:arg1="0.67114384"
           sodipodi:arg2="1.7183414"
           inkscape:flatsided="true"
           inkscape:rounded="0"
           inkscape:randomized="0"
           d="m -817.45493,995.47747 -156.71263,-23.29144 98.52729,-124.0714 z"
           transform="matrix(0.17412932,0.13107108,-0.22169304,0.10295009,-564.27803,981.26525)" />
      </g>
      <text
         xml:space="preserve"
         style="font-style:normal;font-weight:normal;font-size:40px;line-height:125%;font-family:Sans;letter-spacing:0px;word-spacing:0px;fill:#ffffff;fill-opacity:1;stroke:none;stroke-width:1px;stroke-linecap:butt;stroke-linejoin:miter;stroke-opacity:1"
         x="-516.23743"
         y="1064.9629"
         id="text4396"
         sodipodi:linespacing="125%"><tspan
           sodipodi:role="line"
           id="tspan4398"
           x="-516.23743"
           y="1064.9629"
           style="font-style:normal;font-variant:normal;font-weight:bold;font-stretch:normal;font-size:31.25px;font-family:'URW Gothic L';-inkscape-font-specification:'URW Gothic L';text-align:center;text-anchor:middle;fill:#ffffff">Penyaluran Pinjaman - Bunga</tspan><tspan
           sodipodi:role="line"
           x="-516.23743"
           y="1104.0254"
           id="tspan4400"
           style="font-style:normal;font-variant:normal;font-weight:bold;font-stretch:normal;font-size:31.25px;font-family:'URW Gothic L';-inkscape-font-specification:'URW Gothic L';text-align:center;text-anchor:middle;fill:#ffffff" /><tspan
           sodipodi:role="line"
           x="-516.23743"
           y="1143.0879"
           id="tspan4402"
           style="font-style:normal;font-variant:normal;font-weight:bold;font-stretch:normal;font-size:31.25px;font-family:'URW Gothic L';-inkscape-font-specification:'URW Gothic L';text-align:center;text-anchor:middle;fill:#ffffff">Riba</tspan><tspan
           sodipodi:role="line"
           x="-516.23743"
           y="1182.1504"
           id="tspan4404"
           style="font-style:normal;font-variant:normal;font-weight:bold;font-stretch:normal;font-size:31.25px;font-family:'URW Gothic L';-inkscape-font-specification:'URW Gothic L';text-align:center;text-anchor:middle;fill:#ffffff" /><tspan
           sodipodi:role="line"
           x="-516.23743"
           y="1221.2129"
           id="tspan4406"
           style="font-style:normal;font-variant:normal;font-weight:bold;font-stretch:normal;font-size:31.25px;font-family:'URW Gothic L';-inkscape-font-specification:'URW Gothic L';text-align:center;text-anchor:middle;fill:#ffffff">!! !! !!</tspan><tspan
           sodipodi:role="line"
           x="-516.23743"
           y="1260.2754"
           id="tspan4408"
           style="font-style:normal;font-variant:normal;font-weight:bold;font-stretch:normal;font-size:31.25px;font-family:'URW Gothic L';-inkscape-font-specification:'URW Gothic L';text-align:center;text-anchor:middle;fill:#ffffff" /><tspan
           sodipodi:role="line"
           x="-516.23743"
           y="1299.3379"
           id="tspan4410"
           style="font-style:normal;font-variant:normal;font-weight:bold;font-stretch:normal;font-size:31.25px;font-family:'URW Gothic L';-inkscape-font-specification:'URW Gothic L';text-align:center;text-anchor:middle;fill:#ffffff">$$$</tspan><tspan
           sodipodi:role="line"
           x="-516.23743"
           y="1338.4004"
           id="tspan4412"
           style="font-style:normal;font-variant:normal;font-weight:bold;font-stretch:normal;font-size:31.25px;font-family:'URW Gothic L';-inkscape-font-specification:'URW Gothic L';text-align:center;text-anchor:middle;fill:#ffffff" /><tspan
           sodipodi:role="line"
           x="-516.23743"
           y="1377.4629"
           id="tspan4416"
           style="font-style:normal;font-variant:normal;font-weight:bold;font-stretch:normal;font-size:31.25px;font-family:'URW Gothic L';-inkscape-font-specification:'URW Gothic L';text-align:center;text-anchor:middle;fill:#ffffff">Pendapatan bunga tetap</tspan></text>
      <text
         sodipodi:linespacing="125%"
         id="text4420"
         y="1220.9629"
         x="-928.23743"
         style="font-style:normal;font-weight:normal;font-size:40px;line-height:125%;font-family:Sans;letter-spacing:0px;word-spacing:0px;fill:#ffffff;fill-opacity:1;stroke:none;stroke-width:1px;stroke-linecap:butt;stroke-linejoin:miter;stroke-opacity:1"
         xml:space="preserve"><tspan
           style="font-style:normal;font-variant:normal;font-weight:bold;font-stretch:normal;font-size:31.25px;font-family:'URW Gothic L';-inkscape-font-specification:'URW Gothic L';text-align:center;text-anchor:middle;fill:#ffffff"
           id="tspan4438"
           y="1220.9629"
           x="-928.23743"
           sodipodi:role="line">Risiko</tspan><tspan
           id="tspan4484"
           style="font-style:normal;font-variant:normal;font-weight:bold;font-stretch:normal;font-size:31.25px;font-family:'URW Gothic L';-inkscape-font-specification:'URW Gothic L';text-align:center;text-anchor:middle;fill:#ffffff"
           y="1260.0254"
           x="-928.23743"
           sodipodi:role="line" /><tspan
           id="tspan4488"
           style="font-style:normal;font-variant:normal;font-weight:bold;font-stretch:normal;font-size:31.25px;font-family:'URW Gothic L';-inkscape-font-specification:'URW Gothic L';text-align:center;text-anchor:middle;fill:#ffffff"
           y="1299.0879"
           x="-928.23743"
           sodipodi:role="line">Potensi Imbal Hasil</tspan><tspan
           id="tspan4490"
           style="font-style:normal;font-variant:normal;font-weight:bold;font-stretch:normal;font-size:31.25px;font-family:'URW Gothic L';-inkscape-font-specification:'URW Gothic L';text-align:center;text-anchor:middle;fill:#ffffff"
           y="1338.1504"
           x="-928.23743"
           sodipodi:role="line" /><tspan
           id="tspan4494"
           style="font-style:normal;font-variant:normal;font-weight:bold;font-stretch:normal;font-size:31.25px;font-family:'URW Gothic L';-inkscape-font-specification:'URW Gothic L';text-align:center;text-anchor:middle;fill:#ffffff"
           y="1377.2129"
           x="-928.23743"
           sodipodi:role="line">Jenis Imbal Hasil</tspan></text>
      <rect
         ry="40.816025"
         y="890.76074"
         x="-795.69128"
         height="81.63205"
         width="594.91315"
         id="rect4510"
         style="opacity:1;fill:#ffffff;fill-opacity:1;fill-rule:nonzero;stroke:none;stroke-width:5;stroke-miterlimit:4;stroke-dasharray:none;stroke-dashoffset:0;stroke-opacity:1" />
      <text
         sodipodi:linespacing="125%"
         id="text4180"
         y="942.18518"
         x="-723.76813"
         style="font-style:normal;font-weight:normal;font-size:40px;line-height:125%;font-family:Sans;letter-spacing:0px;word-spacing:0px;fill:#000080;fill-opacity:1;stroke:none;stroke-width:1px;stroke-linecap:butt;stroke-linejoin:miter;stroke-opacity:1"
         xml:space="preserve"><tspan
           style="font-style:normal;font-variant:normal;font-weight:bold;font-stretch:normal;font-size:32.5px;font-family:'URW Gothic L';-inkscape-font-specification:'URW Gothic L';fill:#000080"
           y="942.18518"
           x="-723.76813"
           id="tspan4182"
           sodipodi:role="line">Peer To Peer (P2P) Lending</tspan></text>
    </g>
  </g>
</svg>
