{
    "swagger": "2.0",
    "info": {
        "title": "Ensiklopedi API",
        "termsOfService": "http://swagger.io/terms/",
        "contact": {
            "name": "API Support"
        },
        "license": {
            "name": "Apache 2.0",
            "url": "http://www.apache.org/licenses/LICENSE-2.0.html"
        },
        "version": "1.0"
    },
    "host": "localhost:8080",
    "basePath": "/",
    "paths": {
        "/api/v1/book/": {
            "get": {
                "description": "Get a book detail with the input id",
                "consumes": [
                    "application/json"
                ],
                "produces": [
                    "application/json"
                ],
                "tags": [
                    "book"
                ],
                "summary": "Get a new book by id",
                "parameters": [
                    {
                        "description": "get book",
                        "name": "book_info",
                        "in": "body",
                        "required": true,
                        "schema": {
                            "$ref": "#/definitions/dto.BookDTO"
                        }
                    }
                ],
                "responses": {
                    "200": {
                        "description": "OK",
                        "schema": {
                            "$ref": "#/definitions/dto.BookDTO"
                        }
                    }
                }
            }
        },
        "/api/v1/user/": {
            "post": {
                "description": "Create a new user with the input paylod",
                "consumes": [
                    "application/json"
                ],
                "produces": [
                    "application/json"
                ],
                "tags": [
                    "user"
                ],
                "summary": "Create a new user",
                "parameters": [
                    {
                        "description": "create user",
                        "name": "user_info",
                        "in": "body",
                        "required": true,
                        "schema": {
                            "$ref": "#/definitions/dto.CreateUserRequestDTO"
                        }
                    }
                ],
                "responses": {
                    "200": {
                        "description": "OK",
                        "schema": {
                            "$ref": "#/definitions/dto.UserDTO"
                        }
                    }
                }
            }
        },
        "/api/v1/user/login": {
            "post": {
                "consumes": [
                    "application/json"
                ],
                "produces": [
                    "application/json"
                ],
                "tags": [
                    "user"
                ],
                "summary": "Login",
                "parameters": [
                    {
                        "description": "user login info",
                        "name": "login_info",
                        "in": "body",
                        "required": true,
                        "schema": {
                            "$ref": "#/definitions/dto.LoginRequest"
                        }
                    }
                ],
                "responses": {
                    "200": {
                        "description": "OK",
                        "schema": {
                            "$ref": "#/definitions/dto.LoginResponse"
                        }
                    }
                }
            }
        }
    },
    "definitions": {
        "dto.BookDTO": {
            "type": "object",
            "properties": {
                "author": {
                    "type": "string"
                },
                "category": {
                    "type": "array",
                    "items": {
                        "type": "string"
                    }
                },
                "content": {
                    "type": "string"
                },
                "cover": {
                    "type": "string"
                },
                "description": {
                    "type": "string"
                },
                "id": {
                    "type": "integer"
                },
                "price": {
                    "type": "integer"
                },
                "title": {
                    "type": "string"
                }
            }
        },
        "dto.CreateUserRequestDTO": {
            "type": "object",
            "required": [
                "confirmation",
                "email",
                "name",
                "password"
            ],
            "properties": {
                "confirmation": {
                    "type": "string",
                    "minLength": 8
                },
                "email": {
                    "type": "string"
                },
                "name": {
                    "type": "string"
                },
                "password": {
                    "type": "string",
                    "minLength": 8
                }
            }
        },
        "dto.LoginRequest": {
            "type": "object",
            "required": [
                "email",
                "password"
            ],
            "properties": {
                "email": {
                    "type": "string"
                },
                "password": {
                    "type": "string",
                    "minLength": 8
                }
            }
        },
        "dto.LoginResponse": {
            "type": "object",
            "properties": {
                "token": {
                    "type": "string"
                },
                "user": {
                    "$ref": "#/definitions/dto.UserDTO"
                }
            }
        },
        "dto.UserDTO": {
            "type": "object",
            "properties": {
                "balance": {
                    "type": "number"
                },
                "email": {
                    "type": "string"
                },
                "id": {
                    "type": "integer"
                },
                "isAdmin": {
                    "type": "boolean"
                },
                "name": {
                    "type": "string"
                }
            }
        }
    }
}