
./octez-client --protocol ProxfordLcjScHFgpTURyTjcKR88D5juu1jGgT18pPUoGTVgxiA --mode mockup --no-base-dir-warnings run script michelson_test_scripts/opcodes/dip.tz on storage '(Pair 0 0)' and input '(Pair 15 9)' --level 1 --trace-stack
storage
  (Pair 15 24)
emitted operations
  
big_map diff
  
trace
  - location: 11 (just consumed gas: 7.912)
    [ (Pair (Pair 15 9) 0 0) ]
  - location: 11 (just consumed gas: 0.010)
    [ (Pair 15 9) ]
  - location: 12 (just consumed gas: 0.010)
    [ 15
      9 ]
  - location: 13 (just consumed gas: 0.010)
    [ 15
      15
      9 ]
  - location: 14 (just consumed gas: 0)
    [ 15
      9 ]
  - location: 16 (just consumed gas: 0.035)
    [ 24 ]
  - location: 14 (just consumed gas: 0.025)
    [ 15
      24 ]
  - location: 17 (just consumed gas: 0.010)
    [ (Pair 15 24) ]
  - location: 18 (just consumed gas: 0.010)
    [ {}
      (Pair 15 24) ]
  - location: 20 (just consumed gas: 0.010)
    [ (Pair {} 15 24) ]

