
./octez-client --protocol ProxfordLcjScHFgpTURyTjcKR88D5juu1jGgT18pPUoGTVgxiA --mode mockup --no-base-dir-warnings run script michelson_test_scripts/opcodes/left_right.tz on storage '(Left "X")' and input '(Left True)' --level 1 --trace-stack
storage
  (Right True)
emitted operations
  
big_map diff
  
trace
  - location: 11 (just consumed gas: 7.244)
    [ (Pair (Left True) (Left "X")) ]
  - location: 11 (just consumed gas: 0.010)
    [ (Left True) ]
  - location: 12 (just consumed gas: 0)
    [ True ]
  - location: 14 (just consumed gas: 0.010)
    [ (Right True) ]
  - location: 12 (just consumed gas: 0.015)
    [ (Right True) ]
  - location: 19 (just consumed gas: 0.010)
    [ {}
      (Right True) ]
  - location: 21 (just consumed gas: 0.010)
    [ (Pair {} (Right True)) ]

