
./octez-client --protocol ProxfordLcjScHFgpTURyTjcKR88D5juu1jGgT18pPUoGTVgxiA --mode mockup --no-base-dir-warnings run script michelson_test_scripts/opcodes/set_cdr.tz on storage '(Pair "hello" 0)' and input 1 --level 1 --trace-stack
storage
  (Pair "hello" 1)
emitted operations
  
big_map diff
  
trace
  - location: 9 (just consumed gas: 10.357)
    [ (Pair 1 "hello" 0) ]
  - location: 9 (just consumed gas: 0.010)
    [ (Pair 1 "hello" 0)
      (Pair 1 "hello" 0) ]
  - location: 10 (just consumed gas: 0.010)
    [ (Pair "hello" 0)
      (Pair 1 "hello" 0) ]
  - location: 11 (just consumed gas: 0)
    [ (Pair 1 "hello" 0) ]
  - location: 13 (just consumed gas: 0.010)
    [ 1 ]
  - location: 11 (just consumed gas: 0.025)
    [ (Pair "hello" 0)
      1 ]
  - location: 15 (just consumed gas: 0.010)
    [ (Pair "hello" 0)
      (Pair "hello" 0)
      1 ]
  - location: 16 (just consumed gas: 0.010)
    [ 0
      (Pair "hello" 0)
      1 ]
  - location: 17 (just consumed gas: 0.010)
    [ (Pair "hello" 0)
      1 ]
  - location: 18 (just consumed gas: 0.010)
    [ "hello"
      1 ]
  - location: 19 (just consumed gas: 0.010)
    [ (Pair "hello" 1) ]
  - location: 20 (just consumed gas: 0.010)
    [ {}
      (Pair "hello" 1) ]
  - location: 22 (just consumed gas: 0.010)
    [ (Pair {} "hello" 1) ]

