[
    [ { "payload" : "Pair (Pair 0x119811f34ef4491014fbc3c969c426d37067d6a4 (Pair 0x013629df3a46f68006b1a8067285528fc0de6f818700 (Pair Unit 50000000))) 1",
        "sender" : "KT1DXADSWXucAJ6PujZeUSK9brpToFtC9fz6" } ]
]
