
./octez-client --protocol ProxfordLcjScHFgpTURyTjcKR88D5juu1jGgT18pPUoGTVgxiA --mode mockup --no-base-dir-warnings run script michelson_test_scripts/opcodes/slice_bytes.tz on storage 'Some 0xaabbcc' and input 'Pair 1 1' --level 1 --trace-stack
storage
  (Some 0xbb)
emitted operations
  
big_map diff
  
trace
  - location: 10 (just consumed gas: 9.298)
    [ (Pair (Pair 1 1) (Some 0xaabbcc)) ]
  - location: 10 (just consumed gas: 0.010)
    [ (Pair 1 1)
      (Some 0xaabbcc) ]
  - location: 11 (just consumed gas: 0.010)
    [ (Some 0xaabbcc)
      (Pair 1 1) ]
  - location: 13 (just consumed gas: 0)
    [ 0xaabbcc
      (Pair 1 1) ]
  - location: 19 (just consumed gas: 0.010)
    [ (Pair 1 1)
      0xaabbcc ]
  - location: 20 (just consumed gas: 0.010)
    [ 1
      1
      0xaabbcc ]
  - location: 21 (just consumed gas: 0.026)
    [ (Some 0xbb) ]
  - location: 13 (just consumed gas: 0.015)
    [ (Some 0xbb) ]
  - location: 22 (just consumed gas: 0.010)
    [ {}
      (Some 0xbb) ]
  - location: 24 (just consumed gas: 0.010)
    [ (Pair {} (Some 0xbb)) ]

