Daniel,12th Privet drive,London,Somewhere,Nowhere,1234565,12,2018,Daniel
Carlos,15th MonteCarlo,Buenos Aires,Wichita,7899456,08,2019,Carlos
Henry,Calle 1,Panama,Panama,1254879,06,2017,Henry
Daniela,Calle 2,Venecia,Italy,457812,01,2020,Daniela
Andres,Calle 3,Maracaibo,Zulia,458796,07,2019,Andres
Rosa,Calle 4,Medellin,Antioquia,457812,07,2019,Rosa
Carla,Calle 5,Medellin,Antioquia,1234586,07,2019,Carla
Andrea,Calle 6,Medellin,Antioquia,124587,07,2019,Andrea
Jose,Calle 7,Medellin,Antioquia,1248588,07,2019,Jose
Juan,Calle 8,Medellin,Antioquia,1481846,07,2019,Juan