<svg xmlns="http://www.w3.org/2000/svg" width="172" height="172" viewBox="0 0 172 172">
    <defs>
        <style>
            .prefix__cls-1,.prefix__cls-4{fill:none}.prefix__cls-1,.prefix__cls-2{stroke:#eaeaec;stroke-linecap:round;stroke-miterlimit:10;stroke-width:2px}.prefix__cls-2{fill:#fff;stroke:#53575b}
        </style>
    </defs>
    <g id="prefix__Group_10988" data-name="Group 10988" transform="translate(6004.445 -2673.624)">
        <path id="prefix__Line_250" d="M54.059 54.059L0 0" class="prefix__cls-1" data-name="Line 250" transform="translate(-5985.101 2749.012)"/>
        <path id="prefix__Line_251" d="M0 0L67.572 67.572" class="prefix__cls-1" data-name="Line 251" transform="translate(-5972.992 2723.571)"/>
        <path id="prefix__Line_252" d="M14.654 14.654L0 0" class="prefix__cls-1" data-name="Line 252" transform="translate(-5903.913 2717.551)"/>
        <path id="prefix__Line_253" d="M29.446 29.446L0 0" class="prefix__cls-1" data-name="Line 253" transform="translate(-5884.559 2736.905)"/>
        <path id="prefix__Line_254" d="M3.925 3.925L0 0" class="prefix__cls-1" data-name="Line 254" transform="translate(-5850.36 2771.104)"/>
        <path id="prefix__Line_255" d="M14.654 14.654L0 0" class="prefix__cls-1" data-name="Line 255" transform="translate(-5940.813 2718.268)"/>
        <path id="prefix__Line_256" d="M59.949 59.949L0 0" class="prefix__cls-1" data-name="Line 256" transform="translate(-5921.395 2737.686)"/>
        <path id="prefix__Line_257" d="M0 0L6.936 6.936" class="prefix__cls-1" data-name="Line 257" transform="translate(-5895.559 2801.004)"/>
        <g id="prefix__Group_10987" data-name="Group 10987">
            <path id="prefix__Path_10273" d="M-5967 2781.308a3.083 3.083 0 0 1-3.05-2.64s-1.139-5.441-1.222-6.833c-.077-1.275-3.038-14.575 25.792-14.575 8.021 0 18.322-.476 18.322-.476s6.978-5.733 13.88-8.591c4.324-1.791 14.858-1.14 22.121-.405a32.117 32.117 0 0 1 13.454 4.534l4.891 3.258 7.539-.134a2.938 2.938 0 0 1 3.01 2.58l1.788 15.241a8.6 8.6 0 0 1-.264 2.679l-.207.591a5.877 5.877 0 0 1-4.774 3.882l-6.7.889z" class="prefix__cls-2" data-name="Path 10273"/>
            <circle id="prefix__Ellipse_193" cx="10.358" cy="10.358" r="10.358" class="prefix__cls-2" data-name="Ellipse 193" transform="translate(-5955.842 2767.564)"/>
            <circle id="prefix__Ellipse_194" cx="10.358" cy="10.358" r="10.358" class="prefix__cls-2" data-name="Ellipse 194" transform="translate(-5892.568 2767.564)"/>
            <path id="prefix__Line_258" fill="none" stroke="#53575b" stroke-linecap="round" stroke-miterlimit="10" stroke-width="2px" d="M0 0L3.021 0" data-name="Line 258" transform="translate(-5965.659 2768.902)"/>
        </g>
        <path id="prefix__Rectangle_712" d="M0 0H172V172H0z" class="prefix__cls-4" data-name="Rectangle 712" transform="translate(-6004.445 2673.624)"/>
        <path id="prefix__Rectangle_713" d="M0 0H172V107.426H0z" class="prefix__cls-4" data-name="Rectangle 713" transform="translate(-6004.445 2705.911)"/>
        <path id="prefix__Path_10274" fill="#fff" stroke="#4f78cd" stroke-linecap="round" stroke-miterlimit="10" stroke-width="2px" d="M-5861.24 2761.229l8.68 8.68a2.412 2.412 0 0 0 3.386-.23 2.411 2.411 0 0 0 .23-3.385l-8.68-8.681" data-name="Path 10274"/>
        <circle id="prefix__Ellipse_195" cx="14.845" cy="14.845" r="14.845" fill="#fff" stroke="#4f78cd" stroke-miterlimit="10" stroke-width="2px" data-name="Ellipse 195" transform="translate(-5885.629 2734.126)"/>
    </g>
</svg>
