<svg xmlns="http://www.w3.org/2000/svg" width="226" height="90" viewBox="0 0 226 90">
    <defs>
        <style>
            .prefix__cls-4,.prefix__cls-5{fill:none;stroke:#257ffc;stroke-width:2px;stroke-linecap:round;stroke-miterlimit:10}.prefix__cls-5{fill:#fff}
        </style>
    </defs>
    <g id="prefix__Group_11017" data-name="Group 11017" transform="translate(-293.5 -64.5)">
        <path id="prefix__Rectangle_760" fill="none" d="M0 0H226V90H0z" data-name="Rectangle 760" transform="translate(293.5 64.5)"/>
        <g id="prefix__Group_11016" data-name="Group 11016">
            <path id="prefix__Path_10238" fill="#d3e5fe" d="M343.289 143.863h-6.116c-1.033.042-2.461-4.721-3.172-6.753-.362-1.035 1.04-1.092 1.178-1.62.717-2.745-.242-5.5 1.374-9.108a15.681 15.681 0 0 1 4.509-6.066c5.394-4.178 26.185-5.528 31.284-5.8a4.991 4.991 0 0 0 2.141-.609l13.09-7.193a28.907 28.907 0 0 1 13.915-3.568h31.178a17.894 17.894 0 0 1 11.822 4.455l6.411 5.644 11.836 1.073a14.087 14.087 0 0 1 11.332 7.706l3.6 7.187a13.55 13.55 0 0 1-1.481 14.465l-.147.187z" data-name="Path 10238"/>
            <path id="prefix__Path_10239" fill="#b2d2fe" d="M343.066 143.863h-5.753c-1.113.045-3.416-7.274-3.416-7.274l1.269-1.745.907-7.021h20.2l54.734.158a8.772 8.772 0 0 0 8.231-5.636l1.2-3.159h12.44c3.816 0 21.106.009 29.056.151a7.936 7.936 0 0 1 5.442 2.289l2.135 2.109.691.69a10.575 10.575 0 0 0 6.831 3.066c2.427 4.848 2.563 12.11-.8 16.372H343.066z" data-name="Path 10239"/>
            <path id="prefix__Path_10240" d="M337.173 143.863c-1.033.042-2.461-4.721-3.172-6.753-.362-1.035 1.04-1.092 1.178-1.62.717-2.745-.242-5.5 1.374-9.108a15.681 15.681 0 0 1 4.509-6.066c5.394-4.178 26.185-5.528 31.284-5.8a4.991 4.991 0 0 0 2.141-.609l13.09-7.193a28.907 28.907 0 0 1 13.915-3.568h31.178a17.894 17.894 0 0 1 11.822 4.455l6.411 5.644 11.836 1.073a14.087 14.087 0 0 1 11.332 7.706l3.6 7.187a13.872 13.872 0 0 1-1.481 14.652z" class="prefix__cls-4" data-name="Path 10240"/>
            <path id="prefix__Line_232" d="M7.451 0L0 0" class="prefix__cls-5" data-name="Line 232" transform="translate(470.055 130.291)"/>
            <path id="prefix__Path_10241" d="M427.534 103.61l-11.655 30.641a5.358 5.358 0 0 1-5.013 3.443h-25.251" class="prefix__cls-4" data-name="Path 10241"/>
            <path id="prefix__Line_233" fill="none" stroke="#257ffc" stroke-linecap="round" stroke-linejoin="round" stroke-width="2px" d="M3.624 0L0 0" data-name="Line 233" transform="translate(339.67 136.46)"/>
            <path id="prefix__Path_10242" fill="none" stroke="#257ffc" stroke-linejoin="round" stroke-width="2px" d="M335.945 127.823h11.893l-4.544 8.637" data-name="Path 10242"/>
            <ellipse id="prefix__Ellipse_175" cx="13.659" cy="13.572" class="prefix__cls-5" data-name="Ellipse 175" rx="13.659" ry="13.572" transform="translate(445.219 125.355)"/>
            <ellipse id="prefix__Ellipse_176" cx="13.659" cy="13.572" class="prefix__cls-5" data-name="Ellipse 176" rx="13.659" ry="13.572" transform="translate(353.329 125.355)"/>
            <path id="prefix__Path_10243" d="M470.464 123.712l-2.13-2.116a8.308 8.308 0 0 0-5.855-2.41h-17.26" class="prefix__cls-4" data-name="Path 10243"/>
            <path id="prefix__Path_10244" d="M445.219 119.186h-58.537a3.039 3.039 0 0 0-1.625.47l-11.236 7.1" class="prefix__cls-4" data-name="Path 10244"/>
            <path id="prefix__Line_234" d="M0 0L4.967 0" class="prefix__cls-4" data-name="Line 234" transform="translate(353.329 127.823)"/>
            <path id="prefix__Line_235" d="M0 0L3.725 0" class="prefix__cls-4" data-name="Line 235" transform="translate(342.154 131.525)"/>
            <path id="prefix__Path_10245" d="M384.373 114.251s-7.45 0-12.757.281" class="prefix__cls-4" data-name="Path 10245"/>
        </g>
    </g>
</svg>
