<svg xmlns="http://www.w3.org/2000/svg" width="62" height="56" viewBox="0 0 62 56">
    <defs>
        <style>
            .prefix__cls-1{fill:#d3e5fe}.prefix__cls-1,.prefix__cls-2,.prefix__cls-6{stroke:#257ffc;stroke-linecap:round;stroke-miterlimit:10}.prefix__cls-2{fill:none}.prefix__cls-6{fill:#fff;stroke-width:1.018px}
        </style>
    </defs>
    <g id="prefix__Group_5446" data-name="Group 5446" transform="translate(-9648.725 -657.353)">
        <g id="prefix__Group_5445" data-name="Group 5445">
            <path id="prefix__Path_1093" d="M9653.191 698.37v9.992a1.009 1.009 0 0 0 1.009 1.008h7.982a1.009 1.009 0 0 0 1.009-1.008v-2.992" class="prefix__cls-1" data-name="Path 1093"/>
            <path id="prefix__Path_1094" d="M9686.826 680.615a2.351 2.351 0 1 1 3.327 0" class="prefix__cls-2" data-name="Path 1094"/>
            <path id="prefix__Rectangle_754" fill="none" stroke="#257ffc" stroke-linecap="round" stroke-miterlimit="10" stroke-width="1.039px" d="M2.048 0h6.9A2.048 2.048 0 0 1 11 2.048V3H0v-.952A2.048 2.048 0 0 1 2.048 0z" data-name="Rectangle 754" transform="translate(9683.191 682.37)"/>
            <path id="prefix__Path_1095" d="M9706.191 698.37v9.992a1.009 1.009 0 0 1-1.009 1.008h-7.982a1.009 1.009 0 0 1-1.009-1.008v-2.992" class="prefix__cls-1" data-name="Path 1095"/>
            <path id="prefix__Path_1096" fill="#d3e5fe" d="M9680.165 705.334h-24.808a2.165 2.165 0 0 1-2.166-2.165v-12.248a5.587 5.587 0 0 1 5.587-5.587h41.827a5.586 5.586 0 0 1 5.586 5.587v12.248a2.165 2.165 0 0 1-2.165 2.165z" data-name="Path 1096"/>
            <path id="prefix__Path_1097" fill="#b2d2fe" d="M9706.191 703.416V691.8c.342-3.238-2.283-5.863-5.521-6.462h-1.427c3.948 3 3.948 6.563 3.948 6.563v5.01a2.426 2.426 0 0 1-2.428 2.427h-43.471c-.034 0-.067.009-.1.01v-.01a4 4 0 0 1-4-4v7.813a2.186 2.186 0 0 0 2.187 2.187h48.883a1.514 1.514 0 0 0 1.929-1.922z" data-name="Path 1097"/>
            <path id="prefix__Path_1098" d="M9680.164 705.37h-24.807a2.166 2.166 0 0 1-2.166-2.166v-12.247a5.587 5.587 0 0 1 5.587-5.587h41.827a5.586 5.586 0 0 1 5.586 5.587V703.2a2.166 2.166 0 0 1-2.165 2.166z" class="prefix__cls-2" data-name="Path 1098"/>
            <path id="prefix__Path_1099" d="M9680.22 685.37h-22.72l3.775-8.132a6.069 6.069 0 0 1 5.434-2.868h25.971a6.072 6.072 0 0 1 5.435 2.868l3.774 8.132z" class="prefix__cls-2" data-name="Path 1099"/>
            <path id="prefix__Path_1100" d="M9666.991 692.976a2.606 2.606 0 0 0-2.606-2.606h-6.521a1.672 1.672 0 0 0-1.672 1.672v5.658a1.673 1.673 0 0 0 1.672 1.672h3.328" class="prefix__cls-2" data-name="Path 1100"/>
            <path id="prefix__Rectangle_755" d="M0 0h11v2.3A1.7 1.7 0 0 1 9.3 4H2.773A2.773 2.773 0 0 1 0 1.227V0z" class="prefix__cls-6" data-name="Rectangle 755" transform="rotate(-180 4833.596 347.185)"/>
            <path id="prefix__Path_1101" fill="#fff" stroke="#257ffc" stroke-linecap="round" stroke-miterlimit="10" d="M9681.191 700.37h-8.138a1.455 1.455 0 0 1-1.411-1.807l1.273-5.092a1.455 1.455 0 0 1 1.411-1.1h10.729a1.455 1.455 0 0 1 1.411 1.1l1.273 5.092a1.455 1.455 0 0 1-1.411 1.807z" data-name="Path 1101"/>
            <path id="prefix__Path_1102" d="M9692.391 692.976a2.607 2.607 0 0 1 2.609-2.606h6.521a1.671 1.671 0 0 1 1.673 1.672v5.658a1.672 1.672 0 0 1-1.673 1.672h-3.327" class="prefix__cls-2" data-name="Path 1102"/>
            <path id="prefix__Rectangle_756" d="M2.773 0H9.3A1.7 1.7 0 0 1 11 1.7V4H0V2.773A2.773 2.773 0 0 1 2.773 0z" class="prefix__cls-6" data-name="Rectangle 756" transform="translate(9692.191 690.37)"/>
        </g>
        <path id="prefix__Rectangle_757" fill="none" d="M0 0H62V56H0z" data-name="Rectangle 757" transform="translate(9648.725 657.353)"/>
    </g>
</svg>
