# Blender MTL File: 'thirdWallPurple.blend'
# Material Count: 1

newmtl 20_-_Default.001
Ns 19.607843
Ka 1.000000 1.000000 1.000000
Kd 0.470588 0.470588 0.470588
Ks 0.000000 0.000000 0.000000
Ke 0.000000 0.000000 0.000000
Ni 1.000000
d 1.000000
illum 1
map_Kd images/thirdPurple2.png
