# Blender v2.79 (sub 6) OBJ File: ''
# www.blender.org
mtllib Colorless.mtl
o Object782_Untitled.002
v 0.795579 -3.960367 -0.176313
v 1.282147 -3.835543 -0.177088
v 1.749249 -3.650772 -0.175244
v 2.189523 -3.408967 -0.170811
v 2.596023 -3.113942 -0.163859
v 2.962338 -2.770350 -0.154496
v 0.789677 -3.940462 -0.675882
v 1.276245 -3.815638 -0.676657
v 1.743347 -3.630867 -0.674813
v 2.183621 -3.389061 -0.670380
v 2.590121 -3.094037 -0.663427
v 2.956436 -2.750444 -0.654065
v 2.596029 -1.417835 -0.596709
v 1.503712 -1.400997 -0.082701
v 1.822457 -1.323092 -0.083363
v 2.217555 -1.226526 -0.084183
v 1.456942 -1.342723 -0.580258
v 1.766736 -1.267005 -0.580901
v 2.150741 -1.173151 -0.581698
v 2.257149 -1.147143 -0.581919
v 2.343340 -1.195783 -0.084444
v 3.239371 -2.435905 -0.144443
v 3.142334 -2.281671 -0.137151
v 3.255327 -2.348116 -0.641565
v 2.744771 -1.536648 -0.603200
v 3.270164 -2.371700 -0.642680
v 2.616328 -1.445652 -0.097625
v 2.576095 -1.381705 -0.094602
v 0.717616 -3.550951 -0.159079
v 0.602649 -3.984721 -0.175004
v 0.929806 -2.750361 -0.129686
v 1.072459 -2.212122 -0.109925
v 1.177788 -1.814704 -0.095335
v 1.261065 -1.500505 -0.083799
v 1.272459 -1.457518 -0.082221
v 0.596954 -3.964789 -0.674574
v 0.711796 -3.531488 -0.658666
v 0.924011 -2.730797 -0.629270
v 1.066686 -2.192490 -0.609506
v 1.172032 -1.795022 -0.594914
v 1.255314 -1.480782 -0.583377
v 1.280476 -1.385853 -0.579892
v 0.795579 -3.960367 -0.176313
v 1.282147 -3.835543 -0.177088
v 1.749249 -3.650772 -0.175244
v 2.189523 -3.408967 -0.170811
v 2.596023 -3.113942 -0.163859
v 2.962338 -2.770350 -0.154496
v 0.789677 -3.940462 -0.675882
v 1.276245 -3.815638 -0.676657
v 1.743347 -3.630867 -0.674813
v 2.183621 -3.389061 -0.670380
v 2.590121 -3.094037 -0.663427
v 2.956436 -2.750444 -0.654065
v 2.596029 -1.417835 -0.596709
v 1.503712 -1.400997 -0.082701
v 1.822457 -1.323092 -0.083363
v 2.217555 -1.226526 -0.084183
v 1.456942 -1.342723 -0.580258
v 1.766736 -1.267005 -0.580901
v 2.150741 -1.173151 -0.581698
v 2.257149 -1.147143 -0.581919
v 2.343340 -1.195783 -0.084444
v 3.239371 -2.435905 -0.144443
v 3.142334 -2.281671 -0.137151
v 3.255327 -2.348116 -0.641565
v 2.744771 -1.536648 -0.603200
v 3.270164 -2.371700 -0.642680
v 2.616328 -1.445652 -0.097625
v 2.576095 -1.381705 -0.094602
v 0.717616 -3.550951 -0.159079
v 0.602649 -3.984721 -0.175004
v 0.929806 -2.750361 -0.129686
v 1.072459 -2.212122 -0.109925
v 1.177788 -1.814704 -0.095335
v 1.261065 -1.500505 -0.083799
v 1.272459 -1.457518 -0.082221
v 0.596954 -3.964789 -0.674574
v 0.711796 -3.531488 -0.658666
v 0.924011 -2.730797 -0.629270
v 1.066686 -2.192490 -0.609506
v 1.172032 -1.795022 -0.594914
v 1.255314 -1.480782 -0.583377
v 1.280476 -1.385853 -0.579892
v 0.297220 -4.023276 -0.172933
v 0.046075 -4.023276 -0.169965
v 0.291318 -4.003371 -0.672501
v 0.040173 -4.003371 -0.669534
v 0.047594 -0.797033 -0.041433
v 0.097290 -0.823826 -0.043088
v 0.209851 -0.884517 -0.046836
v 0.348217 -0.959120 -0.051443
v 0.528810 -1.056491 -0.057457
v 0.783906 -1.194031 -0.065951
v 1.187562 -1.411669 -0.079392
v 0.041720 -0.717875 -0.538641
v 0.087554 -0.742586 -0.540167
v 0.191371 -0.798562 -0.543624
v 0.318988 -0.867369 -0.547874
v 0.485551 -0.957175 -0.553420
v 0.720828 -1.084030 -0.561254
v 1.093125 -1.284761 -0.573651
v 0.602649 -3.984721 -0.175005
v 0.717616 -3.550950 -0.159079
v 0.929804 -2.750360 -0.129687
v 1.072457 -2.212121 -0.109926
v 1.177788 -1.814702 -0.095335
v 1.261062 -1.500505 -0.083800
v 1.280493 -1.385785 -0.579890
v 1.255314 -1.480785 -0.583378
v 0.596954 -3.964789 -0.674575
v 1.272476 -1.457452 -0.082219
v 0.711796 -3.531487 -0.658667
v 0.924014 -2.730796 -0.629270
v 1.066686 -2.192489 -0.609507
v 1.172032 -1.795023 -0.594915
v 0.297220 -4.023276 -0.172933
v 0.046075 -4.023276 -0.169965
v 0.291318 -4.003371 -0.672501
v 0.040173 -4.003371 -0.669534
v 0.047594 -0.797033 -0.041433
v 0.097290 -0.823826 -0.043088
v 0.209851 -0.884517 -0.046836
v 0.348217 -0.959120 -0.051443
v 0.528810 -1.056491 -0.057457
v 0.783906 -1.194031 -0.065951
v 1.187562 -1.411669 -0.079392
v 0.041720 -0.717875 -0.538641
v 0.087554 -0.742586 -0.540167
v 0.191371 -0.798562 -0.543624
v 0.318988 -0.867369 -0.547874
v 0.485551 -0.957175 -0.553420
v 0.720828 -1.084030 -0.561254
v 1.093125 -1.284761 -0.573651
v 0.602649 -3.984721 -0.175005
v 0.717616 -3.550950 -0.159079
v 0.929804 -2.750360 -0.129687
v 1.072457 -2.212121 -0.109926
v 1.177788 -1.814702 -0.095335
v 1.261062 -1.500505 -0.083800
v 1.280493 -1.385785 -0.579890
v 1.255314 -1.480785 -0.583378
v 0.596954 -3.964789 -0.674575
v 1.272476 -1.457452 -0.082219
v 0.711796 -3.531487 -0.658667
v 0.924014 -2.730796 -0.629270
v 1.066686 -2.192489 -0.609507
v 1.172032 -1.795023 -0.594915
v 0.047953 -0.034334 -0.011048
v 0.042051 -0.014428 -0.510616
v 2.355780 -0.947574 -0.074702
v 2.371592 -0.630582 -0.062258
v 2.386606 -0.329577 -0.050442
v 2.401333 -0.034332 -0.038852
v 2.269742 -0.895958 -0.572060
v 2.285007 -0.589973 -0.560048
v 2.299501 -0.299419 -0.548643
v 2.313716 -0.014426 -0.537455
v 1.456942 -1.342723 -0.580259
v 1.766736 -1.267005 -0.580902
v 2.150741 -1.173151 -0.581699
v 2.257210 -1.147128 -0.581920
v 1.503714 -1.400997 -0.082702
v 1.822457 -1.323093 -0.083363
v 2.217553 -1.226526 -0.084183
v 2.343398 -1.195769 -0.084445
v 0.047594 -0.797033 -0.041433
v 0.097290 -0.823827 -0.043088
v 0.783903 -1.194030 -0.065951
v 1.187562 -1.411668 -0.079392
v 0.191371 -0.798562 -0.543624
v 0.087552 -0.742586 -0.540167
v 0.318988 -0.867368 -0.547874
v 0.485551 -0.957175 -0.553420
v 1.093125 -1.284761 -0.573651
v 0.720828 -1.084030 -0.561254
v 1.280576 -1.385829 -0.579893
v 0.209851 -0.884517 -0.046836
v 0.348217 -0.959120 -0.051443
v 0.528810 -1.056491 -0.057457
v 0.041720 -0.717874 -0.538641
v 1.272556 -1.457495 -0.082222
v 0.047953 -0.034334 -0.011048
v 0.042051 -0.014428 -0.510616
v 2.355780 -0.947574 -0.074702
v 2.371592 -0.630582 -0.062258
v 2.386606 -0.329577 -0.050442
v 2.401333 -0.034332 -0.038852
v 2.269742 -0.895958 -0.572060
v 2.285007 -0.589973 -0.560048
v 2.299501 -0.299419 -0.548643
v 2.313716 -0.014426 -0.537455
v 1.456942 -1.342723 -0.580259
v 1.766736 -1.267005 -0.580902
v 2.150741 -1.173151 -0.581699
v 2.257210 -1.147128 -0.581920
v 1.503714 -1.400997 -0.082702
v 1.822457 -1.323093 -0.083363
v 2.217553 -1.226526 -0.084183
v 2.343398 -1.195769 -0.084445
v 0.047594 -0.797033 -0.041433
v 0.097290 -0.823827 -0.043088
v 0.783903 -1.194030 -0.065951
v 1.187562 -1.411668 -0.079392
v 0.191371 -0.798562 -0.543624
v 0.087552 -0.742586 -0.540167
v 0.318988 -0.867368 -0.547874
v 0.485551 -0.957175 -0.553420
v 1.093125 -1.284761 -0.573651
v 0.720828 -1.084030 -0.561254
v 1.280576 -1.385829 -0.579893
v 0.209851 -0.884517 -0.046836
v 0.348217 -0.959120 -0.051443
v 0.528810 -1.056491 -0.057457
v 0.041720 -0.717874 -0.538641
v 1.272556 -1.457495 -0.082222
v 4.047674 -0.034330 -0.058302
v 4.009997 -0.515360 -0.577455
v 4.041772 -0.014425 -0.557871
v 2.355780 -0.947574 -0.074702
v 2.371592 -0.630581 -0.062258
v 2.386606 -0.329576 -0.050442
v 2.401333 -0.034332 -0.038852
v 2.269742 -0.895958 -0.572060
v 2.285007 -0.589973 -0.560048
v 2.299501 -0.299419 -0.548643
v 2.313716 -0.014426 -0.537455
v 2.343393 -1.195828 -0.084447
v 2.596034 -1.417838 -0.596709
v 2.257208 -1.147190 -0.581922
v 3.280120 -0.863710 -0.082281
v 2.882701 -1.156085 -0.089235
v 3.768947 -0.504089 -0.073727
v 4.030064 -0.311991 -0.069158
v 3.989866 -0.620551 -0.581409
v 4.011757 -0.521293 -0.428557
v 3.144821 -1.242239 -0.596196
v 3.579814 -0.922221 -0.588584
v 2.576058 -1.381677 -0.094601
v 2.773546 -1.515381 -0.602693
v 2.744708 -1.536596 -0.603198
v 4.047674 -0.034330 -0.058302
v 4.009997 -0.515360 -0.577455
v 4.041772 -0.014425 -0.557871
v 2.355780 -0.947574 -0.074702
v 2.371592 -0.630581 -0.062258
v 2.386606 -0.329576 -0.050442
v 2.401333 -0.034332 -0.038852
v 2.269742 -0.895958 -0.572060
v 2.285007 -0.589973 -0.560048
v 2.299501 -0.299419 -0.548643
v 2.313716 -0.014426 -0.537455
v 2.343393 -1.195828 -0.084447
v 2.596034 -1.417838 -0.596709
v 2.257208 -1.147190 -0.581922
v 3.280120 -0.863710 -0.082281
v 2.882701 -1.156085 -0.089235
v 3.768947 -0.504089 -0.073727
v 4.030064 -0.311991 -0.069158
v 3.989866 -0.620551 -0.581409
v 4.011757 -0.521293 -0.428557
v 3.144821 -1.242239 -0.596196
v 3.579814 -0.922221 -0.588584
v 2.576058 -1.381677 -0.094601
v 2.773546 -1.515381 -0.602693
v 2.744708 -1.536596 -0.603198
v 3.282691 -2.383609 -0.142872
v 3.552029 -1.959818 -0.129168
v 3.766107 -1.505662 -0.113601
v 3.921548 -1.028302 -0.096417
v 4.015900 -0.535266 -0.077887
v 3.276789 -2.363703 -0.642440
v 3.546127 -1.939913 -0.628736
v 3.760205 -1.485757 -0.613170
v 3.915646 -1.008396 -0.595986
v 2.882701 -1.156085 -0.089235
v 3.280120 -0.863711 -0.082281
v 3.768947 -0.504089 -0.073727
v 4.030064 -0.311991 -0.069158
v 2.773544 -1.515380 -0.602693
v 3.144819 -1.242239 -0.596196
v 3.579814 -0.922221 -0.588584
v 3.989866 -0.620551 -0.581409
v 2.576071 -1.381666 -0.094601
v 2.616330 -1.445655 -0.097626
v 3.270164 -2.371700 -0.642681
v 3.239371 -2.435905 -0.144444
v 3.255325 -2.348116 -0.641566
v 2.744730 -1.536579 -0.603197
v 3.142331 -2.281672 -0.137152
v 3.282691 -2.383609 -0.142872
v 3.552029 -1.959818 -0.129168
v 3.766107 -1.505662 -0.113601
v 3.921548 -1.028302 -0.096417
v 4.015900 -0.535266 -0.077887
v 3.276789 -2.363703 -0.642440
v 3.546127 -1.939913 -0.628736
v 3.760205 -1.485757 -0.613170
v 3.915646 -1.008396 -0.595986
v 2.882701 -1.156085 -0.089235
v 3.280120 -0.863711 -0.082281
v 3.768947 -0.504089 -0.073727
v 4.030064 -0.311991 -0.069158
v 2.773544 -1.515380 -0.602693
v 3.144819 -1.242239 -0.596196
v 3.579814 -0.922221 -0.588584
v 3.989866 -0.620551 -0.581409
v 4.011757 -0.521294 -0.428557
v 2.576071 -1.381666 -0.094601
v 2.616330 -1.445655 -0.097626
v 3.270164 -2.371700 -0.642681
v 3.239371 -2.435905 -0.144444
v 3.255325 -2.348116 -0.641566
v 2.744730 -1.536579 -0.603197
v 3.142331 -2.281672 -0.137152
vt 0.404167 0.912093
vt 0.386423 0.885683
vt 0.415919 0.903088
vt 0.371127 0.931360
vt 0.331983 0.853561
vt 0.335926 0.946329
vt 0.295384 0.831965
vt 0.299117 0.956764
vt 0.268360 0.816019
vt 0.261281 0.962501
vt 0.246995 0.803412
vt 0.228519 0.810997
vt 0.244072 0.801688
vt 0.223015 0.963449
vt 0.190074 0.960115
vt 0.187053 0.946544
vt 0.207083 0.823829
vt 0.182014 0.834655
vt 0.171033 0.871781
vt 0.169355 0.886196
vt 0.185249 0.957598
vt 0.207839 0.819197
vt 0.404167 0.912093
vt 0.415906 0.903098
vt 0.386442 0.885712
vt 0.331996 0.853585
vt 0.371127 0.931360
vt 0.295391 0.831987
vt 0.335926 0.946329
vt 0.268364 0.816039
vt 0.299117 0.956764
vt 0.246996 0.803430
vt 0.261281 0.962501
vt 0.240541 0.799622
vt 0.228674 0.806725
vt 0.223015 0.963449
vt 0.185711 0.959673
vt 0.174858 0.838939
vt 0.170678 0.872981
vt 0.169426 0.867354
vt 0.172053 0.844797
vt 0.180512 0.839734
vt 0.228657 0.609437
vt 0.227889 0.569587
vt 0.242277 0.569599
vt 0.243043 0.609449
vt 0.191605 0.569556
vt 0.192339 0.609407
vt 0.156774 0.569526
vt 0.157475 0.609378
vt 0.123947 0.569498
vt 0.124617 0.609350
vt 0.093641 0.569473
vt 0.094281 0.609325
vt 0.066333 0.569449
vt 0.066948 0.609302
vt 0.235418 0.609472
vt 0.213962 0.609476
vt 0.217748 0.569454
vt 0.236677 0.569446
vt 0.154563 0.609316
vt 0.135843 0.609311
vt 0.122419 0.569505
vt 0.134371 0.569506
vt 0.161601 0.569510
vt 0.209018 0.569457
vt 0.212625 0.609476
vt 0.166653 0.609484
vt 0.158080 0.569477
vt 0.161700 0.569475
vt 0.170147 0.569512
vt 0.200988 0.569516
vt 0.225869 0.569520
vt 0.240042 0.569522
vt 0.240652 0.609339
vt 0.222061 0.609334
vt 0.196437 0.609327
vt 0.164675 0.609319
vt 0.227243 0.569444
vt 0.229609 0.569444
vt 0.231621 0.609483
vt 0.089532 0.609473
vt 0.090502 0.569456
vt 0.114379 0.569454
vt 0.113405 0.609474
vt 0.157520 0.609477
vt 0.187179 0.609479
vt 0.209077 0.609481
vt 0.226391 0.609482
vt 0.158446 0.569450
vt 0.188073 0.569447
vt 0.209949 0.569446
vt 0.434523 0.888832
vt 0.415919 0.903088
vt 0.386423 0.885683
vt 0.270860 0.713685
vt 0.273698 0.704364
vt 0.331983 0.853561
vt 0.267371 0.725144
vt 0.295384 0.831965
vt 0.262817 0.740100
vt 0.268360 0.816019
vt 0.256386 0.761225
vt 0.246995 0.803412
vt 0.246208 0.794653
vt 0.271770 0.697032
vt 0.270614 0.700827
vt 0.434523 0.888832
vt 0.448120 0.875388
vt 0.245261 0.784102
vt 0.240536 0.799619
vt 0.246996 0.803431
vt 0.274951 0.700248
vt 0.448120 0.875388
vt 0.267997 0.709425
vt 0.386442 0.885712
vt 0.415906 0.903098
vt 0.264779 0.719993
vt 0.331996 0.853585
vt 0.260580 0.733787
vt 0.295391 0.831987
vt 0.254648 0.753271
vt 0.268364 0.816039
vt 0.244067 0.801685
vt 0.239292 0.569526
vt 0.238784 0.609484
vt 0.034663 0.609431
vt 0.031619 0.569495
vt 0.216848 0.609382
vt 0.197299 0.609373
vt 0.197384 0.569545
vt 0.216915 0.569553
vt 0.240682 0.569563
vt 0.240622 0.609393
vt 0.176886 0.609528
vt 0.172194 0.609526
vt 0.171786 0.569508
vt 0.237631 0.569529
vt 0.240161 0.569529
vt 0.239866 0.609553
vt 0.231901 0.569527
vt 0.224857 0.569525
vt 0.215663 0.569522
vt 0.202677 0.569518
vt 0.182128 0.569511
vt 0.237121 0.609552
vt 0.230902 0.609549
vt 0.223258 0.609546
vt 0.213280 0.609542
vt 0.199187 0.609537
vt 0.125581 0.609487
vt 0.101682 0.609486
vt 0.102644 0.569469
vt 0.239373 0.569458
vt 0.244602 0.569457
vt 0.240925 0.609495
vt 0.222076 0.569459
vt 0.200198 0.569461
vt 0.170568 0.569463
vt 0.126495 0.569467
vt 0.238552 0.609495
vt 0.221241 0.609494
vt 0.199345 0.609492
vt 0.169691 0.609490
vt 0.234013 0.658844
vt 0.274951 0.700248
vt 0.273698 0.704364
vt 0.256386 0.761225
vt 0.246208 0.794653
vt 0.234013 0.658844
vt 0.267997 0.709425
vt 0.270614 0.700827
vt 0.264779 0.719993
vt 0.260580 0.733787
vt 0.245261 0.784102
vt 0.254648 0.753271
vt 0.228673 0.806725
vt 0.240535 0.799626
vt 0.207839 0.819197
vt 0.182014 0.834655
vt 0.160700 0.825971
vt 0.174853 0.838941
vt 0.143457 0.810169
vt 0.127085 0.795165
vt 0.111025 0.780448
vt 0.158063 0.831983
vt 0.180512 0.839734
vt 0.172048 0.844800
vt 0.140200 0.815613
vt 0.123238 0.800069
vt 0.106601 0.784822
vt 0.228519 0.810997
vt 0.244065 0.801692
vt 0.207083 0.823829
vt 0.270860 0.713685
vt 0.267371 0.725144
vt 0.262817 0.740100
vt 0.271770 0.697032
vt 0.235512 0.609582
vt 0.114004 0.609481
vt 0.113710 0.569446
vt 0.239470 0.569552
vt 0.165317 0.609320
vt 0.143696 0.609314
vt 0.146794 0.569576
vt 0.220571 0.569587
vt 0.245374 0.569591
vt 0.244872 0.609341
vt 0.195284 0.569584
vt 0.168654 0.569580
vt 0.219153 0.609334
vt 0.192931 0.609327
vt 0.176478 0.609335
vt 0.171912 0.569591
vt 0.237973 0.569601
vt 0.237464 0.609351
vt 0.102304 0.609439
vt 0.095340 0.609437
vt 0.090735 0.569515
vt 0.145613 0.569524
vt 0.160720 0.569526
vt 0.159227 0.609454
vt 0.124781 0.569520
vt 0.098960 0.569517
vt 0.147690 0.609451
vt 0.127425 0.609446
vt 0.171494 0.609457
vt 0.237558 0.569538
vt 0.240807 0.569538
vt 0.240299 0.609475
vt 0.230199 0.569536
vt 0.221152 0.569535
vt 0.209345 0.569533
vt 0.192667 0.569531
vt 0.166277 0.569527
vt 0.237300 0.609475
vt 0.230506 0.609473
vt 0.222155 0.609471
vt 0.211255 0.609468
vt 0.195858 0.609464
vt 0.017469 0.872951
vt 0.106601 0.784822
vt 0.123238 0.800069
vt 0.057762 0.883544
vt 0.033319 0.887089
vt 0.143457 0.810169
vt 0.127085 0.795165
vt 0.046064 0.898457
vt 0.052797 0.903092
vt 0.091182 0.897526
vt 0.111025 0.780448
vt 0.017469 0.872951
vt 0.171033 0.871781
vt 0.166656 0.886581
vt 0.169355 0.886190
vt 0.140200 0.815613
vt 0.158063 0.831983
vt 0.140722 0.871513
vt 0.103520 0.876908
vt 0.046064 0.898457
vt 0.131901 0.891621
vt 0.160700 0.825971
vt 0.172052 0.844803
vt 0.169426 0.867351
vt 0.174857 0.838945
vt 0.236784 0.569602
vt 0.236273 0.609464
vt 0.199842 0.609454
vt 0.199840 0.609789
vt 0.225936 0.569600
vt 0.135752 0.569387
vt 0.226292 0.569377
vt 0.221142 0.609448
vt 0.134802 0.609444
vt 0.226556 0.569526
vt 0.241467 0.569528
vt 0.240960 0.609591
vt 0.196396 0.609579
vt 0.183695 0.609576
vt 0.182806 0.569519
vt 0.211865 0.609583
vt 0.226553 0.609587
vt 0.195344 0.569521
vt 0.211354 0.569524
vt 0.148754 0.609460
vt 0.134474 0.609445
vt 0.128817 0.569473
vt 0.149594 0.569495
vt 0.158710 0.569504
vt 0.167562 0.609478
vt 0.209881 0.569557
vt 0.235008 0.569583
vt 0.236640 0.569400
vt 0.183227 0.569530
vt 0.160477 0.569506
vt 0.237933 0.609548
vt 0.221918 0.609532
vt 0.191937 0.609502
vt 0.140722 0.871513
vt 0.169425 0.867351
vt 0.170678 0.872982
vt 0.147605 0.950995
vt 0.111649 0.937789
vt 0.077624 0.920184
vt 0.103520 0.876908
vt 0.046064 0.898457
vt 0.057762 0.883544
vt 0.033319 0.887089
vt 0.166656 0.886581
vt 0.147605 0.950995
vt 0.184923 0.959594
vt 0.185249 0.957598
vt 0.169353 0.886190
vt 0.131901 0.891621
vt 0.111649 0.937789
vt 0.091182 0.897526
vt 0.077624 0.920184
vt 0.052797 0.903092
vt 0.187053 0.946544
vt 0.184923 0.959594
vt 0.190074 0.960115
vt 0.185711 0.959673
vt 0.131184 0.609442
vt 0.104151 0.609435
vt 0.104787 0.569494
vt 0.131794 0.569499
vt 0.160153 0.609449
vt 0.160736 0.569503
vt 0.190603 0.609457
vt 0.191157 0.569508
vt 0.222053 0.609466
vt 0.215874 0.569511
vt 0.222051 0.609836
vt 0.236295 0.609470
vt 0.104277 0.569494
vt 0.100814 0.609434
vt 0.145845 0.609361
vt 0.143553 0.609360
vt 0.130264 0.569555
vt 0.225086 0.569569
vt 0.245842 0.569572
vt 0.244220 0.609583
vt 0.186229 0.569563
vt 0.154638 0.569558
vt 0.242622 0.609386
vt 0.209997 0.609377
vt 0.175386 0.609368
vt 0.177675 0.609487
vt 0.173752 0.609483
vt 0.183713 0.569527
vt 0.233433 0.569578
vt 0.234877 0.569579
vt 0.238401 0.609546
vt 0.228943 0.609537
vn 0.0118 -0.0398 0.9991
vn -0.0118 0.0398 -0.9991
vn 0.1869 -0.9815 -0.0413
vn 0.1249 -0.9913 -0.0410
vn 0.3085 -0.9503 -0.0415
vn 0.4253 -0.9041 -0.0410
vn 0.5354 -0.8437 -0.0399
vn 0.6370 -0.7699 -0.0382
vn 0.7286 -0.6840 -0.0359
vn 0.7702 -0.6369 -0.0345
vn 0.6230 0.7816 -0.0315
vn 0.8429 0.5246 0.1197
vn 0.8184 0.5144 0.2560
vn -0.0905 -0.0339 0.9953
vn 0.8385 0.5244 0.1480
vn -0.2350 0.9626 0.1348
vn 0.0605 -0.2421 0.9684
vn -0.2350 0.9626 0.1349
vn -0.9666 0.2554 0.0212
vn 0.0276 0.0443 0.9986
vn -0.9999 0.0000 0.0118
vn 0.0623 -0.9972 -0.0405
vn -0.0005 -0.9992 -0.0398
vn 0.4738 0.8705 0.1330
vn 0.9666 -0.2554 -0.0212
vn 0.9666 -0.2555 -0.0209
vn 0.0005 0.9992 0.0398
vn 0.9837 -0.0422 -0.1746
vn 0.9837 -0.0422 -0.1745
vn 0.2350 -0.9626 -0.1348
vn -0.4738 -0.8705 -0.1330
vn 0.9821 -0.1872 -0.0191
vn 0.9979 -0.0627 -0.0143
vn 0.9979 -0.0628 -0.0143
vn -0.9837 0.0422 0.1746
vn 0.0147 -0.0367 0.9992
vn -0.6230 -0.7816 0.0315
vn 0.5376 -0.7403 0.4037
vn 0.5375 -0.7403 0.4038
vn 0.8760 -0.4814 -0.0295
vn 0.8087 -0.5873 -0.0330
vn 0.8087 -0.5874 -0.0330
vn 0.9295 -0.3678 -0.0256
vn 0.9684 -0.2485 -0.0213
vn 0.9920 -0.1252 -0.0167
vn 0.9920 -0.1253 -0.0167
vn 0.9862 -0.1645 -0.0182
vn 0.7701 -0.6370 -0.0345
vn -0.5376 0.7403 -0.4037
vn -0.5376 0.7403 -0.4038
vn -0.8429 -0.5246 -0.1196
vn -0.8429 -0.5246 -0.1197
vn -0.8429 -0.5247 -0.1197
vn -0.8428 -0.5247 -0.1197
vn 0.8968 0.3998 0.1896
usemtl 20_-_Default
s 1
f 1/1/1 29/2/1 30/3/1
f 29/2/1 1/1/1 2/4/1
f 2/4/1 31/5/1 29/2/1
f 31/5/1 2/4/1 3/6/1
f 3/6/1 32/7/1 31/5/1
f 32/7/1 3/6/1 4/8/1
f 4/8/1 33/9/1 32/7/1
f 33/9/1 4/8/1 5/10/1
f 5/10/1 34/11/1 33/9/1
f 14/12/1 35/13/1 34/11/1
f 14/12/1 34/11/1 5/10/1
f 14/12/1 5/10/1 6/14/1
f 6/14/1 22/15/1 23/16/1
f 6/14/1 23/16/1 15/17/1
f 6/14/1 15/17/1 14/12/1
f 19/18/2 13/19/2 25/20/2
f 19/18/2 25/20/2 24/21/2
f 19/18/2 24/21/2 18/22/2
f 7/23/2 36/24/2 37/25/2
f 37/25/2 38/26/2 8/27/2
f 8/27/2 7/23/2 37/25/2
f 38/26/2 39/28/2 9/29/2
f 9/29/2 8/27/2 38/26/2
f 39/28/2 40/30/2 10/31/2
f 10/31/2 9/29/2 39/28/2
f 40/30/2 41/32/2 11/33/2
f 11/33/2 10/31/2 40/30/2
f 41/32/2 42/34/2 17/35/2
f 17/35/2 12/36/2 11/33/2
f 41/32/2 17/35/2 11/33/2
f 12/36/2 17/35/2 18/22/2
f 12/36/2 18/22/2 24/21/2
f 12/36/2 24/21/2 26/37/2
f 20/38/2 13/19/2 19/18/2
f 27/39/1 28/40/1 21/41/1
f 21/41/1 16/42/1 27/39/1
f 27/39/1 16/42/1 15/17/1
f 15/17/1 23/16/1 27/39/1
f 49/43/3 43/44/3 72/45/4
f 72/45/4 78/46/4 49/43/3
f 44/47/5 43/44/3 49/43/3
f 49/43/3 50/48/5 44/47/5
f 45/49/6 44/47/5 50/48/5
f 50/48/5 51/50/6 45/49/6
f 46/51/7 45/49/6 51/50/6
f 51/50/6 52/52/7 46/51/7
f 47/53/8 46/51/7 52/52/7
f 52/52/7 53/54/8 47/53/8
f 48/55/9 47/53/8 53/54/8
f 53/54/8 54/56/9 48/55/9
f 54/57/9 68/58/10 64/59/10
f 64/59/10 48/60/9 54/57/9
f 63/61/11 70/62/11 67/63/11
f 63/61/11 67/63/11 55/64/11
f 63/61/11 55/64/11 62/65/11
f 65/66/12 64/59/12 68/58/12
f 68/58/13 66/67/14 67/68/15
f 67/68/12 70/69/12 69/70/12
f 68/58/12 67/68/12 69/70/12
f 65/66/12 68/58/12 69/70/12
f 62/65/16 61/71/17 60/72/18
f 59/73/16 84/74/16 77/75/16
f 60/72/18 59/73/16 77/75/16
f 60/72/18 77/75/16 56/76/16
f 62/65/16 60/72/18 56/76/16
f 62/65/16 56/76/16 57/77/16
f 62/65/16 57/77/16 58/78/16
f 62/65/16 58/78/16 63/61/16
f 76/79/19 77/80/19 84/81/19
f 78/82/19 72/83/19 71/84/19
f 79/85/19 78/82/19 71/84/19
f 80/86/19 79/85/19 71/84/19
f 81/87/19 80/86/19 71/84/19
f 82/88/19 81/87/19 71/84/19
f 83/89/19 82/88/19 71/84/19
f 71/84/19 73/90/20 74/91/19
f 83/89/19 71/84/19 74/91/19
f 84/81/19 83/89/19 74/91/19
f 84/81/19 74/91/19 75/92/19
f 76/79/19 84/81/19 75/92/19
f 85/93/1 103/94/1 104/95/1
f 85/93/1 104/95/1 91/96/1
f 85/93/1 91/96/1 90/97/1
f 91/96/1 104/95/1 105/98/1
f 105/98/1 92/99/1 91/96/1
f 92/99/1 105/98/1 106/100/1
f 106/100/1 93/101/1 92/99/1
f 93/101/1 106/100/1 107/102/1
f 107/102/1 94/103/1 93/101/1
f 107/102/1 108/104/1 95/105/1
f 95/105/1 94/103/1 107/102/1
f 96/106/2 97/107/2 87/108/2
f 87/108/2 88/109/2 96/106/2
f 102/110/2 109/111/2 110/112/2
f 89/113/1 86/114/1 85/93/1
f 85/93/1 90/97/1 89/113/1
f 87/108/2 97/107/2 98/115/2
f 87/108/2 98/115/2 113/116/2
f 87/108/2 113/116/2 111/117/2
f 98/115/2 99/118/2 114/119/2
f 114/119/2 113/116/2 98/115/2
f 99/118/2 100/120/2 115/121/2
f 115/121/2 114/119/2 99/118/2
f 100/120/2 101/122/2 116/123/2
f 116/123/2 115/121/2 100/120/2
f 102/110/2 110/112/2 116/123/2
f 116/123/2 101/122/2 102/110/2
f 112/124/1 95/105/1 108/104/1
f 120/125/21 118/126/21 121/127/21
f 121/127/21 128/128/21 120/125/21
f 117/129/22 118/130/23 120/131/23
f 120/131/23 119/132/22 117/129/22
f 143/133/4 135/134/4 117/129/22
f 117/129/22 119/132/22 143/133/4
f 127/135/24 144/136/24 141/137/24
f 129/138/24 128/139/24 121/140/24
f 130/141/24 129/138/24 121/140/24
f 131/142/24 130/141/24 121/140/24
f 132/143/24 131/142/24 121/140/24
f 133/144/24 132/143/24 121/140/24
f 134/145/24 133/144/24 121/140/24
f 141/137/24 134/145/24 121/140/24
f 141/137/24 121/140/24 122/146/24
f 141/137/24 122/146/24 123/147/24
f 141/137/24 123/147/24 124/148/24
f 141/137/24 124/148/24 125/149/24
f 141/137/24 125/149/24 126/150/24
f 127/135/24 141/137/24 126/150/24
f 136/151/25 135/152/25 143/153/25
f 142/154/25 141/155/25 144/156/25
f 148/157/25 142/154/25 144/156/25
f 147/158/25 148/157/25 144/156/25
f 146/159/25 147/158/25 144/156/25
f 145/160/25 146/159/25 144/156/25
f 143/153/25 145/160/25 144/156/25
f 143/153/25 144/156/25 140/161/26
f 143/153/25 140/161/26 139/162/25
f 143/153/25 139/162/25 138/163/25
f 143/153/25 138/163/25 137/164/25
f 136/151/25 143/153/25 137/164/25
f 149/165/1 167/166/1 168/167/1
f 149/165/1 169/168/1 170/169/1
f 150/170/2 171/171/2 172/172/2
f 150/170/2 173/173/2 171/171/2
f 150/170/2 174/174/2 173/173/2
f 150/170/2 175/175/2 176/176/2
f 159/177/2 177/178/2 175/175/2
f 175/175/2 150/170/2 159/177/2
f 150/170/2 160/179/2 159/177/2
f 150/170/2 161/180/2 160/179/2
f 155/181/2 162/182/2 161/180/2
f 161/180/2 150/170/2 155/181/2
f 150/170/2 156/183/2 155/181/2
f 150/170/2 157/184/2 156/183/2
f 150/170/2 158/185/2 157/184/2
f 151/186/1 149/165/1 165/187/1
f 165/187/1 166/188/1 151/186/1
f 152/189/1 149/165/1 151/186/1
f 153/190/1 149/165/1 152/189/1
f 154/191/1 149/165/1 153/190/1
f 163/192/1 149/165/1 170/169/1
f 170/169/1 182/193/1 163/192/1
f 164/194/1 149/165/1 163/192/1
f 165/187/1 149/165/1 164/194/1
f 178/195/1 149/165/1 168/167/1
f 179/196/1 149/165/1 178/195/1
f 180/197/1 149/165/1 179/196/1
f 169/168/1 149/165/1 180/197/1
f 181/198/2 150/170/2 172/172/2
f 174/174/2 150/170/2 176/176/2
f 192/199/27 184/200/27 183/201/27
f 183/201/27 188/202/27 192/199/27
f 185/203/28 200/204/28 196/205/28
f 191/206/28 192/207/28 188/208/28
f 190/209/29 191/206/28 188/208/28
f 189/210/29 190/209/29 188/208/28
f 196/205/28 189/210/29 188/208/28
f 196/205/28 188/208/28 187/211/28
f 196/205/28 187/211/28 186/212/28
f 185/203/28 196/205/28 186/212/28
f 215/213/21 201/214/21 183/215/21
f 183/215/21 184/216/21 215/213/21
f 195/217/30 196/218/30 200/219/30
f 197/220/30 216/221/30 211/222/30
f 198/223/30 197/220/30 211/222/30
f 199/224/30 198/223/30 211/222/30
f 200/219/30 199/224/30 211/222/30
f 200/219/30 211/222/30 193/225/30
f 200/219/30 193/225/30 194/226/30
f 195/217/30 200/219/30 194/226/30
f 209/227/31 211/222/31 216/221/31
f 202/228/31 201/229/31 215/230/31
f 212/231/31 202/228/31 215/230/31
f 213/232/31 212/231/31 215/230/31
f 214/233/31 213/232/31 215/230/31
f 203/234/31 214/233/31 215/230/31
f 204/235/31 203/234/31 215/230/31
f 216/221/31 204/235/31 215/230/31
f 216/221/31 215/230/31 206/236/31
f 216/221/31 206/236/31 205/237/31
f 216/221/31 205/237/31 207/238/31
f 216/221/31 207/238/31 208/239/31
f 216/221/31 208/239/31 210/240/31
f 209/227/31 216/221/31 210/240/31
f 217/241/1 223/242/1 222/243/1
f 217/241/1 222/243/1 233/244/1
f 217/241/1 233/244/1 234/245/1
f 225/246/2 226/247/2 218/248/2
f 225/246/2 218/248/2 235/249/2
f 225/246/2 235/249/2 238/250/2
f 226/247/2 227/251/2 219/252/2
f 219/252/2 218/248/2 226/247/2
f 229/253/2 240/254/2 241/255/2
f 221/256/1 220/257/1 232/258/1
f 232/258/1 231/259/1 221/256/1
f 222/243/1 221/256/1 231/259/1
f 231/259/1 233/244/1 222/243/1
f 235/249/32 218/248/32 236/260/32
f 237/261/2 224/262/2 225/246/2
f 225/246/2 238/250/2 237/261/2
f 220/257/1 228/263/1 239/264/1
f 239/264/1 232/258/1 220/257/1
f 229/253/2 230/265/2 224/262/2
f 229/253/2 224/262/2 237/261/2
f 229/253/2 237/261/2 240/254/2
f 243/266/33 244/267/33 242/268/33
f 243/266/33 242/268/33 259/269/33
f 243/266/34 259/269/34 261/270/34
f 244/271/27 252/272/27 248/273/27
f 248/273/27 242/274/27 244/271/27
f 247/275/35 248/276/35 252/277/35
f 249/278/35 255/279/35 253/280/35
f 250/281/35 249/278/35 253/280/35
f 251/282/35 250/281/35 253/280/35
f 253/280/35 245/283/36 246/284/35
f 251/282/35 253/280/35 246/284/35
f 252/277/35 251/282/35 246/284/35
f 247/275/35 252/277/35 246/284/35
f 264/285/37 253/286/37 255/287/37
f 264/285/37 255/287/37 254/288/37
f 264/285/37 254/288/37 266/289/37
f 257/290/38 264/285/38 266/289/39
f 263/291/38 260/292/38 261/293/38
f 262/294/38 263/291/38 261/293/38
f 265/295/39 262/294/38 261/293/38
f 261/293/38 259/296/38 258/297/38
f 261/293/38 258/297/38 256/298/38
f 265/295/39 261/293/38 256/298/38
f 266/289/39 265/295/39 256/298/38
f 257/290/38 266/289/39 256/298/38
f 276/299/1 284/300/1 285/301/1
f 276/299/1 285/301/1 268/302/1
f 276/299/1 268/302/1 269/303/1
f 276/299/1 269/303/1 270/304/1
f 270/304/1 277/305/1 276/299/1
f 277/305/1 270/304/1 271/306/1
f 271/306/1 278/307/1 277/305/1
f 271/306/1 279/308/1 278/307/1
f 280/309/2 273/310/2 272/311/2
f 280/309/2 272/311/2 288/312/2
f 280/309/2 288/312/2 289/313/2
f 280/309/2 281/314/2 274/315/2
f 274/315/2 273/310/2 280/309/2
f 281/314/2 282/316/2 275/317/2
f 275/317/2 274/315/2 281/314/2
f 283/318/2 275/317/2 282/316/2
f 268/302/1 285/301/1 290/319/1
f 290/319/1 267/320/1 268/302/1
f 287/321/1 267/320/1 290/319/1
f 288/312/2 272/311/2 286/322/2
f 292/323/40 291/324/41 296/325/42
f 296/325/42 297/326/40 292/323/40
f 293/327/43 292/323/40 297/326/40
f 297/326/40 298/328/43 293/327/43
f 294/329/44 293/327/43 298/328/43
f 298/328/43 299/330/44 294/329/44
f 295/331/45 294/329/44 299/330/44
f 295/331/45 299/330/44 307/332/32
f 295/331/46 307/332/32 308/333/47
f 303/334/33 295/331/46 308/333/47
f 311/335/48 296/325/42 291/324/41
f 291/324/41 312/336/10 311/335/48
f 304/337/49 314/338/50 309/339/49
f 302/340/49 303/341/49 308/342/49
f 301/343/49 302/340/49 308/342/49
f 300/344/49 301/343/49 308/342/49
f 308/342/49 307/345/49 306/346/49
f 308/342/49 306/346/49 305/347/49
f 300/344/49 308/342/49 305/347/49
f 309/339/49 300/344/49 305/347/49
f 304/337/49 309/339/49 305/347/49
f 310/348/51 309/349/52 314/350/52
f 310/348/51 314/350/52 313/351/53
f 313/351/53 311/352/54 312/353/52
f 310/348/51 313/351/53 312/353/52
f 310/348/51 312/353/52 315/354/55
o Object782.001_Untitled.003
v -0.770025 3.963885 -0.009430
v -1.256568 3.838962 -0.009430
v -1.723616 3.654044 -0.009430
v -2.163806 3.412047 -0.009430
v -2.570196 3.116788 -0.009430
v -2.936375 2.772923 -0.009430
v -0.770025 3.963885 -0.509430
v -1.256568 3.838962 -0.509430
v -1.723616 3.654044 -0.509430
v -2.163806 3.412047 -0.509430
v -2.570196 3.116788 -0.509430
v -2.936375 2.772923 -0.509430
v -2.575315 1.439257 -0.509430
v -1.477002 1.402484 -0.009430
v -1.795733 1.324518 -0.009430
v -2.190813 1.227875 -0.009430
v -1.436114 1.364085 -0.509430
v -1.745894 1.288308 -0.509430
v -2.129881 1.194378 -0.509430
v -2.236284 1.168350 -0.509430
v -2.316592 1.197107 -0.009430
v -3.213269 2.438213 -0.009430
v -3.116153 2.283857 -0.009430
v -3.235098 2.370276 -0.509430
v -2.724124 1.558164 -0.509430
v -3.249947 2.393878 -0.509430
v -2.589717 1.447175 -0.009430
v -2.549451 1.383177 -0.009430
v -0.691863 3.554144 -0.009430
v -0.577093 3.988258 -0.009430
v -0.903692 2.752919 -0.009430
v -1.046101 2.214253 -0.009430
v -1.151250 1.816520 -0.009430
v -1.234385 1.502071 -0.009430
v -1.245760 1.459050 -0.009430
v -0.577300 3.988232 -0.509430
v -0.691946 3.554587 -0.509430
v -0.903799 2.753260 -0.509430
v -1.046231 2.214527 -0.509430
v -1.151397 1.816743 -0.509430
v -1.234536 1.502254 -0.509430
v -1.259656 1.407250 -0.509430
v -0.770025 3.963885 -0.009430
v -1.256568 3.838962 -0.009430
v -1.723616 3.654044 -0.009430
v -2.163806 3.412047 -0.009430
v -2.570196 3.116788 -0.009430
v -2.936375 2.772923 -0.009430
v -0.770025 3.963885 -0.509430
v -1.256568 3.838962 -0.509430
v -1.723616 3.654044 -0.509430
v -2.163806 3.412047 -0.509430
v -2.570196 3.116788 -0.509430
v -2.936375 2.772923 -0.509430
v -2.575315 1.439257 -0.509430
v -1.477002 1.402484 -0.009430
v -1.795733 1.324518 -0.009430
v -2.190813 1.227875 -0.009430
v -1.436114 1.364085 -0.509430
v -1.745894 1.288308 -0.509430
v -2.129881 1.194378 -0.509430
v -2.236284 1.168350 -0.509430
v -2.316592 1.197107 -0.009430
v -3.213269 2.438213 -0.009430
v -3.116153 2.283857 -0.009430
v -3.235098 2.370276 -0.509430
v -2.724124 1.558164 -0.509430
v -3.249947 2.393878 -0.509430
v -2.589717 1.447175 -0.009430
v -2.549451 1.383177 -0.009430
v -0.691863 3.554144 -0.009430
v -0.577093 3.988258 -0.009430
v -0.903692 2.752919 -0.009430
v -1.046101 2.214253 -0.009430
v -1.151250 1.816520 -0.009430
v -1.234385 1.502071 -0.009430
v -1.245760 1.459050 -0.009430
v -0.577300 3.988232 -0.509430
v -0.691946 3.554587 -0.509430
v -0.903799 2.753260 -0.509430
v -1.046231 2.214527 -0.509430
v -1.151397 1.816743 -0.509430
v -1.234536 1.502254 -0.509430
v -1.259656 1.407250 -0.509430
v -0.271660 4.026844 -0.009431
v -0.020498 4.026844 -0.009431
v -0.271660 4.026844 -0.509431
v -0.020498 4.026844 -0.509431
v -0.020498 0.798041 -0.009431
v -0.070210 0.824856 -0.009431
v -0.182808 0.885595 -0.009431
v -0.321219 0.960257 -0.009431
v -0.501870 1.057705 -0.009431
v -0.757049 1.195354 -0.009431
v -1.160835 1.413164 -0.009431
v -0.020498 0.738741 -0.509431
v -0.066348 0.763472 -0.509431
v -0.170198 0.819493 -0.509431
v -0.297857 0.888354 -0.509431
v -0.464473 0.978232 -0.509431
v -0.699827 1.105187 -0.509431
v -1.072244 1.306077 -0.509431
v -0.577093 3.988259 -0.009431
v -0.691863 3.554143 -0.009431
v -0.903689 2.752918 -0.009431
v -1.046099 2.214252 -0.009431
v -1.151250 1.816518 -0.009431
v -1.234383 1.502071 -0.009431
v -1.259673 1.407181 -0.509431
v -1.234536 1.502257 -0.509431
v -0.577300 3.988232 -0.509431
v -1.245777 1.458984 -0.009431
v -0.691946 3.554586 -0.509431
v -0.903802 2.753260 -0.509431
v -1.046231 2.214526 -0.509431
v -1.151397 1.816744 -0.509431
v -0.271660 4.026844 -0.009431
v -0.020498 4.026844 -0.009431
v -0.271660 4.026844 -0.509431
v -0.020498 4.026844 -0.509431
v -0.020498 0.798041 -0.009431
v -0.070210 0.824856 -0.009431
v -0.182808 0.885595 -0.009431
v -0.321219 0.960257 -0.009431
v -0.501870 1.057705 -0.009431
v -0.757049 1.195354 -0.009431
v -1.160835 1.413164 -0.009431
v -0.020498 0.738741 -0.509431
v -0.066348 0.763472 -0.509431
v -0.170198 0.819493 -0.509431
v -0.297857 0.888354 -0.509431
v -0.464473 0.978232 -0.509431
v -0.699827 1.105187 -0.509431
v -1.072244 1.306077 -0.509431
v -0.577093 3.988259 -0.009431
v -0.691863 3.554143 -0.009431
v -0.903689 2.752918 -0.009431
v -1.046099 2.214252 -0.009431
v -1.151250 1.816518 -0.009431
v -1.234383 1.502071 -0.009431
v -1.259673 1.407181 -0.509431
v -1.234536 1.502257 -0.509431
v -0.577300 3.988232 -0.509431
v -1.245777 1.458984 -0.009431
v -0.691946 3.554586 -0.509431
v -0.903802 2.753260 -0.509431
v -1.046231 2.214526 -0.509431
v -1.151397 1.816744 -0.509431
v -0.020498 0.034737 -0.009431
v -0.020498 0.034737 -0.509431
v -2.328916 0.948702 -0.009431
v -2.344580 0.631458 -0.009431
v -2.359453 0.330214 -0.009431
v -2.374043 0.034735 -0.009431
v -2.248760 0.916966 -0.509431
v -2.263882 0.610738 -0.509431
v -2.278240 0.319954 -0.509431
v -2.292322 0.034735 -0.509431
v -1.436114 1.364085 -0.509431
v -1.745894 1.288308 -0.509431
v -2.129881 1.194378 -0.509431
v -2.236346 1.168335 -0.509431
v -1.477005 1.402485 -0.009431
v -1.795733 1.324518 -0.009431
v -2.190811 1.227875 -0.009431
v -2.316651 1.197093 -0.009431
v -0.020498 0.798041 -0.009431
v -0.070210 0.824856 -0.009431
v -0.757046 1.195353 -0.009431
v -1.160835 1.413164 -0.009431
v -0.170198 0.819492 -0.509431
v -0.066346 0.763472 -0.509431
v -0.297857 0.888353 -0.509431
v -0.464473 0.978231 -0.509431
v -1.072244 1.306077 -0.509431
v -0.699827 1.105187 -0.509431
v -1.259756 1.407225 -0.509431
v -0.182808 0.885594 -0.009431
v -0.321219 0.960256 -0.009431
v -0.501870 1.057705 -0.009431
v -0.020498 0.738741 -0.509431
v -1.245857 1.459027 -0.009431
v -0.020498 0.034737 -0.009431
v -0.020498 0.034737 -0.509431
v -2.328916 0.948702 -0.009431
v -2.344580 0.631458 -0.009431
v -2.359453 0.330214 -0.009431
v -2.374043 0.034735 -0.009431
v -2.248760 0.916966 -0.509431
v -2.263882 0.610738 -0.509431
v -2.278240 0.319954 -0.509431
v -2.292322 0.034735 -0.509431
v -1.436114 1.364085 -0.509431
v -1.745894 1.288308 -0.509431
v -2.129881 1.194378 -0.509431
v -2.236346 1.168335 -0.509431
v -1.477005 1.402485 -0.009431
v -1.795733 1.324518 -0.009431
v -2.190811 1.227875 -0.009431
v -2.316651 1.197093 -0.009431
v -0.020498 0.798041 -0.009431
v -0.070210 0.824856 -0.009431
v -0.757046 1.195353 -0.009431
v -1.160835 1.413164 -0.009431
v -0.170198 0.819492 -0.509431
v -0.066346 0.763472 -0.509431
v -0.297857 0.888353 -0.509431
v -0.464473 0.978231 -0.509431
v -1.072244 1.306077 -0.509431
v -0.699827 1.105187 -0.509431
v -1.259756 1.407225 -0.509431
v -0.182808 0.885594 -0.009431
v -0.321219 0.960256 -0.009431
v -0.501870 1.057705 -0.009431
v -0.020498 0.738741 -0.509431
v -1.245857 1.459027 -0.009431
v -4.020498 0.034733 -0.009431
v -3.988958 0.536066 -0.509431
v -4.020498 0.034733 -0.509431
v -2.328916 0.948702 -0.009431
v -2.344580 0.631458 -0.009431
v -2.359453 0.330214 -0.009431
v -2.374043 0.034734 -0.009431
v -2.248760 0.916966 -0.509431
v -2.263882 0.610738 -0.509431
v -2.278240 0.319954 -0.509431
v -2.292322 0.034735 -0.509431
v -2.316646 1.197152 -0.009431
v -2.575320 1.439259 -0.509431
v -2.236343 1.168397 -0.509431
v -3.253282 0.864771 -0.009431
v -2.855972 1.157378 -0.009431
v -3.741973 0.504865 -0.009431
v -4.003018 0.312615 -0.009431
v -3.968875 0.641340 -0.509431
v -3.988958 0.536066 -0.360404
v -3.124063 1.263522 -0.509431
v -3.558936 0.943250 -0.509431
v -2.549414 1.383149 -0.009431
v -2.752891 1.536880 -0.509431
v -2.724060 1.558112 -0.509431
v -4.020498 0.034733 -0.009431
v -3.988958 0.536066 -0.509431
v -4.020498 0.034733 -0.509431
v -2.328916 0.948702 -0.009431
v -2.344580 0.631458 -0.009431
v -2.359453 0.330214 -0.009431
v -2.374043 0.034734 -0.009431
v -2.248760 0.916966 -0.509431
v -2.263882 0.610738 -0.509431
v -2.278240 0.319954 -0.509431
v -2.292322 0.034735 -0.509431
v -2.316646 1.197152 -0.009431
v -2.575320 1.439259 -0.509431
v -2.236343 1.168397 -0.509431
v -3.253282 0.864771 -0.009431
v -2.855972 1.157378 -0.009431
v -3.741973 0.504865 -0.009431
v -4.003018 0.312615 -0.009431
v -3.968875 0.641340 -0.509431
v -3.988958 0.536066 -0.360404
v -3.124063 1.263522 -0.509431
v -3.558936 0.943250 -0.509431
v -2.549414 1.383149 -0.009431
v -2.752891 1.536880 -0.509431
v -2.724060 1.558112 -0.509431
v -3.256568 2.385876 -0.009431
v -3.525725 1.961749 -0.009431
v -3.739605 1.507232 -0.009431
v -3.894832 1.029493 -0.009431
v -3.988958 0.536066 -0.009431
v -3.256568 2.385876 -0.509431
v -3.525725 1.961749 -0.509431
v -3.739605 1.507232 -0.509431
v -3.894832 1.029493 -0.509431
v -2.855972 1.157378 -0.009431
v -3.253282 0.864772 -0.009431
v -3.741973 0.504865 -0.009431
v -4.003018 0.312615 -0.009431
v -2.752888 1.536879 -0.509431
v -3.124060 1.263522 -0.509431
v -3.558936 0.943250 -0.509431
v -3.968875 0.641340 -0.509431
v -2.549427 1.383138 -0.009431
v -2.589720 1.447178 -0.009431
v -3.249947 2.393878 -0.509431
v -3.213269 2.438213 -0.009431
v -3.235096 2.370276 -0.509431
v -2.724082 1.558096 -0.509431
v -3.116150 2.283858 -0.009431
v -3.256568 2.385876 -0.009431
v -3.525725 1.961749 -0.009431
v -3.739605 1.507232 -0.009431
v -3.894832 1.029493 -0.009431
v -3.988958 0.536066 -0.009431
v -3.256568 2.385876 -0.509431
v -3.525725 1.961749 -0.509431
v -3.739605 1.507232 -0.509431
v -3.894832 1.029493 -0.509431
v -2.855972 1.157378 -0.009431
v -3.253282 0.864772 -0.009431
v -3.741973 0.504865 -0.009431
v -4.003018 0.312615 -0.009431
v -2.752888 1.536879 -0.509431
v -3.124060 1.263522 -0.509431
v -3.558936 0.943250 -0.509431
v -3.968875 0.641340 -0.509431
v -3.988958 0.536066 -0.360404
v -2.549427 1.383138 -0.009431
v -2.589720 1.447178 -0.009431
v -3.249947 2.393878 -0.509431
v -3.213269 2.438213 -0.009431
v -3.235096 2.370276 -0.509431
v -2.724082 1.558096 -0.509431
v -3.116150 2.283858 -0.009431
vt 0.404167 0.912093
vt 0.386423 0.885683
vt 0.415919 0.903088
vt 0.371127 0.931360
vt 0.331983 0.853561
vt 0.335926 0.946329
vt 0.295384 0.831965
vt 0.299117 0.956764
vt 0.268360 0.816019
vt 0.261281 0.962501
vt 0.246995 0.803412
vt 0.228519 0.810997
vt 0.244072 0.801688
vt 0.223015 0.963449
vt 0.190074 0.960115
vt 0.187053 0.946544
vt 0.207083 0.823829
vt 0.182014 0.834655
vt 0.171033 0.871781
vt 0.169355 0.886196
vt 0.185249 0.957598
vt 0.207839 0.819197
vt 0.404167 0.912093
vt 0.415906 0.903098
vt 0.386442 0.885712
vt 0.331996 0.853585
vt 0.371127 0.931360
vt 0.295391 0.831987
vt 0.335926 0.946329
vt 0.268364 0.816039
vt 0.299117 0.956764
vt 0.246996 0.803430
vt 0.261281 0.962501
vt 0.240541 0.799622
vt 0.228674 0.806725
vt 0.223015 0.963449
vt 0.185711 0.959673
vt 0.174858 0.838939
vt 0.170678 0.872981
vt 0.169426 0.867354
vt 0.172053 0.844797
vt 0.180512 0.839734
vt 0.228657 0.609437
vt 0.227889 0.569587
vt 0.242277 0.569599
vt 0.243043 0.609449
vt 0.191605 0.569556
vt 0.192339 0.609407
vt 0.156774 0.569526
vt 0.157475 0.609378
vt 0.123947 0.569498
vt 0.124617 0.609350
vt 0.093641 0.569473
vt 0.094281 0.609325
vt 0.066333 0.569449
vt 0.066948 0.609302
vt 0.235418 0.609472
vt 0.213962 0.609476
vt 0.217748 0.569454
vt 0.236677 0.569446
vt 0.154563 0.609316
vt 0.135843 0.609311
vt 0.122419 0.569505
vt 0.134371 0.569506
vt 0.161601 0.569510
vt 0.209018 0.569457
vt 0.212625 0.609476
vt 0.166653 0.609484
vt 0.158080 0.569477
vt 0.161700 0.569475
vt 0.170147 0.569512
vt 0.200988 0.569516
vt 0.225869 0.569520
vt 0.240042 0.569522
vt 0.240652 0.609339
vt 0.222061 0.609334
vt 0.196437 0.609327
vt 0.164675 0.609319
vt 0.227243 0.569444
vt 0.229609 0.569444
vt 0.231621 0.609483
vt 0.089532 0.609473
vt 0.090502 0.569456
vt 0.114379 0.569454
vt 0.113405 0.609474
vt 0.157520 0.609477
vt 0.187179 0.609479
vt 0.209077 0.609481
vt 0.226391 0.609482
vt 0.158446 0.569450
vt 0.188073 0.569447
vt 0.209949 0.569446
vt 0.434523 0.888832
vt 0.415919 0.903088
vt 0.386423 0.885683
vt 0.270860 0.713685
vt 0.273698 0.704364
vt 0.331983 0.853561
vt 0.267371 0.725144
vt 0.295384 0.831965
vt 0.262817 0.740100
vt 0.268360 0.816019
vt 0.256386 0.761225
vt 0.246995 0.803412
vt 0.246208 0.794653
vt 0.271770 0.697032
vt 0.270614 0.700827
vt 0.434523 0.888832
vt 0.448120 0.875388
vt 0.245261 0.784102
vt 0.240536 0.799619
vt 0.246996 0.803431
vt 0.274951 0.700248
vt 0.448120 0.875388
vt 0.267997 0.709425
vt 0.386442 0.885712
vt 0.415906 0.903098
vt 0.264779 0.719993
vt 0.331996 0.853585
vt 0.260580 0.733787
vt 0.295391 0.831987
vt 0.254648 0.753271
vt 0.268364 0.816039
vt 0.244067 0.801685
vt 0.239292 0.569526
vt 0.238784 0.609484
vt 0.034663 0.609431
vt 0.031619 0.569495
vt 0.216848 0.609382
vt 0.197299 0.609373
vt 0.197384 0.569545
vt 0.216915 0.569553
vt 0.240682 0.569563
vt 0.240622 0.609393
vt 0.176886 0.609528
vt 0.172194 0.609526
vt 0.171786 0.569508
vt 0.237631 0.569529
vt 0.240161 0.569529
vt 0.239866 0.609553
vt 0.231901 0.569527
vt 0.224857 0.569525
vt 0.215663 0.569522
vt 0.202677 0.569518
vt 0.182128 0.569511
vt 0.237121 0.609552
vt 0.230902 0.609549
vt 0.223258 0.609546
vt 0.213280 0.609542
vt 0.199187 0.609537
vt 0.125581 0.609487
vt 0.101682 0.609486
vt 0.102644 0.569469
vt 0.239373 0.569458
vt 0.244602 0.569457
vt 0.240925 0.609495
vt 0.222076 0.569459
vt 0.200198 0.569461
vt 0.170568 0.569463
vt 0.126495 0.569467
vt 0.238552 0.609495
vt 0.221241 0.609494
vt 0.199345 0.609492
vt 0.169691 0.609490
vt 0.234013 0.658844
vt 0.274951 0.700248
vt 0.273698 0.704364
vt 0.256386 0.761225
vt 0.246208 0.794653
vt 0.234013 0.658844
vt 0.267997 0.709425
vt 0.270614 0.700827
vt 0.264779 0.719993
vt 0.260580 0.733787
vt 0.245261 0.784102
vt 0.254648 0.753271
vt 0.228673 0.806725
vt 0.240535 0.799626
vt 0.207839 0.819197
vt 0.182014 0.834655
vt 0.160700 0.825971
vt 0.174853 0.838941
vt 0.143457 0.810169
vt 0.127085 0.795165
vt 0.111025 0.780448
vt 0.158063 0.831983
vt 0.180512 0.839734
vt 0.172048 0.844800
vt 0.140200 0.815613
vt 0.123238 0.800069
vt 0.106601 0.784822
vt 0.228519 0.810997
vt 0.244065 0.801692
vt 0.207083 0.823829
vt 0.270860 0.713685
vt 0.267371 0.725144
vt 0.262817 0.740100
vt 0.271770 0.697032
vt 0.235512 0.609582
vt 0.114004 0.609481
vt 0.113710 0.569446
vt 0.239470 0.569552
vt 0.165317 0.609320
vt 0.143696 0.609314
vt 0.146794 0.569576
vt 0.220571 0.569587
vt 0.245374 0.569591
vt 0.244872 0.609341
vt 0.195284 0.569584
vt 0.168654 0.569580
vt 0.219153 0.609334
vt 0.192931 0.609327
vt 0.176478 0.609335
vt 0.171912 0.569591
vt 0.237973 0.569601
vt 0.237464 0.609351
vt 0.102304 0.609439
vt 0.095340 0.609437
vt 0.090735 0.569515
vt 0.145613 0.569524
vt 0.160720 0.569526
vt 0.159227 0.609454
vt 0.124781 0.569520
vt 0.098960 0.569517
vt 0.147690 0.609451
vt 0.127425 0.609446
vt 0.171494 0.609457
vt 0.237558 0.569538
vt 0.240807 0.569538
vt 0.240299 0.609475
vt 0.230199 0.569536
vt 0.221152 0.569535
vt 0.209345 0.569533
vt 0.192667 0.569531
vt 0.166277 0.569527
vt 0.237300 0.609475
vt 0.230506 0.609473
vt 0.222155 0.609471
vt 0.211255 0.609468
vt 0.195858 0.609464
vt 0.017469 0.872951
vt 0.106601 0.784822
vt 0.123238 0.800069
vt 0.057762 0.883544
vt 0.033319 0.887089
vt 0.143457 0.810169
vt 0.127085 0.795165
vt 0.046064 0.898457
vt 0.052797 0.903092
vt 0.091182 0.897526
vt 0.111025 0.780448
vt 0.017469 0.872951
vt 0.171033 0.871781
vt 0.166656 0.886581
vt 0.169355 0.886190
vt 0.140200 0.815613
vt 0.158063 0.831983
vt 0.140722 0.871513
vt 0.103520 0.876908
vt 0.046064 0.898457
vt 0.131901 0.891621
vt 0.160700 0.825971
vt 0.172052 0.844803
vt 0.169426 0.867351
vt 0.174857 0.838945
vt 0.236784 0.569602
vt 0.236273 0.609464
vt 0.199842 0.609454
vt 0.199840 0.609789
vt 0.225936 0.569600
vt 0.135752 0.569387
vt 0.226292 0.569377
vt 0.221142 0.609448
vt 0.134802 0.609444
vt 0.226556 0.569526
vt 0.241467 0.569528
vt 0.240960 0.609591
vt 0.196396 0.609579
vt 0.183695 0.609576
vt 0.182806 0.569519
vt 0.211865 0.609583
vt 0.226553 0.609587
vt 0.195344 0.569521
vt 0.211354 0.569524
vt 0.148754 0.609460
vt 0.134474 0.609445
vt 0.128817 0.569473
vt 0.149594 0.569495
vt 0.158710 0.569504
vt 0.167562 0.609478
vt 0.209881 0.569557
vt 0.235008 0.569583
vt 0.236640 0.569400
vt 0.183227 0.569530
vt 0.160477 0.569506
vt 0.237933 0.609548
vt 0.221918 0.609532
vt 0.191937 0.609502
vt 0.140722 0.871513
vt 0.169425 0.867351
vt 0.170678 0.872982
vt 0.147605 0.950995
vt 0.111649 0.937789
vt 0.077624 0.920184
vt 0.103520 0.876908
vt 0.046064 0.898457
vt 0.057762 0.883544
vt 0.033319 0.887089
vt 0.166656 0.886581
vt 0.147605 0.950995
vt 0.184923 0.959594
vt 0.185249 0.957598
vt 0.169353 0.886190
vt 0.131901 0.891621
vt 0.111649 0.937789
vt 0.091182 0.897526
vt 0.077624 0.920184
vt 0.052797 0.903092
vt 0.187053 0.946544
vt 0.184923 0.959594
vt 0.190074 0.960115
vt 0.185711 0.959673
vt 0.131184 0.609442
vt 0.104151 0.609435
vt 0.104787 0.569494
vt 0.131794 0.569499
vt 0.160153 0.609449
vt 0.160736 0.569503
vt 0.190603 0.609457
vt 0.191157 0.569508
vt 0.222053 0.609466
vt 0.215874 0.569511
vt 0.222051 0.609836
vt 0.236295 0.609470
vt 0.104277 0.569494
vt 0.100814 0.609434
vt 0.145845 0.609361
vt 0.143553 0.609360
vt 0.130264 0.569555
vt 0.225086 0.569569
vt 0.245842 0.569572
vt 0.244220 0.609583
vt 0.186229 0.569563
vt 0.154638 0.569558
vt 0.242622 0.609386
vt 0.209997 0.609377
vt 0.175386 0.609368
vt 0.177675 0.609487
vt 0.173752 0.609483
vt 0.183713 0.569527
vt 0.233433 0.569578
vt 0.234877 0.569579
vt 0.238401 0.609546
vt 0.228943 0.609537
vn 0.0000 0.0000 1.0000
vn -0.0000 -0.0000 -1.0000
vn -0.1874 0.9823 0.0000
vn -0.1253 0.9921 0.0000
vn -0.1873 0.9823 0.0000
vn -0.3090 0.9511 0.0000
vn -0.4258 0.9048 0.0000
vn -0.5358 0.8443 0.0000
vn -0.6374 0.7705 0.0000
vn -0.7290 0.6845 0.0000
vn -0.7705 0.6374 0.0000
vn -0.6233 -0.7800 -0.0552
vn -0.8414 -0.5294 0.1087
vn -0.8462 -0.5302 0.0531
vn -0.0416 -0.0006 0.9991
vn -0.8442 -0.5279 0.0933
vn 0.2366 -0.9671 0.0938
vn 0.2366 -0.9671 0.0936
vn 0.9668 -0.2556 -0.0004
vn -0.0006 -0.0831 0.9965
vn 0.9668 -0.2556 -0.0003
vn 1.0000 -0.0000 0.0000
vn -0.0628 0.9980 -0.0000
vn 0.0000 1.0000 0.0000
vn -0.4722 -0.8754 0.1038
vn -0.9668 0.2556 0.0004
vn -0.9668 0.2556 0.0007
vn 0.0000 -1.0000 0.0000
vn -0.9857 0.0487 -0.1611
vn -0.2366 0.9671 -0.0936
vn 0.4722 0.8754 -0.1038
vn -0.9823 0.1874 0.0000
vn -0.9980 0.0628 -0.0000
vn 0.9857 -0.0487 0.1611
vn 0.6233 0.7800 0.0552
vn -0.5327 0.7234 0.4392
vn -0.8763 0.4818 0.0000
vn -0.8090 0.5878 -0.0000
vn -0.9298 0.3681 0.0000
vn -0.9686 0.2487 0.0000
vn -0.9921 0.1253 -0.0000
vn -0.9921 0.1254 0.0000
vn -0.9864 0.1647 0.0000
vn 0.5328 -0.7234 -0.4392
vn 0.5327 -0.7234 -0.4392
vn 0.8414 0.5294 -0.1087
vn 0.7536 0.6478 -0.1117
usemtl 20_-_Default.001
s 1
f 316/355/56 344/356/56 345/357/56
f 344/356/56 316/355/56 317/358/56
f 317/358/56 346/359/56 344/356/56
f 346/359/56 317/358/56 318/360/56
f 318/360/56 347/361/56 346/359/56
f 347/361/56 318/360/56 319/362/56
f 319/362/56 348/363/56 347/361/56
f 348/363/56 319/362/56 320/364/56
f 320/364/56 349/365/56 348/363/56
f 329/366/56 350/367/56 349/365/56
f 329/366/56 349/365/56 320/364/56
f 329/366/56 320/364/56 321/368/56
f 321/368/56 337/369/56 338/370/56
f 321/368/56 338/370/56 330/371/56
f 321/368/56 330/371/56 329/366/56
f 334/372/57 328/373/57 340/374/57
f 334/372/57 340/374/57 339/375/57
f 334/372/57 339/375/57 333/376/57
f 322/377/57 351/378/57 352/379/57
f 352/379/57 353/380/57 323/381/57
f 323/381/57 322/377/57 352/379/57
f 353/380/57 354/382/57 324/383/57
f 324/383/57 323/381/57 353/380/57
f 354/382/57 355/384/57 325/385/57
f 325/385/57 324/383/57 354/382/57
f 355/384/57 356/386/57 326/387/57
f 326/387/57 325/385/57 355/384/57
f 356/386/57 357/388/57 332/389/57
f 332/389/57 327/390/57 326/387/57
f 356/386/57 332/389/57 326/387/57
f 327/390/57 332/389/57 333/376/57
f 327/390/57 333/376/57 339/375/57
f 327/390/57 339/375/57 341/391/57
f 335/392/57 328/373/57 334/372/57
f 342/393/56 343/394/56 336/395/56
f 336/395/56 331/396/56 342/393/56
f 342/393/56 331/396/56 330/371/56
f 330/371/56 338/370/56 342/393/56
f 364/397/58 358/398/58 387/399/59
f 387/399/59 393/400/59 364/397/60
f 359/401/61 358/398/58 364/397/58
f 364/397/58 365/402/61 359/401/61
f 360/403/62 359/401/61 365/402/61
f 365/402/61 366/404/62 360/403/62
f 361/405/63 360/403/62 366/404/62
f 366/404/62 367/406/63 361/405/63
f 362/407/64 361/405/63 367/406/63
f 367/406/63 368/408/64 362/407/64
f 363/409/65 362/407/64 368/408/64
f 368/408/64 369/410/65 363/409/65
f 369/411/65 383/412/66 379/413/66
f 379/413/66 363/414/65 369/411/65
f 378/415/67 385/416/67 382/417/67
f 378/415/67 382/417/67 370/418/67
f 378/415/67 370/418/67 377/419/67
f 380/420/68 379/413/68 383/412/68
f 383/412/69 381/421/70 382/422/71
f 382/422/68 385/423/68 384/424/68
f 383/412/68 382/422/68 384/424/68
f 380/420/68 383/412/68 384/424/68
f 377/419/72 376/425/56 375/426/73
f 374/427/73 399/428/73 392/429/73
f 375/426/73 374/427/73 392/429/73
f 375/426/73 392/429/73 371/430/73
f 377/419/72 375/426/73 371/430/73
f 377/419/72 371/430/73 372/431/73
f 377/419/72 372/431/73 373/432/73
f 377/419/72 373/432/73 378/415/73
f 391/433/74 392/434/74 399/435/74
f 393/436/74 387/437/74 386/438/74
f 394/439/74 393/436/74 386/438/74
f 395/440/74 394/439/74 386/438/74
f 396/441/74 395/440/74 386/438/74
f 397/442/74 396/441/74 386/438/74
f 398/443/74 397/442/74 386/438/74
f 386/438/74 388/444/75 389/445/76
f 398/443/74 386/438/74 389/445/76
f 399/435/74 398/443/74 389/445/76
f 399/435/74 389/445/76 390/446/74
f 391/433/74 399/435/74 390/446/74
f 400/447/56 418/448/56 419/449/56
f 400/447/56 419/449/56 406/450/56
f 400/447/56 406/450/56 405/451/56
f 406/450/56 419/449/56 420/452/56
f 420/452/56 407/453/56 406/450/56
f 407/453/56 420/452/56 421/454/56
f 421/454/56 408/455/56 407/453/56
f 408/455/56 421/454/56 422/456/56
f 422/456/56 409/457/56 408/455/56
f 422/456/56 423/458/56 410/459/56
f 410/459/56 409/457/56 422/456/56
f 411/460/57 412/461/57 402/462/57
f 402/462/57 403/463/57 411/460/57
f 417/464/57 424/465/57 425/466/57
f 404/467/56 401/468/56 400/447/56
f 400/447/56 405/451/56 404/467/56
f 402/462/57 412/461/57 413/469/57
f 402/462/57 413/469/57 428/470/57
f 402/462/57 428/470/57 426/471/57
f 413/469/57 414/472/57 429/473/57
f 429/473/57 428/470/57 413/469/57
f 414/472/57 415/474/57 430/475/57
f 430/475/57 429/473/57 414/472/57
f 415/474/57 416/476/57 431/477/57
f 431/477/57 430/475/57 415/474/57
f 417/464/57 425/466/57 431/477/57
f 431/477/57 416/476/57 417/464/57
f 427/478/56 410/459/56 423/458/56
f 435/479/77 433/480/77 436/481/77
f 436/481/77 443/482/77 435/479/77
f 432/483/78 433/484/79 435/485/79
f 435/485/79 434/486/78 432/483/78
f 458/487/59 450/488/59 432/483/78
f 432/483/78 434/486/78 458/487/59
f 442/489/80 459/490/80 456/491/80
f 444/492/80 443/493/80 436/494/80
f 445/495/80 444/492/80 436/494/80
f 446/496/80 445/495/80 436/494/80
f 447/497/80 446/496/80 436/494/80
f 448/498/80 447/497/80 436/494/80
f 449/499/80 448/498/80 436/494/80
f 456/491/80 449/499/80 436/494/80
f 456/491/80 436/494/80 437/500/80
f 456/491/80 437/500/80 438/501/80
f 456/491/80 438/501/80 439/502/80
f 456/491/80 439/502/80 440/503/80
f 456/491/80 440/503/80 441/504/80
f 442/489/80 456/491/80 441/504/80
f 451/505/81 450/506/81 458/507/81
f 457/508/81 456/509/81 459/510/81
f 463/511/81 457/508/81 459/510/81
f 462/512/81 463/511/81 459/510/81
f 461/513/81 462/512/81 459/510/81
f 460/514/81 461/513/81 459/510/81
f 458/507/81 460/514/81 459/510/81
f 458/507/81 459/510/81 455/515/82
f 458/507/81 455/515/82 454/516/81
f 458/507/81 454/516/81 453/517/81
f 458/507/81 453/517/81 452/518/81
f 451/505/81 458/507/81 452/518/81
f 464/519/56 482/520/56 483/521/56
f 464/519/56 484/522/56 485/523/56
f 465/524/57 486/525/57 487/526/57
f 465/524/57 488/527/57 486/525/57
f 465/524/57 489/528/57 488/527/57
f 465/524/57 490/529/57 491/530/57
f 474/531/57 492/532/57 490/529/57
f 490/529/57 465/524/57 474/531/57
f 465/524/57 475/533/57 474/531/57
f 465/524/57 476/534/57 475/533/57
f 470/535/57 477/536/57 476/534/57
f 476/534/57 465/524/57 470/535/57
f 465/524/57 471/537/57 470/535/57
f 465/524/57 472/538/57 471/537/57
f 465/524/57 473/539/57 472/538/57
f 466/540/56 464/519/56 480/541/56
f 480/541/56 481/542/56 466/540/56
f 467/543/56 464/519/56 466/540/56
f 468/544/56 464/519/56 467/543/56
f 469/545/56 464/519/56 468/544/56
f 478/546/56 464/519/56 485/523/56
f 485/523/56 497/547/56 478/546/56
f 479/548/56 464/519/56 478/546/56
f 480/541/56 464/519/56 479/548/56
f 493/549/56 464/519/56 483/521/56
f 494/550/56 464/519/56 493/549/56
f 495/551/56 464/519/56 494/550/56
f 484/522/56 464/519/56 495/551/56
f 496/552/57 465/524/57 487/526/57
f 489/528/57 465/524/57 491/530/57
f 507/553/83 499/554/83 498/555/83
f 498/555/83 503/556/83 507/553/83
f 500/557/84 515/558/84 511/559/84
f 506/560/84 507/561/84 503/562/84
f 505/563/84 506/560/84 503/562/84
f 504/564/84 505/563/84 503/562/84
f 511/559/84 504/564/84 503/562/84
f 511/559/84 503/562/84 502/565/84
f 511/559/84 502/565/84 501/566/84
f 500/557/84 511/559/84 501/566/84
f 530/567/77 516/568/77 498/569/77
f 498/569/77 499/570/77 530/567/77
f 510/571/85 511/572/85 515/573/85
f 512/574/85 531/575/85 526/576/85
f 513/577/85 512/574/85 526/576/85
f 514/578/85 513/577/85 526/576/85
f 515/573/85 514/578/85 526/576/85
f 515/573/85 526/576/85 508/579/85
f 515/573/85 508/579/85 509/580/85
f 510/571/85 515/573/85 509/580/85
f 524/581/86 526/576/86 531/575/86
f 517/582/86 516/583/86 530/584/86
f 527/585/86 517/582/86 530/584/86
f 528/586/86 527/585/86 530/584/86
f 529/587/86 528/586/86 530/584/86
f 518/588/86 529/587/86 530/584/86
f 519/589/86 518/588/86 530/584/86
f 531/575/86 519/589/86 530/584/86
f 531/575/86 530/584/86 521/590/86
f 531/575/86 521/590/86 520/591/86
f 531/575/86 520/591/86 522/592/86
f 531/575/86 522/592/86 523/593/86
f 531/575/86 523/593/86 525/594/86
f 524/581/86 531/575/86 525/594/86
f 532/595/56 538/596/56 537/597/56
f 532/595/56 537/597/56 548/598/56
f 532/595/56 548/598/56 549/599/56
f 540/600/57 541/601/57 533/602/57
f 540/600/57 533/602/57 550/603/57
f 540/600/57 550/603/57 553/604/57
f 541/601/57 542/605/57 534/606/57
f 534/606/57 533/602/57 541/601/57
f 544/607/57 555/608/57 556/609/57
f 536/610/56 535/611/56 547/612/56
f 547/612/56 546/613/56 536/610/56
f 537/597/56 536/610/56 546/613/56
f 546/613/56 548/598/56 537/597/56
f 550/603/87 533/602/87 551/614/87
f 552/615/57 539/616/57 540/600/57
f 540/600/57 553/604/57 552/615/57
f 535/611/56 543/617/56 554/618/56
f 554/618/56 547/612/56 535/611/56
f 544/607/57 545/619/57 539/616/57
f 544/607/57 539/616/57 552/615/57
f 544/607/57 552/615/57 555/608/57
f 558/620/88 559/621/88 557/622/88
f 558/620/88 557/622/88 574/623/88
f 558/620/88 574/623/88 576/624/88
f 559/625/83 567/626/83 563/627/83
f 563/627/83 557/628/83 559/625/83
f 562/629/89 563/630/89 567/631/89
f 564/632/89 570/633/89 568/634/89
f 565/635/89 564/632/89 568/634/89
f 566/636/89 565/635/89 568/634/89
f 568/634/89 560/637/56 561/638/89
f 566/636/89 568/634/89 561/638/89
f 567/631/89 566/636/89 561/638/89
f 562/629/89 567/631/89 561/638/89
f 579/639/90 568/640/90 570/641/90
f 579/639/90 570/641/90 569/642/90
f 579/639/90 569/642/90 581/643/90
f 572/644/91 579/639/91 581/643/91
f 578/645/91 575/646/91 576/647/91
f 577/648/91 578/645/91 576/647/91
f 580/649/91 577/648/91 576/647/91
f 576/647/91 574/650/91 573/651/91
f 576/647/91 573/651/91 571/652/91
f 580/649/91 576/647/91 571/652/91
f 581/643/91 580/649/91 571/652/91
f 572/644/91 581/643/91 571/652/91
f 591/653/56 599/654/56 600/655/56
f 591/653/56 600/655/56 583/656/56
f 591/653/56 583/656/56 584/657/56
f 591/653/56 584/657/56 585/658/56
f 585/658/56 592/659/56 591/653/56
f 592/659/56 585/658/56 586/660/56
f 586/660/56 593/661/56 592/659/56
f 586/660/56 594/662/56 593/661/56
f 595/663/57 588/664/57 587/665/57
f 595/663/57 587/665/57 603/666/57
f 595/663/57 603/666/57 604/667/57
f 595/663/57 596/668/57 589/669/57
f 589/669/57 588/664/57 595/663/57
f 596/668/57 597/670/57 590/671/57
f 590/671/57 589/669/57 596/668/57
f 598/672/57 590/671/57 597/670/57
f 583/656/56 600/655/56 605/673/56
f 605/673/56 582/674/56 583/656/56
f 602/675/56 582/674/56 605/673/56
f 603/666/57 587/665/57 601/676/57
f 607/677/92 606/678/93 611/679/93
f 611/679/93 612/680/92 607/677/92
f 608/681/94 607/677/92 612/680/92
f 612/680/92 613/682/94 608/681/94
f 609/683/95 608/681/94 613/682/94
f 613/682/94 614/684/95 609/683/95
f 610/685/96 609/683/95 614/684/95
f 610/685/96 614/684/95 622/686/87
f 610/685/97 622/686/87 623/687/98
f 618/688/88 610/685/97 623/687/98
f 626/689/66 611/679/93 606/678/93
f 606/678/93 627/690/66 626/689/66
f 619/691/99 629/692/99 624/693/100
f 617/694/100 618/695/100 623/696/100
f 616/697/100 617/694/100 623/696/100
f 615/698/100 616/697/100 623/696/100
f 623/696/100 622/699/100 621/700/100
f 623/696/100 621/700/100 620/701/100
f 615/698/100 623/696/100 620/701/100
f 624/693/100 615/698/100 620/701/100
f 619/691/99 624/693/100 620/701/100
f 625/702/101 624/703/101 629/704/101
f 625/702/101 629/704/101 628/705/101
f 628/705/101 626/706/101 627/707/101
f 625/702/101 628/705/101 627/707/101
f 625/702/101 627/707/101 630/708/102
