# Blender v2.79 (sub 6) OBJ File: 'quarterWallBlue.blend'
# www.blender.org
mtllib quarterWallBlue.mtl
o Object789_Untitled.014
v -3.986700 0.114397 1.823608
v -3.955160 0.615730 1.323608
v -3.986700 0.114397 1.323608
v -2.295118 1.028365 1.823608
v -2.310782 0.711121 1.823608
v -2.325655 0.409877 1.823608
v -2.340245 0.114398 1.823608
v -2.214962 0.996629 1.323608
v -2.230084 0.690401 1.323608
v -2.244442 0.399617 1.323608
v -2.258524 0.114398 1.323608
v -2.282848 1.276816 1.823608
v -2.541522 1.518923 1.323608
v -2.202545 1.248061 1.323608
v -3.219483 0.944435 1.823608
v -2.822174 1.237041 1.823608
v -3.708175 0.584529 1.823608
v -3.969220 0.392278 1.823608
v -3.935077 0.721004 1.323608
v -3.955160 0.615730 1.472636
v -3.090265 1.343185 1.323608
v -3.525138 1.022914 1.323608
v -2.515616 1.462812 1.823608
v -2.719093 1.616543 1.323608
v -2.690262 1.637776 1.323608
v -3.986700 0.114397 1.823608
v -3.955160 0.615730 1.323608
v -3.986700 0.114397 1.323608
v -2.295118 1.028365 1.823608
v -2.310782 0.711121 1.823608
v -2.325655 0.409877 1.823608
v -2.340245 0.114398 1.823608
v -2.214962 0.996629 1.323608
v -2.230084 0.690401 1.323608
v -2.244442 0.399617 1.323608
v -2.258524 0.114398 1.323608
v -2.282848 1.276816 1.823608
v -2.541522 1.518923 1.323608
v -2.202545 1.248061 1.323608
v -3.219483 0.944435 1.823608
v -2.822174 1.237041 1.823608
v -3.708175 0.584529 1.823608
v -3.969220 0.392278 1.823608
v -3.935077 0.721004 1.323608
v -3.955160 0.615730 1.472636
v -3.090265 1.343185 1.323608
v -3.525138 1.022914 1.323608
v -2.515616 1.462812 1.823608
v -2.719093 1.616543 1.323608
v -2.690262 1.637776 1.323608
vt 0.002431 0.696186
vt 0.210171 0.408773
vt 0.248428 0.459032
vt 0.095516 0.731583
vt 0.038884 0.742795
vt 0.711954 0.502424
vt 0.750448 0.453488
vt 0.937098 0.797563
vt 0.921301 0.812619
vt 0.831936 0.792814
vt 0.788205 0.405487
vt 1.004312 0.714406
vt 0.646337 0.704841
vt 0.656222 0.753874
vt 0.649937 0.752481
vt 0.287432 0.510271
vt 0.328507 0.564232
vt 0.287725 0.693530
vt 0.201533 0.710594
vt 0.052797 0.903092
vt 0.046064 0.898457
vt 0.046064 0.898457
vt 0.737136 0.771806
vt 0.671417 0.553960
vt 0.360676 0.606491
vt 0.354230 0.680364
vt 0.638133 0.596274
vt 0.236784 0.569602
vt 0.236273 0.609464
vt 0.199842 0.609454
vt 0.199840 0.609789
vt 0.225936 0.569600
vt 0.135752 0.569387
vt 0.226292 0.569377
vt 0.221142 0.609448
vt 0.134802 0.609444
vt 0.226556 0.569526
vt 0.241467 0.569528
vt 0.240960 0.609591
vt 0.196396 0.609579
vt 0.183695 0.609576
vt 0.182806 0.569519
vt 0.211865 0.609583
vt 0.226553 0.609587
vt -0.000189 0.769941
vt -0.000446 0.767947
vt -0.000421 0.767941
vt 0.211354 0.569524
vt 0.148754 0.609460
vt 0.134474 0.609445
vt 0.128817 0.569473
vt 0.149594 0.569495
vt 0.158710 0.569504
vt 0.167562 0.609478
vt 0.209881 0.569557
vt 0.235008 0.569583
vt 0.236640 0.569400
vt 0.183227 0.569530
vt 0.160477 0.569506
vt 0.237933 0.609548
vt 0.221918 0.609532
vt 0.191937 0.609502
vn -0.0000 0.0000 1.0000
vn -0.0000 0.0000 -1.0000
vn -0.9823 0.1874 0.0000
vn -0.9980 0.0628 -0.0000
vn 0.0000 -1.0000 -0.0000
vn 0.9857 -0.0487 0.1611
vn 0.1131 0.0000 0.9936
vn 0.6233 0.7800 0.0552
vn -0.5327 0.7234 0.4392
usemtl 20_-_Default
s 1
f 1/1/1 7/2/1 6/3/1
f 1/1/1 6/3/1 17/4/1
f 1/1/1 17/4/1 18/5/1
f 9/6/2 10/7/2 2/8/2
f 9/6/2 2/8/2 19/9/2
f 9/6/2 19/9/2 22/10/2
f 10/7/2 11/11/2 3/12/2
f 3/12/2 2/8/2 10/7/2
f 13/13/2 24/14/2 25/15/2
f 5/16/1 4/17/1 16/18/1
f 16/18/1 15/19/1 5/16/1
f 6/3/1 5/16/1 15/19/1
f 15/19/1 17/4/1 6/3/1
f 19/20/3 2/21/3 20/22/3
f 21/23/2 8/24/2 9/6/2
f 9/6/2 22/10/2 21/23/2
f 4/17/1 12/25/1 23/26/1
f 23/26/1 16/18/1 4/17/1
f 13/13/2 14/27/2 8/24/2
f 13/13/2 8/24/2 21/23/2
f 13/13/2 21/23/2 24/14/2
f 27/28/4 28/29/4 26/30/4
f 27/28/4 26/30/4 43/31/4
f 27/28/4 43/31/4 45/32/4
f 28/33/5 36/34/5 32/35/5
f 32/35/5 26/36/5 28/33/5
f 31/37/6 32/38/6 36/39/6
f 33/40/6 39/41/6 37/42/6
f 34/43/6 33/40/6 37/42/6
f 35/44/6 34/43/6 37/42/6
f 37/45/6 29/46/7 30/47/6
f 35/44/6 37/42/6 30/48/6
f 36/39/6 35/44/6 30/48/6
f 31/37/6 36/39/6 30/48/6
f 48/49/8 37/50/8 39/51/8
f 48/49/8 39/51/8 38/52/8
f 48/49/8 38/52/8 50/53/8
f 41/54/9 48/49/9 50/53/9
f 47/55/9 44/56/9 45/57/9
f 46/58/9 47/55/9 45/57/9
f 49/59/9 46/58/9 45/57/9
f 45/57/9 43/60/9 42/61/9
f 45/57/9 42/61/9 40/62/9
f 49/59/9 45/57/9 40/62/9
f 50/53/9 49/59/9 40/62/9
f 41/54/9 50/53/9 40/62/9
o Object806_Untitled.009
v -3.222769 2.465539 1.823608
v -3.491927 2.041413 1.823608
v -3.705807 1.586896 1.823608
v -3.861034 1.109157 1.823608
v -3.955160 0.615730 1.823608
v -3.222769 2.465539 1.323608
v -3.491927 2.041413 1.323608
v -3.705807 1.586896 1.323608
v -3.861034 1.109157 1.323608
v -2.822174 1.237042 1.823608
v -3.219483 0.944435 1.823608
v -3.708175 0.584529 1.823608
v -3.969220 0.392278 1.823608
v -2.719090 1.616543 1.323608
v -3.090262 1.343185 1.323608
v -3.525138 1.022914 1.323608
v -3.935077 0.721004 1.323608
v -2.515629 1.462802 1.823608
v -2.555922 1.526841 1.823608
v -3.216148 2.473542 1.323608
v -3.179471 2.517877 1.823608
v -3.201298 2.449940 1.323608
v -2.690284 1.637759 1.323608
v -3.082352 2.363521 1.823608
v -3.222769 2.465539 1.823608
v -3.491927 2.041413 1.823608
v -3.705807 1.586896 1.823608
v -3.861034 1.109157 1.823608
v -3.955160 0.615730 1.823608
v -3.222769 2.465539 1.323608
v -3.491927 2.041413 1.323608
v -3.705807 1.586896 1.323608
v -3.861034 1.109157 1.323608
v -2.822174 1.237042 1.823608
v -3.219483 0.944435 1.823608
v -3.708175 0.584529 1.823608
v -3.969220 0.392278 1.823608
v -2.719090 1.616543 1.323608
v -3.090262 1.343185 1.323608
v -3.525138 1.022914 1.323608
v -3.935077 0.721004 1.323608
v -3.955160 0.615730 1.472636
v -2.515629 1.462802 1.823608
v -2.555922 1.526841 1.823608
v -3.216148 2.473542 1.323608
v -3.179471 2.517877 1.823608
v -3.201298 2.449940 1.323608
v -2.690284 1.637759 1.323608
v -3.082352 2.363521 1.823608
vt 0.294017 0.696271
vt 0.361850 0.682242
vt 0.364799 0.701082
vt 0.310101 0.962252
vt 0.225171 0.918178
vt 0.144810 0.859374
vt 0.206099 0.714454
vt 0.070286 0.786768
vt 0.097960 0.736818
vt 0.040195 0.748765
vt 0.656222 0.753873
vt 0.699245 0.967273
vt 0.612061 0.994281
vt 0.611343 0.987679
vt 0.649942 0.752481
vt 0.737135 0.771805
vt 0.783351 0.925002
vt 0.831936 0.792814
vt 0.863055 0.868132
vt 0.921300 0.812619
vt 0.403325 0.947221
vt 0.398262 0.990903
vt 0.410433 0.992630
vt 0.610222 0.994514
vt 0.131184 0.609442
vt 0.104151 0.609435
vt 0.104787 0.569494
vt 0.131794 0.569499
vt 0.160153 0.609449
vt 0.160736 0.569503
vt 0.190603 0.609457
vt 0.191157 0.569508
vt 0.222053 0.609466
vt 0.215874 0.569511
vt 0.222051 0.609836
vt 0.236295 0.609470
vt 0.104277 0.569494
vt 0.100814 0.609434
vt 0.145845 0.609361
vt 0.143553 0.609360
vt 0.130264 0.569555
vt 0.225086 0.569569
vt 0.245842 0.569572
vt 0.244220 0.609583
vt 0.186229 0.569563
vt 0.154638 0.569558
vt 0.242622 0.609386
vt 0.209997 0.609377
vt 0.175386 0.609368
vt 0.177675 0.609487
vt 0.173752 0.609483
vt 0.183713 0.569527
vt 0.233433 0.569578
vt 0.234877 0.569579
vt 0.238401 0.609546
vt 0.643364 0.687188
vt 0.597666 0.965645
vt 0.604784 0.922275
vn -0.0000 0.0000 1.0000
vn -0.0000 0.0000 -1.0000
vn -0.8763 0.4818 0.0000
vn -0.8090 0.5878 0.0000
vn -0.9298 0.3681 0.0000
vn -0.9686 0.2487 0.0000
vn -0.9921 0.1253 -0.0000
vn -0.9823 0.1874 -0.0000
vn -0.9921 0.1254 0.0000
vn -0.9864 0.1647 0.0000
vn -0.9980 0.0628 0.0000
vn -0.7705 0.6374 0.0000
vn 0.5328 -0.7234 -0.4392
vn 0.5327 -0.7234 -0.4392
vn 0.8414 0.5294 -0.1088
vn 0.8414 0.5294 -0.1087
vn 0.7632 0.6347 0.1210
usemtl Material
s 1
f 60/63/10 68/64/10 69/65/10
f 60/63/10 69/65/10 52/66/10
f 60/63/10 52/66/10 53/67/10
f 60/63/10 53/67/10 54/68/10
f 54/68/10 61/69/10 60/63/10
f 61/69/10 54/68/10 55/70/10
f 55/70/10 62/71/10 61/69/10
f 55/70/10 63/72/10 62/71/10
f 64/73/11 57/74/11 56/75/11
f 64/73/11 56/75/11 72/76/11
f 64/73/11 72/76/11 73/77/11
f 64/73/11 65/78/11 58/79/11
f 58/79/11 57/74/11 64/73/11
f 65/78/11 66/80/11 59/81/11
f 59/81/11 58/79/11 65/78/11
f 67/82/11 59/81/11 66/80/11
f 52/66/10 69/65/10 74/83/10
f 74/83/10 51/84/10 52/66/10
f 71/85/10 51/84/10 74/83/10
f 72/76/11 56/75/11 70/86/11
f 76/87/12 75/88/13 80/89/13
f 80/89/13 81/90/12 76/87/12
f 77/91/14 76/87/12 81/90/12
f 81/90/12 82/92/14 77/91/14
f 78/93/15 77/91/14 82/92/14
f 82/92/14 83/94/15 78/93/15
f 79/95/16 78/93/15 83/94/15
f 79/95/16 83/94/15 91/96/17
f 79/95/18 91/96/17 92/97/19
f 87/98/20 79/95/18 92/97/19
f 95/99/21 80/89/13 75/88/13
f 75/88/13 96/100/21 95/99/21
f 88/101/22 98/102/22 93/103/23
f 86/104/23 87/105/23 92/106/23
f 85/107/23 86/104/23 92/106/23
f 84/108/23 85/107/23 92/106/23
f 92/106/23 91/109/23 90/110/23
f 92/106/23 90/110/23 89/111/23
f 84/108/23 92/106/23 89/111/23
f 93/103/23 84/108/23 89/111/23
f 88/101/22 93/103/23 89/111/23
f 94/112/24 93/113/25 98/114/25
f 94/112/24 98/114/25 97/115/25
f 97/115/25 95/116/25 96/117/25
f 94/112/24 97/115/25 96/117/25
f 94/118/24 96/119/25 99/120/26
o Object805_Untitled.008
v 0.013300 0.114400 1.823608
v 0.013300 0.114400 1.323608
v -2.295118 1.028365 1.823608
v -2.310782 0.711121 1.823608
v -2.325655 0.409877 1.823608
v -2.340245 0.114398 1.823608
v -2.214962 0.996630 1.323608
v -2.230084 0.690401 1.323608
v -2.244442 0.399617 1.323608
v -2.258524 0.114398 1.323608
v -1.402315 1.443749 1.323608
v -1.712096 1.367971 1.323608
v -2.096083 1.274042 1.323608
v -2.202548 1.247999 1.323608
v -1.443207 1.482148 1.823608
v -1.761935 1.404182 1.823608
v -2.157013 1.307539 1.823608
v -2.282853 1.276757 1.823608
v 0.013300 0.877705 1.823608
v -0.036412 0.904520 1.823608
v -0.723248 1.275016 1.823608
v -1.127037 1.492827 1.823608
v -0.136400 0.899156 1.323608
v -0.032547 0.843136 1.323608
v -0.264059 0.968017 1.323608
v -0.430675 1.057895 1.323608
v -1.038446 1.385741 1.323608
v -0.666029 1.184851 1.323608
v -1.225958 1.486889 1.323608
v -0.149010 0.965258 1.823608
v -0.287421 1.039920 1.823608
v -0.468072 1.137369 1.823608
v 0.013300 0.818404 1.323608
v -1.212059 1.538691 1.823608
v 0.013300 0.114400 1.823608
v 0.013300 0.114400 1.323608
v -2.295118 1.028365 1.823608
v -2.310782 0.711121 1.823608
v -2.325655 0.409877 1.823608
v -2.340245 0.114398 1.823608
v -2.214962 0.996630 1.323608
v -2.230084 0.690401 1.323608
v -2.244442 0.399617 1.323608
v -2.258524 0.114398 1.323608
v -1.402315 1.443749 1.323608
v -1.712096 1.367971 1.323608
v -2.096083 1.274042 1.323608
v -2.202548 1.247999 1.323608
v -1.443207 1.482148 1.823608
v -1.761935 1.404182 1.823608
v -2.157013 1.307539 1.823608
v -2.282853 1.276757 1.823608
v 0.013300 0.877705 1.823608
v -0.036412 0.904520 1.823608
v -0.723248 1.275016 1.823608
v -1.127037 1.492827 1.823608
v -0.136400 0.899156 1.323608
v -0.032547 0.843136 1.323608
v -0.264059 0.968017 1.323608
v -0.430675 1.057895 1.323608
v -1.038446 1.385741 1.323608
v -0.666029 1.184851 1.323608
v -1.225958 1.486889 1.323608
v -0.149010 0.965258 1.823608
v -0.287421 1.039920 1.823608
v -0.468072 1.137369 1.823608
v 0.013300 0.818404 1.323608
v -1.212059 1.538691 1.823608
vt 0.497604 0.001314
vt 0.590766 0.132768
vt 0.587995 0.145979
vt 0.549703 0.328520
vt 0.527191 0.435835
vt 0.504115 -0.000610
vt 0.423796 0.165144
vt 0.417879 0.136658
vt 0.431069 0.200160
vt 0.440562 0.245863
vt 0.475187 0.412572
vt 0.453970 0.310419
vt 0.513368 0.487889
vt 0.485870 0.464005
vt 0.561669 0.529842
vt 0.621540 0.581844
vt 0.671417 0.553960
vt 0.638141 0.596263
vt 0.711954 0.502424
vt 0.750448 0.453488
vt 0.788205 0.405487
vt 0.328477 0.557776
vt 0.379343 0.581980
vt 0.360285 0.598433
vt 0.287853 0.505849
vt 0.249277 0.456540
vt 0.211439 0.408176
vt 0.487445 0.488653
vt 0.522451 0.458432
vt 0.439175 0.530325
vt 0.581717 0.175905
vt 0.574001 0.212690
vt 0.563929 0.260702
vt 0.415268 0.124082
vt 0.235512 0.609582
vt 0.114004 0.609481
vt 0.113710 0.569446
vt 0.239470 0.569552
vt 0.165317 0.609320
vt 0.143696 0.609314
vt 0.146794 0.569576
vt 0.220571 0.569587
vt 0.245374 0.569591
vt 0.244872 0.609341
vt 0.195284 0.569584
vt 0.168654 0.569580
vt 0.219153 0.609334
vt 0.192931 0.609327
vt 0.176478 0.609335
vt 0.171912 0.569591
vt 0.237973 0.569601
vt 0.237464 0.609351
vt 0.102304 0.609439
vt 0.095340 0.609437
vt 0.090735 0.569515
vt 0.145613 0.569524
vt 0.160720 0.569526
vt 0.159227 0.609454
vt 0.124781 0.569520
vt 0.098960 0.569517
vt 0.147690 0.609451
vt 0.127425 0.609446
vt 0.171494 0.609457
vt 0.237558 0.569538
vt 0.240807 0.569538
vt 0.240299 0.609475
vt 0.230199 0.569536
vt 0.221152 0.569535
vt 0.209345 0.569533
vt 0.192667 0.569531
vt 0.166277 0.569527
vt 0.237300 0.609475
vt 0.230506 0.609473
vt 0.222155 0.609471
vt 0.211255 0.609468
vt 0.195858 0.609464
vn 0.0000 0.0000 1.0000
vn -0.0000 0.0000 -1.0000
vn 0.0000 -1.0000 0.0000
vn -0.9857 0.0487 -0.1611
vn 1.0000 0.0000 0.0000
vn -0.2366 0.9671 -0.0936
vn 0.4722 0.8754 -0.1038
usemtl 20_-_Default
s 1
f 100/121/27 118/122/27 119/123/27
f 100/121/27 120/124/27 121/125/27
f 101/126/28 122/127/28 123/128/28
f 101/126/28 124/129/28 122/127/28
f 101/126/28 125/130/28 124/129/28
f 101/126/28 126/131/28 127/132/28
f 110/133/28 128/134/28 126/131/28
f 126/131/28 101/126/28 110/133/28
f 101/126/28 111/135/28 110/133/28
f 101/126/28 112/136/28 111/135/28
f 106/137/28 113/138/28 112/136/28
f 112/136/28 101/126/28 106/137/28
f 101/126/28 107/139/28 106/137/28
f 101/126/28 108/140/28 107/139/28
f 101/126/28 109/141/28 108/140/28
f 102/142/27 100/121/27 116/143/27
f 116/143/27 117/144/27 102/142/27
f 103/145/27 100/121/27 102/142/27
f 104/146/27 100/121/27 103/145/27
f 105/147/27 100/121/27 104/146/27
f 114/148/27 100/121/27 121/125/27
f 121/125/27 133/149/27 114/148/27
f 115/150/27 100/121/27 114/148/27
f 116/143/27 100/121/27 115/150/27
f 129/151/27 100/121/27 119/123/27
f 130/152/27 100/121/27 129/151/27
f 131/153/27 100/121/27 130/152/27
f 120/124/27 100/121/27 131/153/27
f 132/154/28 101/126/28 123/128/28
f 125/130/28 101/126/28 127/132/28
f 143/155/29 135/156/29 134/157/29
f 134/157/29 139/158/29 143/155/29
f 136/159/30 151/160/30 147/161/30
f 142/162/30 143/163/30 139/164/30
f 141/165/30 142/162/30 139/164/30
f 140/166/30 141/165/30 139/164/30
f 147/161/30 140/166/30 139/164/30
f 147/161/30 139/164/30 138/167/30
f 147/161/30 138/167/30 137/168/30
f 136/159/30 147/161/30 137/168/30
f 166/169/31 152/170/31 134/171/31
f 134/171/31 135/172/31 166/169/31
f 146/173/32 147/174/32 151/175/32
f 148/176/32 167/177/32 162/178/32
f 149/179/32 148/176/32 162/178/32
f 150/180/32 149/179/32 162/178/32
f 151/175/32 150/180/32 162/178/32
f 151/175/32 162/178/32 144/181/32
f 151/175/32 144/181/32 145/182/32
f 146/173/32 151/175/32 145/182/32
f 160/183/33 162/178/33 167/177/33
f 153/184/33 152/185/33 166/186/33
f 163/187/33 153/184/33 166/186/33
f 164/188/33 163/187/33 166/186/33
f 165/189/33 164/188/33 166/186/33
f 154/190/33 165/189/33 166/186/33
f 155/191/33 154/190/33 166/186/33
f 167/177/33 155/191/33 166/186/33
f 167/177/33 166/186/33 157/192/33
f 167/177/33 157/192/33 156/193/33
f 167/177/33 156/193/33 158/194/33
f 167/177/33 158/194/33 159/195/33
f 167/177/33 159/195/33 161/196/33
f 160/183/33 167/177/33 161/196/33
o Object804_Untitled.013
v -0.736227 4.043549 1.823609
v -1.222770 3.918625 1.823609
v -1.689818 3.733708 1.823609
v -2.130008 3.491710 1.823609
v -2.536397 3.196452 1.823609
v -2.902577 2.852587 1.823609
v -0.736227 4.043549 1.323609
v -1.222770 3.918625 1.323609
v -1.689818 3.733708 1.323609
v -2.130008 3.491710 1.323609
v -2.536397 3.196452 1.323609
v -2.902577 2.852587 1.323609
v -2.541517 1.518921 1.323609
v -1.443204 1.482148 1.823609
v -1.761935 1.404181 1.823609
v -2.157015 1.307539 1.823609
v -1.402315 1.443748 1.323609
v -1.712096 1.367971 1.323609
v -2.096083 1.274042 1.323609
v -2.202487 1.248014 1.323609
v -2.282794 1.276771 1.823609
v -3.179471 2.517877 1.823609
v -3.082355 2.363521 1.823609
v -3.201300 2.449939 1.323609
v -2.690326 1.637828 1.323609
v -3.216148 2.473542 1.323609
v -2.555919 1.526839 1.823609
v -2.515653 1.462840 1.823609
v -0.658065 3.633807 1.823609
v -0.543294 4.067922 1.823609
v -0.869894 2.832582 1.823609
v -1.012303 2.293916 1.823609
v -1.117452 1.896183 1.823609
v -1.200587 1.581734 1.823609
v -1.211962 1.538714 1.823609
v -0.543502 4.067895 1.323609
v -0.658148 3.634250 1.323609
v -0.870001 2.832924 1.323609
v -1.012433 2.294191 1.323609
v -1.117599 1.896407 1.323609
v -1.200738 1.581918 1.323609
v -1.225858 1.486913 1.323609
v -0.736227 4.043549 1.823609
v -1.222770 3.918625 1.823609
v -1.689818 3.733708 1.823609
v -2.130008 3.491710 1.823609
v -2.536397 3.196452 1.823609
v -2.902577 2.852587 1.823609
v -0.736227 4.043549 1.323609
v -1.222770 3.918625 1.323609
v -1.689818 3.733708 1.323609
v -2.130008 3.491710 1.323609
v -2.536397 3.196452 1.323609
v -2.902577 2.852587 1.323609
v -2.541517 1.518921 1.323609
v -1.443204 1.482148 1.823609
v -1.761935 1.404181 1.823609
v -2.157015 1.307539 1.823609
v -1.402315 1.443748 1.323609
v -1.712096 1.367971 1.323609
v -2.096083 1.274042 1.323609
v -2.202487 1.248014 1.323609
v -2.282794 1.276771 1.823609
v -3.179471 2.517877 1.823609
v -3.082355 2.363521 1.823609
v -3.201300 2.449939 1.323609
v -2.690326 1.637828 1.323609
v -3.216148 2.473542 1.323609
v -2.555919 1.526839 1.823609
v -2.515653 1.462840 1.823609
v -0.658065 3.633807 1.823609
v -0.543294 4.067922 1.823609
v -0.869894 2.832582 1.823609
v -1.012303 2.293916 1.823609
v -1.117452 1.896183 1.823609
v -1.200587 1.581734 1.823609
v -1.211962 1.538714 1.823609
v -0.543502 4.067895 1.323609
v -0.658148 3.634250 1.323609
v -0.870001 2.832924 1.323609
v -1.012433 2.294191 1.323609
v -1.117599 1.896407 1.323609
v -1.200738 1.581918 1.323609
v -1.225858 1.486913 1.323609
vt 0.906501 0.819780
vt 0.863997 0.734163
vt 0.933382 0.789263
vt 0.830638 0.885661
vt 0.735936 0.632469
vt 0.749543 0.937556
vt 0.649841 0.564099
vt 0.664496 0.974645
vt 0.586272 0.513617
vt 0.576838 0.996344
vt 0.536013 0.473706
vt 0.493439 0.500048
vt 0.529137 0.468246
vt 0.487950 1.002311
vt 0.411232 0.993784
vt 0.403561 0.949334
vt 0.444233 0.543882
vt 0.621540 0.581844
vt 0.646337 0.704840
vt 0.649939 0.752501
vt 0.611344 0.987680
vt 0.561669 0.529842
vt 0.101969 0.829295
vt 0.074797 0.799158
vt 0.143861 0.742844
vt 0.271483 0.638784
vt 0.178577 0.894141
vt 0.357285 0.568825
vt 0.260319 0.944875
vt 0.420637 0.517168
vt 0.345905 0.980699
vt 0.470723 0.476328
vt 0.433986 1.001047
vt 0.485854 0.463992
vt 0.513368 0.487889
vt 0.523173 1.005598
vt 0.610222 0.994514
vt 0.638131 0.596255
vt 0.361980 0.708394
vt 0.358800 0.689964
vt 0.363824 0.615514
vt 0.383241 0.598216
vt 0.228657 0.609437
vt 0.227889 0.569587
vt 0.242277 0.569599
vt 0.243043 0.609449
vt 0.191605 0.569556
vt 0.192339 0.609407
vt 0.156774 0.569526
vt 0.157475 0.609378
vt 0.123947 0.569498
vt 0.124617 0.609350
vt 0.093641 0.569473
vt 0.094281 0.609325
vt 0.066333 0.569449
vt 0.066948 0.609302
vt 0.235418 0.609472
vt 0.213962 0.609476
vt 0.217748 0.569454
vt 0.236677 0.569446
vt 0.154563 0.609316
vt 0.135843 0.609311
vt 0.122419 0.569505
vt 0.134371 0.569506
vt 0.161601 0.569510
vt 0.209018 0.569457
vt 0.831520 0.348746
vt 0.830984 0.346555
vt 0.831010 0.346542
vt 0.166653 0.609484
vt 0.158080 0.569477
vt 0.161700 0.569475
vt 0.444701 1.075932
vt 0.445103 1.075735
vt 0.445105 1.075745
vt 0.225869 0.569520
vt 0.240042 0.569522
vt 0.240652 0.609339
vt 0.200988 0.569516
vt 0.222061 0.609334
vt 0.196437 0.609327
vt 0.164675 0.609319
vt 0.227243 0.569444
vt 0.229609 0.569444
vt 0.231621 0.609483
vt 0.089532 0.609473
vt 0.090502 0.569456
vt 0.114379 0.569454
vt 0.113405 0.609474
vt 0.157520 0.609477
vt 0.187179 0.609479
vt 0.209077 0.609481
vt 0.226391 0.609482
vt 0.830996 0.346438
vt 0.830301 0.343602
vt 0.830337 0.343585
vt 0.188073 0.569447
vt 0.209949 0.569446
vn 0.0000 0.0000 1.0000
vn -0.0000 0.0000 -1.0000
vn -0.1874 0.9823 0.0000
vn -0.1253 0.9921 0.0000
vn -0.1873 0.9823 0.0000
vn -0.3090 0.9511 0.0000
vn -0.4258 0.9048 0.0000
vn -0.5358 0.8443 0.0000
vn -0.6374 0.7705 0.0000
vn -0.7290 0.6845 0.0000
vn -0.7705 0.6374 0.0000
vn -0.6233 -0.7800 -0.0552
vn -0.8414 -0.5294 0.1087
vn -0.8413 -0.5295 0.1087
vn 0.2366 -0.9671 0.0936
vn -0.1240 0.0000 0.9923
vn 0.9668 -0.2556 -0.0004
vn -0.0497 -0.0830 0.9953
usemtl Material
s 1
f 168/197/34 196/198/34 197/199/34
f 196/198/34 168/197/34 169/200/34
f 169/200/34 198/201/34 196/198/34
f 198/201/34 169/200/34 170/202/34
f 170/202/34 199/203/34 198/201/34
f 199/203/34 170/202/34 171/204/34
f 171/204/34 200/205/34 199/203/34
f 200/205/34 171/204/34 172/206/34
f 172/206/34 201/207/34 200/205/34
f 181/208/34 202/209/34 201/207/34
f 181/208/34 201/207/34 172/206/34
f 181/208/34 172/206/34 173/210/34
f 173/210/34 189/211/34 190/212/34
f 173/210/34 190/212/34 182/213/34
f 173/210/34 182/213/34 181/208/34
f 186/214/35 180/215/35 192/216/35
f 186/214/35 192/216/35 191/217/35
f 186/214/35 191/217/35 185/218/35
f 174/219/35 203/220/35 204/221/35
f 204/221/35 205/222/35 175/223/35
f 175/223/35 174/219/35 204/221/35
f 205/222/35 206/224/35 176/225/35
f 176/225/35 175/223/35 205/222/35
f 206/224/35 207/226/35 177/227/35
f 177/227/35 176/225/35 206/224/35
f 207/226/35 208/228/35 178/229/35
f 178/229/35 177/227/35 207/226/35
f 208/228/35 209/230/35 184/231/35
f 184/231/35 179/232/35 178/229/35
f 208/228/35 184/231/35 178/229/35
f 179/232/35 184/231/35 185/218/35
f 179/232/35 185/218/35 191/217/35
f 179/232/35 191/217/35 193/233/35
f 187/234/35 180/215/35 186/214/35
f 194/235/34 195/236/34 188/237/34
f 188/237/34 183/238/34 194/235/34
f 194/235/34 183/238/34 182/213/34
f 182/213/34 190/212/34 194/235/34
f 216/239/36 210/240/36 239/241/37
f 239/241/37 245/242/37 216/239/38
f 211/243/39 210/240/36 216/239/36
f 216/239/36 217/244/39 211/243/39
f 212/245/40 211/243/39 217/244/39
f 217/244/39 218/246/40 212/245/40
f 213/247/41 212/245/40 218/246/40
f 218/246/40 219/248/41 213/247/41
f 214/249/42 213/247/41 219/248/41
f 219/248/41 220/250/42 214/249/42
f 215/251/43 214/249/42 220/250/42
f 220/250/42 221/252/43 215/251/43
f 221/253/43 235/254/44 231/255/44
f 231/255/44 215/256/43 221/253/43
f 230/257/45 237/258/45 234/259/45
f 230/257/45 234/259/45 222/260/45
f 230/257/45 222/260/45 229/261/45
f 232/262/46 231/255/46 235/254/46
f 235/263/47 233/264/34 234/265/46
f 234/266/46 237/267/46 236/268/46
f 235/254/46 234/266/46 236/268/46
f 232/262/46 235/254/46 236/268/46
f 229/269/48 228/270/49 227/271/48
f 226/272/48 251/273/48 244/274/48
f 227/275/48 226/272/48 244/274/48
f 227/275/48 244/274/48 223/276/48
f 229/261/48 227/275/48 223/276/48
f 229/261/48 223/276/48 224/277/48
f 229/261/48 224/277/48 225/278/48
f 229/261/48 225/278/48 230/257/48
f 243/279/50 244/280/50 251/281/50
f 245/282/50 239/283/50 238/284/50
f 246/285/50 245/282/50 238/284/50
f 247/286/50 246/285/50 238/284/50
f 248/287/50 247/286/50 238/284/50
f 249/288/50 248/287/50 238/284/50
f 250/289/50 249/288/50 238/284/50
f 238/290/50 240/291/51 241/292/50
f 250/289/50 238/284/50 241/293/50
f 251/281/50 250/289/50 241/293/50
f 251/281/50 241/293/50 242/294/50
f 243/279/50 251/281/50 242/294/50
o Object803_Untitled.016
v -0.237862 4.106507 1.823608
v 0.013300 4.106507 1.823608
v -0.237862 4.106507 1.323608
v 0.013300 4.106507 1.323608
v 0.013300 0.877705 1.823608
v -0.036412 0.904520 1.823608
v -0.149010 0.965259 1.823608
v -0.287421 1.039920 1.823608
v -0.468072 1.137369 1.823608
v -0.723251 1.275018 1.823608
v -1.127037 1.492828 1.823608
v 0.013300 0.818405 1.323608
v -0.032550 0.843136 1.323608
v -0.136400 0.899156 1.323608
v -0.264059 0.968018 1.323608
v -0.430675 1.057895 1.323608
v -0.666029 1.184851 1.323608
v -1.038446 1.385741 1.323608
v -0.543294 4.067922 1.823608
v -0.658065 3.633806 1.823608
v -0.869891 2.832581 1.823608
v -1.012301 2.293915 1.823608
v -1.117452 1.896181 1.823608
v -1.200585 1.581734 1.823608
v -1.225875 1.486845 1.323608
v -1.200738 1.581921 1.323608
v -0.543502 4.067895 1.323608
v -1.211979 1.538647 1.823608
v -0.658148 3.634249 1.323608
v -0.870003 2.832924 1.323608
v -1.012433 2.294190 1.323608
v -1.117599 1.896408 1.323608
v -0.237862 4.106507 1.823608
v 0.013300 4.106507 1.823608
v -0.237862 4.106507 1.323608
v 0.013300 4.106507 1.323608
v 0.013300 0.877705 1.823608
v -0.036412 0.904520 1.823608
v -0.149010 0.965259 1.823608
v -0.287421 1.039920 1.823608
v -0.468072 1.137369 1.823608
v -0.723251 1.275018 1.823608
v -1.127037 1.492828 1.823608
v 0.013300 0.818405 1.323608
v -0.032550 0.843136 1.323608
v -0.136400 0.899156 1.323608
v -0.264059 0.968018 1.323608
v -0.430675 1.057895 1.323608
v -0.666029 1.184851 1.323608
v -1.038446 1.385741 1.323608
v -0.543294 4.067922 1.823608
v -0.658065 3.633806 1.823608
v -0.869891 2.832581 1.823608
v -1.012301 2.293915 1.823608
v -1.117452 1.896181 1.823608
v -1.200585 1.581734 1.823608
v -1.225875 1.486845 1.323608
v -1.200738 1.581921 1.323608
v -0.543502 4.067895 1.323608
v -1.211979 1.538647 1.823608
v -0.658148 3.634249 1.323608
v -0.870003 2.832924 1.323608
v -1.012433 2.294190 1.323608
v -1.117599 1.896408 1.323608
vt 0.965297 0.753231
vt 0.923827 0.798306
vt 0.858126 0.743515
vt 0.600835 0.201239
vt 0.607169 0.171807
vt 0.736864 0.642389
vt 0.596754 0.229838
vt 0.655340 0.574401
vt 0.582885 0.284634
vt 0.595145 0.524202
vt 0.568529 0.351333
vt 0.547555 0.484514
vt 0.545812 0.456874
vt 0.415268 0.124082
vt 0.417879 0.136658
vt 0.031704 0.751362
vt 0.000297 0.706466
vt 0.475187 0.412572
vt 0.485865 0.463983
vt 0.470723 0.476329
vt 0.610502 0.156472
vt 0.995741 0.710786
vt 0.423796 0.165144
vt 0.143861 0.742844
vt 0.074797 0.799158
vt 0.431069 0.200161
vt 0.271484 0.638785
vt 0.440561 0.245863
vt 0.357285 0.568825
vt 0.453970 0.310419
vt 0.420637 0.517169
vt 0.541034 0.479076
vt 0.239292 0.569526
vt 0.238784 0.609484
vt 0.034663 0.609431
vt 0.031619 0.569495
vt 0.216848 0.609382
vt 0.197299 0.609373
vt 0.197384 0.569545
vt 0.216915 0.569553
vt 0.240682 0.569563
vt 0.240622 0.609393
vt 0.176886 0.609528
vt 0.172194 0.609526
vt 0.171786 0.569508
vt 0.237631 0.569529
vt 0.240161 0.569529
vt 0.239866 0.609553
vt 0.231901 0.569527
vt 0.224857 0.569525
vt 0.215663 0.569522
vt 0.202677 0.569518
vt 0.182128 0.569511
vt 0.237121 0.609552
vt 0.230902 0.609549
vt 0.223258 0.609546
vt 0.213280 0.609542
vt 0.199187 0.609537
vt 0.125581 0.609487
vt 0.101682 0.609486
vt 0.102644 0.569469
vt 0.239373 0.569458
vt 0.244602 0.569457
vt 0.240925 0.609495
vt 0.222076 0.569459
vt 0.200198 0.569461
vt 0.170568 0.569463
vt 0.126495 0.569467
vt 0.238552 0.609495
vt 0.221241 0.609494
vt 0.199345 0.609492
vt 0.169691 0.609490
vn 0.0000 0.0000 1.0000
vn 0.0000 0.0000 -1.0000
vn 1.0000 0.0000 0.0000
vn -0.0628 0.9980 -0.0000
vn 0.0000 1.0000 0.0000
vn -0.1253 0.9921 -0.0000
vn -0.4722 -0.8754 0.1038
vn -0.9668 0.2556 0.0004
vn -0.9668 0.2556 0.0007
usemtl 20_-_Default
s 1
f 252/295/52 270/296/52 271/297/52
f 252/295/52 271/297/52 258/298/52
f 252/295/52 258/298/52 257/299/52
f 258/298/52 271/297/52 272/300/52
f 272/300/52 259/301/52 258/298/52
f 259/301/52 272/300/52 273/302/52
f 273/302/52 260/303/52 259/301/52
f 260/303/52 273/302/52 274/304/52
f 274/304/52 261/305/52 260/303/52
f 274/304/52 275/306/52 262/307/52
f 262/307/52 261/305/52 274/304/52
f 263/308/53 264/309/53 254/310/53
f 254/310/53 255/311/53 263/308/53
f 269/312/53 276/313/53 277/314/53
f 256/315/52 253/316/52 252/295/52
f 252/295/52 257/299/52 256/315/52
f 254/310/53 264/309/53 265/317/53
f 254/310/53 265/317/53 280/318/53
f 254/310/53 280/318/53 278/319/53
f 265/317/53 266/320/53 281/321/53
f 281/321/53 280/318/53 265/317/53
f 266/320/53 267/322/53 282/323/53
f 282/323/53 281/321/53 266/320/53
f 267/322/53 268/324/53 283/325/53
f 283/325/53 282/323/53 267/322/53
f 269/312/53 277/314/53 283/325/53
f 283/325/53 268/324/53 269/312/53
f 279/326/52 262/307/52 275/306/52
f 287/327/54 285/328/54 288/329/54
f 288/329/54 295/330/54 287/327/54
f 284/331/55 285/332/56 287/333/56
f 287/333/56 286/334/55 284/331/55
f 310/335/57 302/336/57 284/331/55
f 284/331/55 286/334/55 310/335/57
f 294/337/58 311/338/58 308/339/58
f 296/340/58 295/341/58 288/342/58
f 297/343/58 296/340/58 288/342/58
f 298/344/58 297/343/58 288/342/58
f 299/345/58 298/344/58 288/342/58
f 300/346/58 299/345/58 288/342/58
f 301/347/58 300/346/58 288/342/58
f 308/339/58 301/347/58 288/342/58
f 308/339/58 288/342/58 289/348/58
f 308/339/58 289/348/58 290/349/58
f 308/339/58 290/349/58 291/350/58
f 308/339/58 291/350/58 292/351/58
f 308/339/58 292/351/58 293/352/58
f 294/337/58 308/339/58 293/352/58
f 303/353/59 302/354/59 310/355/59
f 309/356/59 308/357/59 311/358/59
f 315/359/59 309/356/59 311/358/59
f 314/360/59 315/359/59 311/358/59
f 313/361/59 314/360/59 311/358/59
f 312/362/59 313/361/59 311/358/59
f 310/355/59 312/362/59 311/358/59
f 310/355/59 311/358/59 307/363/60
f 310/355/59 307/363/60 306/364/59
f 310/355/59 306/364/59 305/365/59
f 310/355/59 305/365/59 304/366/59
f 303/353/59 310/355/59 304/366/59
