<svg width="39" height="39" viewBox="0 0 39 39" fill="none" xmlns="http://www.w3.org/2000/svg">
<path d="M28.0312 26.7091L19.5 31.508L10.9688 26.7091V21.639L8.53125 20.2848V28.1346L19.5 34.3045L30.4688 28.1346V20.2848L28.0312 21.639V26.7091Z" fill="black"/>
<path d="M19.5 3.50215L2.4375 12.3494V14.4619L19.5 23.9408L34.125 15.8161V22.5469H36.5625V12.3494L19.5 3.50215ZM31.6875 14.3819L29.25 15.736L19.5 21.1529L9.75 15.736L7.3125 14.3819L5.62308 13.4433L19.5 6.24784L33.3769 13.4433L31.6875 14.3819Z" fill="black"/>
</svg>
