{
  "dependencies": {
    "mssql1": {
      "type": "mssql.local",
      "connectionId": "mydb",
      "secretStore": "LocalSecretsFile"
    },
    "secrets1": {
      "resourceId": null,
      "type": "secrets.user",
      "connectionId": null,
      "secretStore": null
    }
  }
}