read a, b, c, D;
if a!0 then
    D=b*b-4*a*c;
        if D>0 then
            x1=(-b+SQRT(D))/(2*a);
            x2=(-b-SQRT(D))/(2*a);
        else    
            Write x1, x2;
        if D=0 then
            x1=(-b)/(2*a);
            x2=x1;
        else
            write "Ecuatia nu are solutii reale"
else
    write "Ecuatia nu are solutii reale"
