[
    {
        "name": "google",
        "channelType": "REST",
        "channel": "http://localhost:8000/",
        "role": "SWPeerForSearch"
    },
    {
        "name": "peerOrch",
        "channelType": "Email",
        "channel": "peerOrch@localhost",
        "role": "RQAOrchestrator"
    },
    {
        "name": "peer1",
        "channelType": "Email",
        "channel": "peer1@localhost",
        "role": "HumanExpert"
    },
    {
        "name": "peer2",
        "channelType": "Email",
        "channel": "peer2@localhost",
        "role": "HumanExpert"
    }
]

