-9.57642873172267e-06
-0.00035409363454631413
0.0017897073677572576
0.018810946848567493
0.004658216982059419
0.029249248775318586
0.03401640841204634
0.05695844878553921
0.042964118868590244
0.0423863153298783
0.01884950302042364
0.02976128678323914
0.12099745819975549
0.10670845009848856
0.06210389650999543
0.02679108929537264
0.0693097535036988
0.025931777667345467
0.0662575059726214
0.15252988054608674
0.12708391034652147
0.10213065362882427
0.10073072717192595
0.1590169249989899
0.15672730083823705
0.1317056830681187
0.20097859503851184
0.17111829123740174
0.15864791607339215
0.12833301357475424
0.1737216909383167
0.19313421202360365
0.20026503627745224
0.15294307171980087
0.2205740600310654
0.21644310090504004
0.2552076454614308
0.20365171181477368
0.21252343498573928
0.23036642507447125
0.22246916928219418
0.2732924594480913
0.2763457304597005
0.30731898089359727
0.25060795638817845
0.26275850330961537
0.3076484727850467
0.1877044951246289
0.24313203351610208
0.2836942735832675
0.284832646197949
0.2943707789847001
0.30500398986637905
0.34263772347816546
0.30766586878561686
0.304854585528602
0.2982286713923441
0.3232332823337313
0.3395864753586034
0.31504813088677486
0.3423288642004405
0.3272775702796573
0.3441566152619808
0.2749338692908016
0.3282306776136885
0.35983333643562887
0.3646693048768188
0.39555259035010437
0.4175371554911314
0.3783521680470878
0.39653592799509113
0.41239210922614994
0.4731757587985853
0.4142959051254306
0.42270325454835933
0.4285884925348965
0.4546367827912545
0.4417113152441098
0.49707034337614264
0.533160074836943
0.4976855229686893
0.4682218987678063
0.4614585965524858
0.44512560690689096
0.43197152942056893
0.5235208401283389
0.4897648823107055
0.48016952538902435
0.5005250601373603
0.5288475235567549
0.5180033243893197
0.4460768216562081
0.5167399042050013
0.6165541351656691
0.5442860389156224
0.5385436725952616
0.5326898175149228
0.49229246256057047
0.5726443230641207
0.6141644479655697
0.6020102472669623
0.6088756483521888
0.5705689818713813
0.5527705300207189
0.5697404334407261
0.5984307482430484
0.6322770106649624
0.6289827046712668
0.5996511029427447
0.6774139361009321
0.5807744050062247
0.5909558371540657
0.6667263937515568
0.6976989013559594
0.7012842971720407
0.5915378706478407
0.5722761628093049
0.6501548112412069
0.7090333240549307
0.637682974802476
0.6171159797253245
0.6267785064747539
0.6699521049861762
0.7127952401248718
0.7085161898998922
0.691077441876145
0.6862431801626465
0.6986726894187635
0.690458778384087
0.712990677463358
0.6819064923163355
0.736436381311744
0.723955518428236
0.7348850821272765
0.783144564932099
0.7579875532077546
0.7313175824258034
0.6953703831290751
0.7703492750257197
0.7772935797376181
0.7773719530864776
0.7943044088268716
0.771246234729423
0.7378093091749317
0.7938605589914651
0.8020613914970366
0.8517431967219604
0.7894902002981506
0.7112438192059485
0.8017310803494739
0.8452617811218859
0.8303933594426249
0.7867402307446356
0.8348269456239004
0.7856939660079023
0.8282254397282818
0.7858227441221503
0.8004497529362531
0.7861407929322698
0.7644540143533523
0.8320771111571609
0.8051561263832625
0.9290273880108086
0.8455998883889858
0.7972914301336451
0.9020530062938046
0.8625994737190472
0.8787834099544456
0.8661446972119621
0.8847355250493978
0.8389673990812117
0.8876650347344118
0.8844236468355193
0.8603722350056131
0.8577086919343566
0.8662358173805303
0.832824543225319
0.8927410144277983
0.8824574996789606
0.8615037259684076
0.9014653669821294
0.8600800736396668
0.9080954761903832
0.9044894665468111
0.9209743400030026
0.9090018936214252
0.9459498800634057
0.9099855558223567
0.8624161014839767
0.8714075632471294
0.9814359701679864
0.9680883736494905
0.9473694627361547
0.8908740022118674
0.9071862650637514
0.9424645121991877
0.9421912300989077
0.9079214161916557
1.015362259658588
0.9053426339898508
1.0240293987936258
1.0105405683222775
0.9274515661591116
0.9764514994762626
0.9571443792557768
0.9735572974902276
0.901090053026418
0.9958595242019673
0.9861897349234946
0.9424028485500613
0.9244381447354489
0.9367110701396021
0.9272814592664369
0.9500899741847659
1.0021335843383872
0.9620519879813108
0.9074288157147927
0.9605013824594206
0.9659010728796836
0.946298007351464
0.875127612044619
1.0123112455137897
1.062086881896866
0.934153359249652
1.0076806810811656
0.9754857621843943
0.9413211505252896
0.9972548732855916
0.9869833734029785
1.0255907904570065
0.998701794676369
0.9864196288086537
0.9803478107789896
1.0252314269207696
0.9026172051296573
1.0074022788185104
1.0118018700791498
0.9895749776635858
1.00375312386074
0.9320581054218993
0.968102986240959
0.961988257275231
0.9522357449933019
0.9589952775614825
1.003445507574681
1.0046591845095816
0.969511420318975
1.0262661157186692
0.9833231841310136
1.0027864264205055
1.022090324228241
0.9533014641272745
0.9375673976213195
0.9208148426943515
1.0215169031700388
1.0752465816728118
0.9623375468778227
0.9584932838827689
1.0200798652657173
0.9818616253435232
0.9913839558634094
1.0338946120955281
1.0503631857643485
0.9867928931910149
1.0546699252066447
1.0262869231241059
0.9506631027623018
0.9886129564645552
0.990093229027782
1.0664608643263023
0.9728012461552044
0.9401362090186466
1.0415542673855558
0.9684864814401242
0.9538053589054394
0.9208248261915436
1.0157767897811154
1.026181179843427
0.9702286495534811
0.9902768895551244
0.948451259489059
0.9442716754934953
0.9889373038613576
0.9764267960357741
1.031874762943363
1.0042220485035327
0.9784723309344887
0.9746917769966331
0.9970839901123332
0.9541994811830462
0.9092604953331562
1.0048662565592243
0.9577277468898768
1.0386046701475733
1.0119516505826462
0.8955696691945529
0.89964634938388
0.9019244043292798
0.9603596598207881
0.9892084663089162
0.9370759785708392
0.9815949792765
0.9006457690074228
0.9126882566615182
0.9236903388683999
0.9573033418234549
0.9184535428938227
0.9456305960470507
0.9133829738293264
0.932157968399981
0.8976768214384847
0.9245770700005675
0.9152504628974352
0.8710444337031966
0.9389896180389659
0.9641833200663465
0.9368813528846449
0.9657390475728036
0.9161353212454458
0.8688736767939347
0.8604574747886532
0.9403064357591281
0.8821104720036762
0.8804180561219885
0.8435556970008338
0.8248543733880991
0.9146731168759394
0.9163983005726593
0.8968070070837888
0.9058345840874453
0.9193608170980458
0.892725531466585
0.8904664493030059
0.9060537214945421
0.8651270671971771
0.8705022131923436
0.8977841075926116
0.9122622222842625
0.849708644669668
0.7829776356664333
0.8178932248159438
0.8666952531867532
0.8340581220713166
0.8086280733490285
0.7959310562556894
0.8397760198647046
0.7827387314981354
0.8276411761857717
0.8610229674988686
0.8151038386353793
0.8201223483869512
0.8115336226637372
0.8212975238045439
0.8174962285421907
0.8638522820539826
0.7881713765334897
0.7995137258862928
0.8056624820125269
0.7945481369979048
0.7648277299353676
0.7813142321452979
0.7854547661286346
0.8168117889299342
0.7964742273988561
0.776046690742487
0.7070206046028289
0.7618024619270238
0.8181028919917565
0.7663974680980601
0.705148542261304
0.7570608026019688
0.7610426619362664
0.7029505549873504
0.7059117139127815
0.6809205852116057
0.7096838681582378
0.7163565675500959
0.7590663465149061
0.7177631937634685
0.7101361858587203
0.7286300436296551
0.6434923474861478
0.6390326984774795
0.6416785493490897
0.7240779248462561
0.6870419591882216
0.6823359524673567
0.6296268256366729
0.697512189596663
0.5724199160626833
0.6251238324545567
0.6325376916562737
0.6163656077938553
0.6362293134673394
0.5857669925174642
0.5705031054609142
0.6534085073641596
0.5786877934370924
0.582172538703412
0.6338712483425253
0.5978989088497816
0.6079880420861911
0.5955735793720461
0.561500817160949
0.5196538761828923
0.5203775501991379
0.47295372744672637
0.5741911995579996
0.5983068563301631
0.5784551382175042
0.5535759943113272
0.537566779202498
0.5179462044054741
0.5482852926488975
0.46247339205072824
0.505852316840446
0.5187629825699932
0.4399400797557661
0.45449898547477474
0.5335002561977403
0.5016752168463254
0.4380281732418041
0.47999389995923436
0.46051503764076795
0.49995124880223546
0.46529004360307513
0.4778804175349928
0.4954671722868951
0.44105983751446154
0.4902647963903493
0.451897557302335
0.4406432196705792
0.44131559339066617
0.40830897917346937
0.4734844214029964
0.34935639103036
0.35829476212324496
0.42241073310998134
0.4124065856887667
0.36429885128966843
0.36374417753561106
0.36964942245656235
0.3763728798537057
0.36939642666281436
0.3352833182716371
0.32608924034829534
0.3555395655303761
0.37362267827853013
0.3547353116329771
0.3149405734382143
0.3646107775828803
0.3116522486686236
0.33292565673061203
0.3352564826291573
0.3100376982845545
0.31507195912471897
0.3663931882524206
0.3078576370761471
0.2810919944004049
0.20309941408913804
0.3073607738556948
0.29192842087321264
0.20173303255062253
0.30415212975636186
0.295409937385829
0.22194621946031068
0.2572939394044277
0.22130695565094116
0.21825941344023175
0.18047099223234583
0.17248192744138022
0.08903471489658532
0.15927944328367427
0.17548197846285096
0.18576061712963787
0.11641779712119399
0.11849430930938594
0.1495424608189168
0.16086181446938036
0.13937124915558102
0.11063804500541785
0.17953624721407285
0.18481723390894758
0.07550219367502206
0.07537159994853418
0.10252691023052656
0.12543604058858654
0.14821574541886806
0.153782656244558
0.08937915731386951
0.0679322971610431
0.10585327358975952
0.08291211066342541
0.03661101363080154
0.04023720571189349
0.1135030488222044
0.058978566642731545
0.03455737863406092
0.08569714152358641
0.029589290899090744
-0.012482776741424548
0.0037496440123814985
-0.012227008269408453
-0.02264756475651023
0.009156893860641713
-0.005850947581992562
-0.03720055672911304
0.006447343727504093
-0.025605547226985232
-0.06448308772600743
-0.026382794673000795
-0.07179892797261259
-0.07603354809461338
-0.04119154115665859
-0.03596431447131169
-0.06609671541829608
-0.15386858787339264
-0.13003084070504028
-0.11958482642452295
-0.08876329040167207
-0.0777247823676265
-0.12139114214392073
-0.13401608814812133
-0.14159528058186166
-0.07494124929617882
-0.15111679768303277
-0.16805510512911787
-0.18362587078403203
-0.15780879411395396
-0.113362456492575
-0.15954831810775832
-0.20209210542821626
-0.1257657057575265
-0.1853351290380035
-0.18895404424794698
-0.27666736781529466
-0.26607968269432053
-0.19054176269756362
-0.17742212576765598
-0.13755108423090961
-0.18308224472705226
-0.24731861240375388
-0.22634000066859852
-0.24632751882942155
-0.24360077915546297
-0.26439304949013265
-0.31430832212000015
-0.2243799168314516
-0.26247059638849
-0.2803856001066435
-0.28581201076511353
-0.311880475949319
-0.30188272112935244
-0.31382666094724904
-0.25839427010156263
-0.3108131239233263
-0.32710974934328746
-0.3520237458064951
-0.3926595837927772
-0.4083574883564158
-0.4252073908870082
-0.4024294082030232
-0.32442465004178467
-0.37910857742555615
-0.3991988148489159
-0.3463690242305344
-0.3395798778200724
-0.3621805133017427
-0.3839089523477649
-0.462884723827188
-0.3966101478671645
-0.36504707583768825
-0.42866841865582095
-0.44961682742149656
-0.45044560874616624
-0.39400906297521177
-0.45704689952936994
-0.48433261100821096
-0.4674300942273068
-0.43600187974670945
-0.40067812848117657
-0.47826672246849194
-0.44658760836850586
-0.4771292988098068
-0.4620941946966217
-0.4416757783002728
-0.5114982479962105
-0.5352580512822869
-0.43082445451237883
-0.5260934480512082
-0.5498916447032884
-0.5717685887299734
-0.48692281834125195
-0.5732997053493954
-0.5717385919179241
-0.5422805963609909
-0.6277123399662328
-0.5865205331973171
-0.6008250959823358
-0.5611760931410004
-0.5887307345973689
-0.587404053621603
-0.5352538954687707
-0.5576299575079109
-0.5373388759195079
-0.5791112729686962
-0.5867781263596967
-0.6025630331941403
-0.5788141786021928
-0.6419409731965069
-0.6742030604811386
-0.6255943884673187
-0.5330924078147503
-0.6264410398326699
-0.650579996817735
-0.6423219047297055
-0.5866684677525498
-0.6947745770837137
-0.6887750921250908
-0.6161226940730806
-0.6610800321912433
-0.6370271407407359
-0.7209433766182279
-0.7073906778966883
-0.6813492551327326
-0.7033781028463361
-0.7094638913562852
-0.688835142793425
-0.6977600038019409
-0.7145080761011486
-0.765077638846456
-0.7276004541885496
-0.7115803670632466
-0.7068976397570798
-0.7346122129546886
-0.8121699600730841
-0.7345699346012822
-0.8074513240698032
-0.7359514613921592
-0.7734055374290325
-0.7691929091240151
-0.7434487190185679
-0.7638412043721655
-0.7679393279406974
-0.7700128832372442
-0.7749840664226734
-0.7221466122481581
-0.7873029259543938
-0.7903985002929038
-0.8023227723705892
-0.8347280845810199
-0.8141304835133824
-0.7172648502381849
-0.7476734224120059
-0.7792893402967067
-0.771660152113441
-0.805088123846398
-0.7703069693582494
-0.8264084076864754
-0.8596481946298917
-0.8418194349883034
-0.8594528524044054
-0.8672235784665714
-0.8232263670534645
-0.8726540291007145
-0.8362919977349791
-0.8089093368205365
-0.8389069807322833
-0.8890955395540227
-0.9262644611630233
-0.9023120047994614
-0.8264606137338226
-0.8335625811069176
-0.8420997987253662
-0.8921074479652666
-0.8951261921958358
-0.8866342169553145
-0.9067233026915136
-0.8915318595269905
-0.8503671804344177
-0.9205368241557759
-0.8987855277684378
-0.8453086046114071
-0.9154807263762442
-0.9105695100279523
-0.9240875976192978
-0.922844763984074
-0.8746692613466962
-0.9559751150553844
-0.9419813231876824
-0.927847956543965
-0.9425361715900724
-0.9244626043815567
-0.8886079551467811
-0.8953841330794609
-0.9204448726125045
-0.9975688267103339
-0.9062577920794674
-0.946852190552728
-0.973788234344139
-0.9469511201343919
-0.9475419387893608
-0.9446978257338261
-0.9721893218128974
-0.9355518419301778
-0.9835908500243631
-0.9458728415872738
-0.98192342293025
-0.9251876332171747
-0.893640029544116
-0.8971631158076467
-0.9756630732646963
-0.9550013447143405
-0.969963525763524
-0.9311703252976568
-0.9115791240271383
-0.9846097138064184
-0.9864041946679543
-1.0035624246664177
-0.9696304694931926
-0.9524953735736418
-0.9926034043086285
-0.962130452052647
-0.9634603990368676
-1.0120732952507385
-0.9536254976640868
-0.8538881572631054
-0.94250509489244
-0.9940423630851164
-1.029782233470534
-1.0200474240473887
-0.9548127739332226
-0.9864375127468521
-1.0003223243542818
-0.9933297425689198
-0.9966600009676603
-0.9208510103671876
-1.0137063126027577
-0.9808914029370949
-1.0075624125946652
-0.9983863524827883
-0.9671949274756781
-0.9568366304321564
-1.0236724377144373
-1.0006960180490145
-0.9131833116349213
-0.9555544917409242
-0.9225081651030218
-1.0071130377314692
-0.9968432354783162
-1.0091786084016674
-0.9983311656044311
-1.0511070790275574
-0.9788517397468639
-1.0201720827197658
-1.042245695151629
-0.9680431874468051
-0.9791784152326706
-0.9711941604439863
-0.9883098702051792
-0.9924195819963881
-1.0445209320680022
-1.0239337527324244
-0.9837477253744316
-0.989018458404527
-0.9645412104631973
-0.9938489577225269
-1.0364731640850686
-0.9656176726412838
-1.035280543295027
-1.0577062842224487
-0.9978413702882141
-0.9407270220899547
-0.9592800878927155
-0.9505433576370417
-1.0833771614063012
-0.9843404178645081
-0.953399405833132
-1.0108092536592874
-0.9544807729373483
-0.9911546505405467
-1.0132468238597732
-1.0299903618199533
-1.0233468096902267
-0.9264575278658632
-0.9686846044957442
-1.0083440640737544
-0.9859977057093829
-0.9937674454413299
-1.0097320583480678
-0.9379404363237385
-0.9311010842911588
-0.938675207912344
-0.9891751287451955
-1.006170416484451
-0.9714387886613065
-0.9722833976839547
-0.9526135045659505
-0.969921731219393
-0.976973811922906
-0.9528648819754736
-0.9260637926885427
-0.958775705702409
-0.9236758720827616
-0.9751766686913428
-0.9910061770043006
-0.9217368155110642
-0.9078343802021234
-0.8635774945467547
-0.9363682142194915
-0.9729055382091636
-0.8772457795173508
-0.8616307278397425
-0.8878699927672298
-0.9365927293755583
-0.9095584069254101
-0.9375108346511871
-0.919547315680437
-0.9522258779632422
-0.9332647799774514
-0.8814952000069092
-0.905093394884241
-0.9426581291718246
-0.8816182545522702
-0.9255741949635381
-0.8941004417997953
-0.8644370408144397
-0.805312742564684
-0.8581605528011533
-0.8952435271341073
-0.8613564824248721
-0.9181461134902498
-0.9011351198639173
-0.9108480485711441
-0.8943124524476223
-0.8609551856623414
-0.7837912462537442
-0.8853656143305468
-0.8896007108829656
-0.9104653212918928
-0.8583394827983961
-0.8437042381038315
-0.799612303199721
-0.84558030329413
-0.7877797615830275
-0.8483633154558723
-0.8230460159383728
-0.8164822676126997
-0.7707439200633268
-0.756993030616544
-0.8041329207963988
-0.7584819655109944
-0.7969364225087746
-0.835662022848975
-0.8102482117051228
-0.7364749705719412
-0.7255644437380566
-0.778227434877121
-0.7640630980743787
-0.8382304206242438
-0.783943104419764
-0.7766419715804953
-0.766226397691007
-0.7301441997452518
-0.7700377750690202
-0.7317696382495619
-0.7709502745726134
-0.7449104213431835
-0.7072765549572838
-0.7976530850587509
-0.7902568290902912
-0.7418394179690486
-0.7040285637646657
-0.7257458664111267
-0.7271476343715807
-0.7110759261599546
-0.6802773893444437
-0.6407758460490769
-0.6896528308780676
-0.7182504211360092
-0.6787500112492202
-0.6244513609775907
-0.6743233210277537
-0.6795084138388348
-0.6647012199720671
-0.6758864447044807
-0.664238384552562
-0.687534659074123
-0.6803314874444307
-0.646548627528519
-0.612773186085902
-0.681435001035415
-0.6681628284492737
-0.6708749795442128
-0.6406803772825107
-0.5734048561768152
-0.6451992160432639
-0.6483995599724479
-0.6096533987988548
-0.6478995648781366
-0.5827181039143852
-0.5497083379028256
-0.5805671287442008
-0.571634130818159
-0.59795530883831
-0.6195464205933032
-0.5124418026148573
-0.5686300289477417
-0.4795133841277355
-0.5611282233011397
-0.5472424857218152
-0.564578579849006
-0.5230124093153865
-0.505867744517092
-0.5165069678615131
-0.49173333845758865
-0.539466874627486
-0.490405207511019
-0.44944336721504047
-0.4945954647582169
-0.5558594219705388
-0.5101364143672459
-0.522854850972157
-0.5111255544576279
-0.4189043387999441
-0.43018426820648537
-0.45493180304464664
-0.42874534343396986
-0.4362227311117405
-0.45853505431693475
-0.41821757775490176
-0.43344572945178
-0.413603413491085
-0.42756629561962156
-0.3946261015469006
-0.39881260590108514
-0.38668592387324113
-0.4246399122689023
-0.3863997930169307
-0.3693898382957771
-0.3810551685183773
-0.4088551120664168
-0.3697430529163618
-0.3146034544014463
-0.3031048067374481
-0.3049681171840522
-0.3529002053129857
-0.3304961324105731
-0.358643583069084
-0.372793873553862
-0.2628949465701055
-0.2676747230036503
-0.3438607472719537
-0.42093068392539024
-0.29866067260482443
-0.250514945068007
-0.22798209847360446
-0.3284503775361831
-0.2256489618918771
-0.20176411834326174
-0.2701148213092007
-0.2580697525890167
-0.21795708129658248
-0.22629911102903746
-0.23944429328546596
-0.22719616700633588
-0.25228372631814233
-0.2600686642787352
-0.16424644224714674
-0.20671491597124314
-0.25700812216671165
-0.17924235174887243
-0.21398679903088563
-0.21029733970221443
-0.18067233389549642
-0.15972415141851176
-0.18813467573455595
-0.1760991911023227
-0.16915663141471105
-0.14399287385620851
-0.1263931463263611
-0.14494709046659074
-0.1892705651419444
-0.09924668345689058
-0.1145173412682616
-0.07887816797545352
-0.08695533057168069
-0.09496705424306662
-0.1652751475820584
-0.013121883041204731
-0.05508213910645296
-0.0572887703171806
-0.08328252416108956
-0.06480709254918599
-0.030995580298105452
-0.033552564076381734
-0.09405387861626341
-0.08542783521136224
0.015680220501304437
0.018669796844495854
