// ----------------------------------------------------------------------------
// Smart High-Level Synthesis Tool Version 2022.2.1
// Copyright (c) 2015-2022 Microchip Technology Inc. All Rights Reserved.
// For support, please visit https://microchiptech.github.io/fpga-hls-docs/techsupport.html.
// Date: Wed May 31 11:43:09 2023
// ----------------------------------------------------------------------------
Target FPGA: MICROSEMI PolarFire
Project type: hw_onlyClock period constraint: -1ns
Start Function: hw_fir
state: LEGUP_0, basic block: LEGUP_0
   Transition: if (<null>): LEGUP_pipeline_wait_hw_fir_1 default: LEGUP_0
state: LEGUP_pipeline_wait_hw_fir_1, basic block: BB_init_check, pipeline type: function, pipeline ID: _Z6hw_firN3hls8ap_fixptILj32ELi2ELNS_19AP_FIXPT_QUANT_MODEE6ELNS_18AP_FIXPT_OVER_MODEE1EEE, II: 1, length: 5, trip count: 0
   ret i32 %newCurOp._285, !MSB !5224, !LSB !5186, !extendFrom !5224, !legup.II !5220, !legup.totalTime !5217, !legup.maxStage !5199, !legup.tripCount !5186, !legup.pipeline.start_time !5199, !legup.pipeline.avail_time !5199, !legup.pipeline.stage !5199, !legup.function_pipelined !5220
   Transition: if (<null>): LEGUP_0 default: LEGUP_pipeline_wait_hw_fir_1

Basic Block: BB_init_check, Num States: 5, Location: <>
End Function: hw_fir
--------------------------------------------------------------------------------

