00000000000000000000000000000000
11111111111101000001000110011001
11111111001100010001010101100001
00000110000001000100011000000010
00011000100011000101100010111111
00101001100010100100110000010100
00110110101100010101011010010011
00111101000110110011111011011011
00111110111101000010110110010011
00111000011001111010101011010000
00101111101100000001101011010101
00100000101110001100101100011101
00001101100101101101101010110010
11111001110000011001100001111101
11100101010010000101010111001010
11010101110001001010011111101110
11001001100100001100000011011000
11000001000100000000000001101100
10111111111100110000001101001000
11000111001110010011101011001100
