"","X","ent","year","nom_ent","CIFNEG","NDENAU","DEN4HO","MDECMP","MDECPM","MDECPE","MDESPE","MDESPM","MDESMP","PINSCO","PINSES","PINSMU","ifrasid","nom_ent2"
"1",1,"01",2014,"Aguascalientes",91.5,59.35,38.39,11.36,14.34,11.33,7.79,11.44,11.36,32.75,49.04,41.96,-0.72,"Ags."
"2",2,"02",2014,"Baja California",90.73,56.93,10.1,14.11,18.13,16.21,9.6,11.18,10.74,45.78,53.67,56.6,-0.24,"BC"
"3",3,"03",2014,"Baja California Sur",84.77,65.4,20.98,16.57,12.72,12.58,9.91,10.39,14.48,32.62,39.3,38.86,-0.77,"BCS"
"4",4,"04",2014,"Campeche",91.38,52.78,17.9,10.65,10.35,10.42,7.45,7.51,8.68,35.23,58.86,57.65,-0.99,"Camp."
"5",5,"05",2014,"Coahuila de Zaragoza",89.59,59.12,27.47,19.18,26.76,15.45,11.02,17.12,17.48,38.95,78.48,65.19,0.76,"Coah."
"6",6,"06",2014,"Colima",85.73,56.14,14.62,11.58,8.21,9.18,5.76,4.88,9.43,33.23,56.92,50,-1.43,"Col."
"7",7,"07",2014,"Chiapas",92.05,53.36,28.88,11.34,14.07,8.62,6.1,9.53,8.87,35.99,61.98,58.57,-0.8,"Chis."
"8",8,"08",2014,"Chihuahua",88.4,56.27,11.29,17.04,20.9,18.26,12.47,14.09,13.33,31.94,75.13,64.65,0.23,"Chih."
"9",9,"09",2014,"Ciudad de México",94.07,73.59,43.54,36.75,14.3,18.21,16.55,13,33.78,51.48,77.5,64.18,2.2,"CDMX"
"10",10,"10",2014,"Durango",90.11,60.72,31.95,15.23,21.9,21.45,15.56,16.39,13.38,35.28,73.51,63.05,0.77,"Dgo."
"11",11,"11",2014,"Guanajuato",94.95,52.36,31.58,13.3,18.12,9.32,6.53,13.58,12.19,50.89,64.96,65.52,-0.03,"Gto."
"12",12,"12",2014,"Guerrero",96.76,43.5,36.68,17.5,23.13,13.02,10.51,16.28,12.61,39.27,78.83,68.27,0.49,"Gro."
"13",13,"13",2014,"Hidalgo",93.57,59.84,28.48,12.7,14.42,11.91,8.15,10.48,11.66,40.5,65.53,59.67,-0.24,"Hgo."
"14",14,"14",2014,"Jalisco",93.84,61.18,31.95,17.13,17.9,12.54,8.04,12.47,12.67,41.41,68.03,59.12,0.12,"Jal."
"15",15,"15",2014,"México",95.78,76.41,36.88,23.86,23.22,18.23,14.65,17.74,20.1,68.99,92.67,83.74,2.35,"Mex."
"16",16,"16",2014,"Michoacán de Ocampo",93.64,56.26,16.22,19.4,25.17,19.31,14.45,17.51,14.78,38.48,81.96,63.4,0.93,"Mich."
"17",17,"17",2014,"Morelos",91.86,58,28.37,21.68,25.62,21.83,17.02,19.21,16.67,57.22,89,79.24,1.85,"Mor."
"18",18,"18",2014,"Nayarit",91.53,50,17.1,14.8,18.13,15.66,10.64,11.58,10.86,26.58,50.9,45.2,-0.63,"Nay."
"19",19,"19",2014,"Nuevo León",92.04,63.05,25.68,9.24,13.19,7.16,4.69,8.16,8.03,34.75,73.01,53.07,-0.93,"NL"
"20",20,"20",2014,"Oaxaca",95.19,55.29,46.45,13.72,11.85,8.92,6.12,9.28,11.5,36.68,76.78,55.06,-0.39,"Oax."
"21",21,"21",2014,"Puebla",94.96,59.29,35.37,18.14,18.74,14.26,11.04,15.41,16.91,43.84,63.56,59.71,0.57,"Pue."
"22",22,"22",2014,"Querétaro",93.5,60.11,28.27,14.36,12.21,9.24,7.14,9.61,13.02,38.58,38.81,41.56,-0.8,"Qro."
"23",23,"23",2014,"Quintana Roo",90.35,65.73,21.16,16.2,18.16,11.94,9.55,13.4,12.19,45.13,67,63.48,0.14,"Q. Roo"
"24",24,"24",2014,"San Luis Potosí",94.8,59.51,24.92,13.26,20.99,17.25,12.41,14.04,9.89,38.28,73.46,60.29,0.34,"SLP"
"25",25,"25",2014,"Sinaloa",91.31,47.27,18.55,9.64,18.55,10.67,5.02,9.76,6.07,31.09,72.18,61.32,-0.94,"Sin."
"26",26,"26",2014,"Sonora",89.71,58.37,21.36,14.04,17.63,15.49,10.44,14.61,10.02,36.71,57.06,53.23,-0.22,"Son."
"27",27,"27",2014,"Tabasco",92.13,64.9,48.4,19.03,11.59,18.92,14.36,10,16.49,58.86,86.02,79.29,1.28,"Tab."
"28",28,"28",2014,"Tamaulipas",93.9,56.67,13.23,12.24,6.43,13.6,9.22,4.87,9.09,41.86,83.92,72.64,-0.37,"Tamps."
"29",29,"29",2014,"Tlaxcala",90.26,55.54,39.17,12.16,15.22,10.09,6.64,12.45,8.62,42.76,59.94,55.01,-0.51,"Tlax."
"30",30,"30",2014,"Veracruz de Ignacio de la Llave",94.5,53.32,23.66,16.98,15.67,15.18,10.98,12.36,14.41,44.74,80.73,68.26,0.43,"Ver."
"31",31,"31",2014,"Yucatán",90.19,44.93,18.22,8.23,11.9,5.9,4.79,8.92,6.3,28.07,29.34,33.93,-2.03,"Yuc."
"32",32,"32",2014,"Zacatecas",92.79,43.27,11.21,9.82,24.31,8.66,4.87,17.77,7.33,39.25,80.61,67.68,-0.43,"Zac."
"33",34,"01",2015,"Aguascalientes",93.43,56.05,23.32,11.6,16.1,10.26,6.58,11.26,7.47,35.2,43.03,39.62,1.31,"Ags."
"34",35,"02",2015,"Baja California",90.13,59.36,15.39,16.43,23.75,18.1,11.36,13.73,11.44,41.49,53.05,54.68,0.13,"BC"
"35",36,"03",2015,"Baja California Sur",88.77,63.6,15.9,17.05,17.79,15.03,11.43,12.88,14.56,38.35,62.06,56.79,0.12,"BCS"
"36",37,"04",2015,"Campeche",89.72,58.14,45.68,12.51,7.92,14.68,9.74,4.52,9.87,35.95,53.56,54.14,0.84,"Camp."
"37",38,"05",2015,"Coahuila de Zaragoza",90.35,63.27,24.55,15.93,22.92,16.9,12.74,16.89,14.85,33.92,74.88,61.68,-0.37,"Coah."
"38",39,"06",2015,"Colima",90.31,58.57,15.77,13.97,7.22,9.99,7.93,5.66,12.16,32.92,56.57,47.55,1.24,"Col."
"39",40,"07",2015,"Chiapas",93.55,51.64,29.86,12.75,15.6,11.6,7.47,10.42,8.19,31.82,54.47,53.51,0.98,"Chis."
"40",41,"08",2015,"Chihuahua",90.49,57.98,19.13,19.87,21.27,19.88,14.93,14.71,17.81,28.03,73.55,61.81,-0.43,"Chih."
"41",42,"09",2015,"Ciudad de México",92.25,77.62,32.2,31.12,13.99,17.19,14.28,11.62,28.15,48.87,78.46,65.94,-1.49,"CDMX"
"42",43,"10",2015,"Durango",94.14,51.02,30.29,14.18,22.15,23.78,15.33,14.69,10.22,32.86,68,57.58,-0.19,"Dgo."
"43",44,"11",2015,"Guanajuato",93.83,62.05,15.05,14.29,18.19,9.97,6.24,12.35,11.02,49.65,64.72,67.88,0.31,"Gto."
"44",45,"12",2015,"Guerrero",95.85,48.2,32.4,22.64,26.95,19.4,14.25,19.13,15.86,40.53,86.69,73.28,-1.1,"Gro."
"45",46,"13",2015,"Hidalgo",88.2,60.14,18.86,17.95,15.02,11.69,9.33,11.85,14.08,42.18,61.92,58.17,0.33,"Hgo."
"46",47,"14",2015,"Jalisco",94.68,51.68,20.86,16.4,19.73,15.32,9.36,13.76,13.81,39.31,69.43,59.71,0.12,"Jal."
"47",48,"15",2015,"México",93.92,68.22,42.24,29.08,27.11,23.34,19.46,25.55,24.34,65.56,90.7,80.34,-2.81,"Mex."
"48",49,"16",2015,"Michoacán de Ocampo",93.75,56.45,13.86,18.39,22.57,18.64,14.96,16.46,15.13,36.02,79.83,62.67,-0.49,"Mich."
"49",50,"17",2015,"Morelos",93.06,62.87,34.5,20.71,27.33,23.03,20.14,22.16,18.56,53.59,86.11,77.46,-1.95,"Mor."
"50",51,"18",2015,"Nayarit",93.2,53.51,9.71,15.94,17.71,18.35,10.84,13.21,14.07,26.5,55.91,44.89,0.59,"Nay."
"51",52,"19",2015,"Nuevo León",92.83,62.09,24.49,10.83,16.15,9.35,6.34,9.75,8.27,39,70.82,56.55,0.77,"NL"
"52",53,"20",2015,"Oaxaca",93.83,50.1,26.99,16.11,13.04,10.72,6.76,9.55,10.72,37.57,77.7,57.27,0.64,"Oax."
"53",54,"21",2015,"Puebla",94.09,63.35,33.62,20.4,18.46,15.48,10.78,14.44,16.48,43.54,67.08,60.21,-0.42,"Pue."
"54",55,"22",2015,"Querétaro",91.35,57.48,34.1,13.54,11.96,9.57,6.04,8.79,11.92,43.21,50.75,49.5,0.92,"Qro."
"55",56,"23",2015,"Quintana Roo",91.6,59.89,34.03,16.61,19.57,14.73,9.35,13.63,13.31,42.03,61.17,59.04,0.01,"Q. Roo"
"56",57,"24",2015,"San Luis Potosí",96.66,62.69,33.14,16.17,22.56,17.23,11.84,15.78,14.02,36.84,69.17,58.5,-0.36,"SLP"
"57",58,"25",2015,"Sinaloa",91.89,52.87,22.12,9.45,19.84,13.32,7.2,11.89,6.84,31.22,70.42,60.03,0.79,"Sin."
"58",59,"26",2015,"Sonora",89.83,57.46,10.38,13.38,19.09,13.92,9.8,13.31,10.23,41.24,62.58,58.1,0.47,"Son."
"59",60,"27",2015,"Tabasco",90.67,60.05,42.43,22.7,15.86,23.3,17.48,11.66,16.32,61.42,88.8,84.61,-1.57,"Tab."
"60",61,"28",2015,"Tamaulipas",91.14,57.62,17.15,13.02,8.04,16.25,9.55,5.85,8.72,39.96,86.93,73.64,0.39,"Tamps."
"61",62,"29",2015,"Tlaxcala",92.4,58.71,29.66,12.16,16.67,14.43,11.1,13.31,9.53,47.04,59.4,56.57,0.27,"Tlax."
"62",63,"30",2015,"Veracruz de Ignacio de la Llave",91.69,62.92,35.21,22.41,20.24,17.66,12.67,16.71,18.94,42.76,80.67,67.76,-0.97,"Ver."
"63",64,"31",2015,"Yucatán",94.55,46.09,19.96,10.77,14.78,8.18,5.12,10.96,7.68,33.57,33.73,37.88,1.76,"Yuc."
"64",65,"32",2015,"Zacatecas",95.21,51.05,29.6,12.6,25.98,11,6.05,17.17,8.82,37.22,80.81,67.69,0.16,"Zac."
"65",66,"01",2016,"Aguascalientes",92.21,52.58,19.09,14.5,16.75,12.03,8.57,11.69,11.13,38.35,42.2,40.3,0.88,"Ags."
"66",67,"02",2016,"Baja California",88.34,60.67,8,14.46,19.6,18.73,12.8,13.46,10.63,42.95,56.84,58.81,0.24,"BC"
"67",68,"03",2016,"Baja California Sur",87.91,62.18,7.55,17.27,16.33,15.01,10.07,13.47,13.73,30.45,44.27,46.09,0.7,"BCS"
"68",69,"04",2016,"Campeche",89.7,58.21,8.03,15.97,15.24,13.45,9.32,12.25,12.73,37.42,54.55,53.31,0.63,"Camp."
"69",70,"05",2016,"Coahuila de Zaragoza",91.15,55.85,7.36,18.08,19.35,15.67,11.73,15.07,14.93,29.07,55.94,48.18,0.31,"Coah."
"70",71,"06",2016,"Colima",89.09,63.85,7.04,15.06,14.21,11.95,7.7,8.77,13.43,44.95,72.07,65.78,0.46,"Col."
"71",72,"07",2016,"Chiapas",93.17,54.21,10.11,10.16,10.45,8.95,7.14,8.58,10.27,34.42,57.29,57.11,1.14,"Chis."
"72",73,"08",2016,"Chihuahua",90.32,56.46,5.15,17.41,20.85,21.18,14.73,14.17,12.94,28.17,63.1,54.89,0.07,"Chih."
"73",74,"09",2016,"Ciudad de México",94.68,75.97,11.56,30.62,14.92,26.05,23.81,13.64,30.37,56.8,84.61,76.2,-2.24,"CDMX"
"74",75,"10",2016,"Durango",90.68,56.78,11.51,17.02,21.92,25.45,17.78,16.43,13.67,27.71,56.92,47.41,-0.16,"Dgo."
"75",76,"11",2016,"Guanajuato",93.71,57.17,6.41,13.04,17.63,9.85,7.56,13.92,10.66,48.04,59.92,64.99,0.41,"Gto."
"76",77,"12",2016,"Guerrero",97.21,45.54,28.02,20.68,25.07,19.16,12.83,18.16,13.74,40.61,84.69,75,-0.98,"Gro."
"77",78,"13",2016,"Hidalgo",89.53,52.55,12.35,12.6,13.09,11.26,7.33,9.69,9.6,41.07,56.69,56.16,1.01,"Hgo."
"78",79,"14",2016,"Jalisco",94.14,54.11,10.17,14.61,18.24,12.36,8.49,12.98,13.26,42.67,69.3,63.06,0.2,"Jal."
"79",80,"15",2016,"México",95.26,73.21,13.66,30.36,27.37,21.17,14.91,22.31,22.42,66.96,90.68,82.88,-2.38,"Mex."
"80",81,"16",2016,"Michoacán de Ocampo",93.05,57.61,11.63,17.5,17.08,17.42,11.63,13.08,13.48,33.34,71.79,56.17,0.06,"Mich."
"81",82,"17",2016,"Morelos",92.25,57.1,13.96,23.02,28.93,25.52,17.97,20.56,17.37,53.56,84.52,74.43,-1.62,"Mor."
"82",83,"18",2016,"Nayarit",89.13,57.05,5.81,14.27,13.12,14.65,10.17,10.4,10.03,22.15,48.28,40.28,1.22,"Nay."
"83",84,"19",2016,"Nuevo León",92.89,60.28,14.53,11.17,12.56,10.16,7.26,9.32,8.54,38.09,73.65,55.75,0.81,"NL"
"84",85,"20",2016,"Oaxaca",94.23,57.07,12.77,16.43,13.43,11.53,8.11,10.85,12.7,35.46,75.28,57.79,0.4,"Oax."
"85",86,"21",2016,"Puebla",92.88,66.07,11.84,24.77,19.04,16.19,11.69,16.17,18.72,51.24,68.35,63.84,-0.76,"Pue."
"86",87,"22",2016,"Querétaro",91.81,61.32,15.56,15.43,12.47,10.21,7.37,8.77,13.16,46.43,62.32,58.82,0.55,"Qro."
"87",88,"23",2016,"Quintana Roo",88.91,67.12,17.38,19.36,25.14,16.15,12.46,17.71,15.36,42.86,58.86,57.91,-0.39,"Q. Roo"
"88",89,"24",2016,"San Luis Potosí",94.26,61.47,5.25,20,20.6,18.49,13.31,15.97,16.85,36.17,72.15,58.58,-0.46,"SLP"
"89",90,"25",2016,"Sinaloa",91.95,44.93,8.16,11.5,19.39,13.4,9.2,12.28,8.55,28.03,72.28,59.49,0.76,"Sin."
"90",91,"26",2016,"Sonora",92.15,61.55,6.89,15.41,19.36,14.09,9.84,14.34,11.23,40.4,51.3,54.54,0.36,"Son."
"91",92,"27",2016,"Tabasco",93.78,57.14,23.53,22.11,17.43,21.49,16.61,12.64,17.76,63.78,88.14,84.92,-1.34,"Tab."
"92",93,"28",2016,"Tamaulipas",93.74,62.57,9.31,16.14,20.16,17.57,14.49,18.22,11.96,41.37,86.17,73.59,-0.64,"Tamps."
"93",94,"29",2016,"Tlaxcala",94.16,52.5,14.65,18.39,19.39,11.06,9.39,17.2,16.79,43.13,55.19,55.19,0.01,"Tlax."
"94",95,"30",2016,"Veracruz de Ignacio de la Llave",94.29,59.27,4.91,24.09,27.23,23.16,16.37,21.34,17.35,44.38,85.15,71,-1.42,"Ver."
"95",96,"31",2016,"Yucatán",91.23,46.9,11.81,11.06,9.62,8.3,5.43,7.59,7.56,33.21,31.46,36.9,1.9,"Yuc."
"96",97,"32",2016,"Zacatecas",92.14,43.18,3.53,14.68,22.31,11.16,6.98,17.94,9.88,38.12,82.6,70.35,0.25,"Zac."
"97",99,"01",2017,"Aguascalientes",93.05,57.21,25.5,14.52,18.76,15.09,10.39,14.83,12.17,45.13,43.92,42.53,0.59,"Ags."
"98",100,"02",2017,"Baja California",91.97,59.19,11.59,13.42,20.27,21.93,14.71,13.58,11.05,43.4,58.09,57.88,0.19,"BC"
"99",101,"03",2017,"Baja California Sur",87.05,59.15,19.46,17.07,16.43,17.05,13.49,14.02,13.61,36.87,60.86,63.15,0.31,"BCS"
"100",102,"04",2017,"Campeche",90.49,44.99,30.43,15.76,18.76,15.32,11.39,14.18,12.54,44.08,57.56,59.05,0.42,"Camp."
"101",103,"05",2017,"Coahuila de Zaragoza",91.55,55.45,30.94,19.31,22.9,16.13,12.94,16.97,16.52,27.97,56.43,44.46,0.14,"Coah."
"102",104,"06",2017,"Colima",91.43,58.89,14.26,15.28,15.99,14.17,10.61,12.19,13.06,44.98,74.62,69.11,0.32,"Col."
"103",105,"07",2017,"Chiapas",94.17,51.52,28.01,13.3,14.43,12.16,9.67,12.03,9.76,35.3,61.15,61.91,0.81,"Chis."
"104",106,"08",2017,"Chihuahua",91.03,52.98,11.5,15.77,19.98,21.06,14.46,14.56,11.47,32.22,74.32,63.61,0.19,"Chih."
"105",107,"09",2017,"Ciudad de México",93.84,76.52,38.22,37.3,12.31,23.94,19.94,10.25,30.56,63.02,85.7,76.7,-2.18,"CDMX"
"106",108,"10",2017,"Durango",91.98,59.11,27.91,15.41,22.18,23.89,16.95,16.26,12.89,30.91,57.5,47.48,-0.08,"Dgo."
"107",109,"11",2017,"Guanajuato",91.19,64.65,15.82,14.36,18.44,9.12,7.54,14.19,12.24,50.91,75.43,77.73,0.24,"Gto."
"108",110,"12",2017,"Guerrero",98.32,46.7,42.71,18.25,23.28,14.5,10.49,16.73,11.27,36.04,83.09,76.03,-0.32,"Gro."
"109",111,"13",2017,"Hidalgo",92.16,64.45,23.81,17.25,12.91,13.32,9.61,10.89,15.73,42.78,55,56.48,0.49,"Hgo."
"110",112,"14",2017,"Jalisco",92.86,55.19,21.64,13.85,16.54,14.03,8.69,12.46,11.32,42.1,65.87,57.15,0.64,"Jal."
"111",113,"15",2017,"México",94.24,68.07,38.13,34,29.33,25.85,20.07,24.12,27.48,63.61,90.77,80.7,-2.89,"Mex."
"112",114,"16",2017,"Michoacán de Ocampo",93.73,51.74,44.49,20.2,18.74,18.23,12.35,13.38,15.96,33.76,77.94,61.13,-0.23,"Mich."
"113",115,"17",2017,"Morelos",94.14,58.86,36.38,21.87,25.48,24.7,19.3,19.1,18.82,53.46,86.39,77,-1.66,"Mor."
"114",116,"18",2017,"Nayarit",91.1,42.84,18.46,16.63,17.53,19.84,12.24,12.39,12.4,24.8,58.71,48.02,0.83,"Nay."
"115",117,"19",2017,"Nuevo León",93.53,61.4,17.83,9.58,13.29,8.78,6.56,10.09,7.84,40.09,71.07,55.65,1.18,"NL"
"116",118,"20",2017,"Oaxaca",95.01,54.05,39.59,13.07,11.87,8.54,7.13,8.86,10.11,34.82,74.27,56.11,0.96,"Oax."
"117",119,"21",2017,"Puebla",94.6,65.65,41.87,20.13,20.35,15.91,13.4,16.69,19.18,48.49,68.04,63.75,-0.77,"Pue."
"118",120,"22",2017,"Querétaro",92.06,56.56,23.96,16.28,13.94,11.38,8.44,9.23,13.59,45.36,54.5,52.21,0.83,"Qro."
"119",121,"23",2017,"Quintana Roo",90.58,59.94,29.77,21.91,27.77,19.71,15.15,22.42,18.03,43.85,68.5,64.67,-0.98,"Q. Roo"
"120",122,"24",2017,"San Luis Potosí",93.36,59.31,39.68,18.47,21.05,19.12,15.7,15.71,12.14,39.26,73.7,62.74,-0.46,"SLP"
"121",123,"25",2017,"Sinaloa",92.33,50.33,22.68,12.1,19.91,13.26,9.41,14.06,9.23,31.92,74.64,63.59,0.67,"Sin."
"122",124,"26",2017,"Sonora",93.61,67.35,22.27,17.79,21.81,16.2,11.91,15.23,13.49,44.47,57.51,60.23,-0.11,"Son."
"123",125,"27",2017,"Tabasco",92.21,59.1,34.95,20.67,23.63,20.33,15.36,18.03,16.34,64.28,88.78,86.53,-1.4,"Tab."
"124",126,"28",2017,"Tamaulipas",93.83,61.45,24.97,11.98,14.04,17.35,13.22,10.85,9.16,38.55,85.28,70.67,0.22,"Tamps."
"125",127,"29",2017,"Tlaxcala",93.46,63.39,23.45,14.39,18.69,12.94,10.92,16.94,12.2,44.82,59.1,55.73,0.24,"Tlax."
"126",128,"30",2017,"Veracruz de Ignacio de la Llave",91.91,56.15,31.55,19.57,20.16,16.94,13.12,17.44,16.67,44.69,89.86,73.85,-0.65,"Ver."
"127",129,"31",2017,"Yucatán",91.57,46.06,21.48,10.54,11.96,9.32,6.26,9.59,9.2,30.61,27.24,34.47,2.05,"Yuc."
"128",130,"32",2017,"Zacatecas",92.41,51.61,18.56,13.47,21.95,10.39,7.1,18.06,8.74,39.5,84.34,70.41,0.42,"Zac."
"129",132,"01",2018,"Aguascalientes",89.86,60.07,25.9,16.19,21.47,13.5,9.47,15.09,13.56,50.92,60.81,58.41,-0.4,"Ags."
"130",133,"02",2018,"Baja California",88.59,58.19,16.7,14.53,25.22,21.44,15.05,18.98,11.93,53.16,72.65,71.76,0.3,"BC"
"131",134,"03",2018,"Baja California Sur",85.68,64.17,17.07,18.22,14.73,17.24,13.24,12.46,16.32,37.12,65.14,63.65,-0.42,"BCS"
"132",135,"04",2018,"Campeche",89.96,51.02,32.37,13.39,16.29,14.54,11.59,12.56,11.03,43.25,57.86,59.19,-0.85,"Camp."
"133",136,"05",2018,"Coahuila de Zaragoza",92.51,64.12,23.89,16.08,20.36,17.92,12.13,15.47,12.53,31.83,64.04,49.72,-0.45,"Coah."
"134",137,"06",2018,"Colima",88.36,65.19,10.72,15.84,15.43,13.92,9.69,11.34,13.45,49.59,80.65,73.27,-0.34,"Col."
"135",138,"07",2018,"Chiapas",93.68,57.26,29.14,13.1,16.03,12.07,8.34,13.43,9.84,38.68,71.41,64.52,-0.76,"Chis."
"136",139,"08",2018,"Chihuahua",91.23,54.73,13.54,9.74,17.09,19.07,12.23,11.97,8.4,37.47,80.86,68.93,-0.65,"Chih."
"137",140,"09",2018,"Ciudad de México",93.51,73.83,45.08,37.89,17.48,32.61,24.62,13.2,32.06,67.39,88.33,78.49,2.67,"CDMX"
"138",141,"10",2018,"Durango",91.06,54.16,11.28,18.08,23.51,22.36,16.21,15.99,13.44,32.09,60.39,50.86,-0.3,"Dgo."
"139",142,"11",2018,"Guanajuato",92.34,60.66,25.22,14.87,23.02,12,9.19,18.63,10.38,57.06,83.23,82.71,0.2,"Gto."
"140",143,"12",2018,"Guerrero",96.82,46.72,38.75,17.02,25.08,16.51,11.9,18.25,13.7,39.84,84.21,73.96,0.25,"Gro."
"141",144,"13",2018,"Hidalgo",89.27,53.79,24.3,15.18,15.25,15.4,11.46,12.43,13.4,47.89,63.41,61.21,-0.63,"Hgo."
"142",145,"14",2018,"Jalisco",93.04,59.55,19.61,16.82,24.16,17.62,10.39,15.91,12.34,47.18,73.58,64.67,-0.03,"Jal."
"143",146,"15",2018,"México",94.46,73.16,43.94,29.31,30.33,26.9,22.94,24.9,25.51,66.64,91.8,81.55,2.75,"Mex."
"144",147,"16",2018,"Michoacán de Ocampo",91.9,54.46,33.65,22.88,22.67,21,15.32,18.06,17.58,39.11,81.77,65.86,0.54,"Mich."
"145",148,"17",2018,"Morelos",93.07,57.97,31.55,24.36,25,26.23,17.78,19.29,21.01,56.2,86.4,77.7,1.46,"Mor."
"146",149,"18",2018,"Nayarit",94.74,50.08,27.1,17.69,13.61,16.56,11.67,10.98,12.38,35.36,83.62,67.68,-0.46,"Nay."
"147",150,"19",2018,"Nuevo León",93.81,60.93,17.54,10.75,13.41,8.25,5.43,8.56,9.09,44.24,75.2,60.83,-1.2,"NL"
"148",151,"20",2018,"Oaxaca",91.8,61.05,48.87,16.43,16.35,11.26,7.49,12.32,11.64,37.68,76.79,58.89,-0.6,"Oax."
"149",152,"21",2018,"Puebla",93.06,63.53,36.84,17.87,22.63,13.08,11.69,18.91,14.63,57.24,81.34,71.97,0.5,"Pue."
"150",153,"22",2018,"Querétaro",91.18,52.58,20.1,17.27,15.58,14.13,9.11,11.35,12.46,46.09,62.02,59.25,-0.8,"Qro."
"151",154,"23",2018,"Quintana Roo",91.82,61.62,19.8,22.32,28.55,19.1,15.11,21.34,18.12,50.28,73.42,69.7,0.85,"Q. Roo"
"152",155,"24",2018,"San Luis Potosí",93.07,71.15,28.1,20.26,23.81,18.89,11,14.77,15.88,44.86,81.37,71.73,0.53,"SLP"
"153",156,"25",2018,"Sinaloa",93.09,47.77,28.22,12.45,19.98,13.71,8.9,12.24,9.16,30.41,72.65,61.1,-0.98,"Sin."
"154",157,"26",2018,"Sonora",93.32,62.84,14.11,17.93,21.14,17.36,12.66,16.45,14.93,43.87,67.03,65.79,0.03,"Son."
"155",158,"27",2018,"Tabasco",91.85,53.87,42.78,19.3,23.1,20.49,15.24,16.54,14.81,67.88,91.99,86.67,1.07,"Tab."
"156",159,"28",2018,"Tamaulipas",95.44,60.92,18.36,13.43,21.21,18,13.24,16.79,9.87,46.16,86.34,73.52,0.16,"Tamps."
"157",160,"29",2018,"Tlaxcala",92.85,61.01,47.88,14.51,19.63,13.41,9.63,14.13,11.72,50.43,68.73,62.5,-0.24,"Tlax."
"158",161,"30",2018,"Veracruz de Ignacio de la Llave",92.24,56.89,39.34,16.01,20.01,15.79,11.42,14.41,11.91,45.79,88.84,71.33,0.05,"Ver."
"159",162,"31",2018,"Yucatán",90.93,45.37,29.01,10.68,12.92,9.19,5.64,11.43,8.55,31.24,32.38,36.86,-2.18,"Yuc."
"160",163,"32",2018,"Zacatecas",94.77,57.92,12.91,10.31,28.78,10.89,6.88,21.65,9.4,44.53,89.48,75.17,-0.09,"Zac."
"161",165,"01",2019,"Aguascalientes",90.95,58.41,24.19,14.67,18.26,13.56,9.29,14.2,11.52,46.78,56.53,55.34,-0.63,"Ags."
"162",166,"02",2019,"Baja California",88.69,58.74,16.98,15.23,25.02,21.72,15.03,16.41,12.65,50.17,66.45,69.24,0.4,"BC"
"163",167,"03",2019,"Baja California Sur",87.94,66.8,13.82,16.18,17.05,17.75,13.14,13.06,12.39,36.05,48.19,50.71,-0.59,"BCS"
"164",168,"04",2019,"Campeche",87.66,56.77,46.94,14.06,12.09,10.47,9.69,10.95,12.24,42.94,60.82,59.61,-0.87,"Camp."
"165",169,"05",2019,"Coahuila de Zaragoza",92.4,59.69,30.51,15.18,17.23,16.81,12.1,12.65,13.3,31.72,57.02,46.94,-0.61,"Coah."
"166",170,"06",2019,"Colima",91.83,50.68,16.17,15.78,13.89,14.29,10.93,11.05,13.28,50.22,78.02,72.33,-0.34,"Col."
"167",171,"07",2019,"Chiapas",91.2,50.12,25.77,15.26,17.74,12.84,9.42,14.68,11.34,40.47,68.56,67.22,-0.55,"Chis."
"168",172,"08",2019,"Chihuahua",91.05,61.4,15.9,11.91,17.29,18.12,12.32,11.46,9.19,34.09,80.81,68.66,-0.42,"Chih."
"169",173,"09",2019,"Ciudad de México",94.03,73.18,38.98,30.04,11.66,25.37,18.14,8.34,25.24,68.68,89.25,80.72,1.9,"CDMX"
"170",174,"10",2019,"Durango",91.93,58.06,31.74,15.89,18.16,20.23,14.19,13.52,13.06,32.97,64.62,55.45,-0.19,"Dgo."
"171",175,"11",2019,"Guanajuato",94.59,63.87,29.54,13.25,17.32,9.15,7.02,12.78,10.26,57.55,88.79,84.53,-0.1,"Gto."
"172",176,"12",2019,"Guerrero",97.8,57.8,33.31,21.15,25.38,16.07,12.2,17.94,16.94,42.84,84.63,69.61,0.8,"Gro."
"173",177,"13",2019,"Hidalgo",92.25,58.52,28.26,15.29,14.74,12.28,8.97,12.99,13.19,42.81,65.57,63.52,-0.56,"Hgo."
"174",178,"14",2019,"Jalisco",91.91,54.64,31.29,16.11,20.88,16.23,10.74,15.3,12.81,51.55,77.66,69.1,0.13,"Jal."
"175",179,"15",2019,"México",93.34,72.33,45.2,31.18,27.05,23.14,17.06,22.5,25.71,65.97,88.74,80.1,2.66,"Mex."
"176",180,"16",2019,"Michoacán de Ocampo",93.14,55.44,26.47,20.7,20.67,19.12,13.07,14.76,15.52,43.41,80.24,66.54,0.43,"Mich."
"177",181,"17",2019,"Morelos",94.03,55.38,42.92,23.26,24.59,20.97,17.43,19.76,19.58,57.91,88.49,81.55,1.7,"Mor."
"178",182,"18",2019,"Nayarit",92.2,52,15.47,17.17,15.39,14.77,11.17,11.35,12.45,30.36,60.73,51.22,-0.89,"Nay."
"179",183,"19",2019,"Nuevo León",91.12,63.59,24.37,9.28,13.71,9.37,7.08,11.57,7.75,46.24,81.93,66.14,-0.94,"NL"
"180",184,"20",2019,"Oaxaca",94.89,51.08,50.57,14.94,12.76,9.28,6.19,9.97,12.3,37.35,71.39,55.51,-1,"Oax."
"181",185,"21",2019,"Puebla",92.02,65.31,48.67,21.59,21.97,15.75,12.47,18.75,17.33,63.34,87.7,80.94,1.27,"Pue."
"182",186,"22",2019,"Querétaro",92.38,53.79,20.53,14.52,16.99,13.06,11.24,15.22,12.98,51.93,62.11,59.45,-0.4,"Qro."
"183",187,"23",2019,"Quintana Roo",91.15,57.97,26.11,23.88,29.16,19.5,15.38,23.67,20.95,53.22,82.22,76.36,1.59,"Q. Roo"
"184",188,"24",2019,"San Luis Potosí",94.95,60.87,28.5,14.24,17.88,15.47,11.25,14.76,10.94,44.98,77.68,69.38,-0.06,"SLP"
"185",189,"25",2019,"Sinaloa",95.41,48.74,34.55,11.76,19.63,13.56,8.37,13.66,9.08,29.4,64.69,55.77,-0.96,"Sin."
"186",190,"26",2019,"Sonora",92.15,54.77,23.32,13.02,21.59,16.05,12.12,17.1,10.57,44.86,68.2,64.22,-0.18,"Son."
"187",191,"27",2019,"Tabasco",92.82,51.61,31.09,16.59,21.19,16.94,13.84,16.45,13.68,66.23,90.3,88.16,0.88,"Tab."
"188",192,"28",2019,"Tamaulipas",93.65,57.23,14.69,15.04,21.64,19.22,12.21,14.98,11.65,42.88,83.07,66.57,0.1,"Tamps."
"189",193,"29",2019,"Tlaxcala",94.38,53.75,35.08,16.21,18.67,11.71,9.88,17.57,13.72,50.89,69.39,61.65,-0.11,"Tlax."
"190",194,"30",2019,"Veracruz de Ignacio de la Llave",95.56,54.43,29.6,16.51,19.64,14.85,10.99,15.13,14.4,44.47,87.47,71.28,0.21,"Ver."
"191",195,"31",2019,"Yucatán",92.74,59.17,31.17,9.81,9.84,7.59,4.65,8.89,9.42,30.09,37.7,40.14,-2.12,"Yuc."
"192",196,"32",2019,"Zacatecas",93.72,46.84,27.71,11.61,20.71,10.9,8.45,15.88,9.19,39.56,80.46,72.91,-0.55,"Zac."
