<?xml version='1.0' encoding='UTF-8' ?>
<svg xmlns='http://www.w3.org/2000/svg' xmlns:xlink='http://www.w3.org/1999/xlink' viewBox='0 0 720.00 432.00'>
<defs>
  <style type='text/css'><![CDATA[
    line, polyline, polygon, path, rect, circle {
      fill: none;
      stroke: #000000;
      stroke-linecap: round;
      stroke-linejoin: round;
      stroke-miterlimit: 10.00;
    }
  ]]></style>
</defs>
<rect width='100%' height='100%' style='stroke: none; fill: #FFFFFF;'/>
<defs>
  <clipPath id='cpMTUyLjQ2fDcxNC41MnwzODAuMjV8NzEuMTY='>
    <rect x='152.46' y='71.16' width='562.06' height='309.09' />
  </clipPath>
</defs>
<polyline points='257.85,380.25 257.85,71.16 ' style='stroke-width: 0.53; stroke: #EBEBEB; stroke-dasharray: 4.00,4.00; stroke-linecap: butt;' clip-path='url(#cpMTUyLjQ2fDcxNC41MnwzODAuMjV8NzEuMTY=)' />
<polyline points='417.52,380.25 417.52,71.16 ' style='stroke-width: 0.53; stroke: #EBEBEB; stroke-dasharray: 4.00,4.00; stroke-linecap: butt;' clip-path='url(#cpMTUyLjQ2fDcxNC41MnwzODAuMjV8NzEuMTY=)' />
<polyline points='577.20,380.25 577.20,71.16 ' style='stroke-width: 0.53; stroke: #EBEBEB; stroke-dasharray: 4.00,4.00; stroke-linecap: butt;' clip-path='url(#cpMTUyLjQ2fDcxNC41MnwzODAuMjV8NzEuMTY=)' />
<polyline points='152.46,295.95 714.52,295.95 ' style='stroke-width: 1.07; stroke: #EBEBEB; stroke-dasharray: 5.69,5.69; stroke-linecap: butt;' clip-path='url(#cpMTUyLjQ2fDcxNC41MnwzODAuMjV8NzEuMTY=)' />
<polyline points='152.46,155.46 714.52,155.46 ' style='stroke-width: 1.07; stroke: #EBEBEB; stroke-dasharray: 5.69,5.69; stroke-linecap: butt;' clip-path='url(#cpMTUyLjQ2fDcxNC41MnwzODAuMjV8NzEuMTY=)' />
<polyline points='178.01,380.25 178.01,71.16 ' style='stroke-width: 1.07; stroke: #EBEBEB; stroke-dasharray: 5.69,5.69; stroke-linecap: butt;' clip-path='url(#cpMTUyLjQ2fDcxNC41MnwzODAuMjV8NzEuMTY=)' />
<polyline points='337.69,380.25 337.69,71.16 ' style='stroke-width: 1.07; stroke: #EBEBEB; stroke-dasharray: 5.69,5.69; stroke-linecap: butt;' clip-path='url(#cpMTUyLjQ2fDcxNC41MnwzODAuMjV8NzEuMTY=)' />
<polyline points='497.36,380.25 497.36,71.16 ' style='stroke-width: 1.07; stroke: #EBEBEB; stroke-dasharray: 5.69,5.69; stroke-linecap: butt;' clip-path='url(#cpMTUyLjQ2fDcxNC41MnwzODAuMjV8NzEuMTY=)' />
<polyline points='657.04,380.25 657.04,71.16 ' style='stroke-width: 1.07; stroke: #EBEBEB; stroke-dasharray: 5.69,5.69; stroke-linecap: butt;' clip-path='url(#cpMTUyLjQ2fDcxNC41MnwzODAuMjV8NzEuMTY=)' />
<line x1='178.01' y1='295.95' x2='688.97' y2='295.95' style='stroke-width: 2.13; stroke: #6B6D75; stroke-linecap: butt;' clip-path='url(#cpMTUyLjQ2fDcxNC41MnwzODAuMjV8NzEuMTY=)' />
<line x1='178.01' y1='155.46' x2='676.20' y2='155.46' style='stroke-width: 2.13; stroke: #F3C1B9; stroke-linecap: butt;' clip-path='url(#cpMTUyLjQ2fDcxNC41MnwzODAuMjV8NzEuMTY=)' />
<circle cx='688.97' cy='295.95' r='9.95' style='stroke-width: 2.83; stroke: #6B6D75; stroke-opacity: 0.70; fill: #6B6D75; fill-opacity: 0.70;' clip-path='url(#cpMTUyLjQ2fDcxNC41MnwzODAuMjV8NzEuMTY=)' />
<circle cx='676.20' cy='155.46' r='9.95' style='stroke-width: 2.83; stroke: #F3C1B9; stroke-opacity: 0.70; fill: #F3C1B9; fill-opacity: 0.70;' clip-path='url(#cpMTUyLjQ2fDcxNC41MnwzODAuMjV8NzEuMTY=)' />
<line x1='676.20' y1='380.25' x2='676.20' y2='71.16' style='stroke-width: 1.07; stroke: #FF0000; stroke-dasharray: 5.69,5.69; stroke-linecap: butt;' clip-path='url(#cpMTUyLjQ2fDcxNC41MnwzODAuMjV8NzEuMTY=)' />
<g clip-path='url(#cpMTUyLjQ2fDcxNC41MnwzODAuMjV8NzEuMTY=)'><text x='681.89' y='299.82' style='font-size: 11.04px; font-family: Rubik;' textLength='14.16px' lengthAdjust='spacingAndGlyphs'>1.6</text></g>
<g clip-path='url(#cpMTUyLjQ2fDcxNC41MnwzODAuMjV8NzEuMTY=)'><text x='665.84' y='159.32' style='font-size: 11.04px; font-family: Rubik;' textLength='20.72px' lengthAdjust='spacingAndGlyphs'>1.56</text></g>
<defs>
  <clipPath id='cpMC4wMHw3MjAuMDB8NDMyLjAwfDAuMDA='>
    <rect x='0.00' y='0.00' width='720.00' height='432.00' />
  </clipPath>
</defs>
<g clip-path='url(#cpMC4wMHw3MjAuMDB8NDMyLjAwfDAuMDA=)'><text x='35.86' y='300.15' style='font-size: 12.00px; font-weight: bold; fill: #4D4D4D; font-family: Rubik;' textLength='111.67px' lengthAdjust='spacingAndGlyphs'>Mujeres indígenas</text></g>
<g clip-path='url(#cpMC4wMHw3MjAuMDB8NDMyLjAwfDAuMDA=)'><text x='21.10' y='159.66' style='font-size: 12.00px; font-weight: bold; fill: #4D4D4D; font-family: Rubik;' textLength='126.43px' lengthAdjust='spacingAndGlyphs'>Resto de las mujeres</text></g>
<g clip-path='url(#cpMC4wMHw3MjAuMDB8NDMyLjAwfDAuMDA=)'><text x='167.83' y='393.58' style='font-size: 12.00px; font-weight: bold; fill: #4D4D4D; font-family: Rubik;' textLength='20.35px' lengthAdjust='spacingAndGlyphs'>0.0</text></g>
<g clip-path='url(#cpMC4wMHw3MjAuMDB8NDMyLjAwfDAuMDA=)'><text x='327.70' y='393.58' style='font-size: 12.00px; font-weight: bold; fill: #4D4D4D; font-family: Rubik;' textLength='19.98px' lengthAdjust='spacingAndGlyphs'>0.5</text></g>
<g clip-path='url(#cpMC4wMHw3MjAuMDB8NDMyLjAwfDAuMDA=)'><text x='488.22' y='393.58' style='font-size: 12.00px; font-weight: bold; fill: #4D4D4D; font-family: Rubik;' textLength='18.29px' lengthAdjust='spacingAndGlyphs'>1.0</text></g>
<g clip-path='url(#cpMC4wMHw3MjAuMDB8NDMyLjAwfDAuMDA=)'><text x='648.08' y='393.58' style='font-size: 12.00px; font-weight: bold; fill: #4D4D4D; font-family: Rubik;' textLength='17.92px' lengthAdjust='spacingAndGlyphs'>1.5</text></g>
<g clip-path='url(#cpMC4wMHw3MjAuMDB8NDMyLjAwfDAuMDA=)'><text x='305.78' y='408.76' style='font-size: 14.00px; font-weight: bold; fill: #595959; font-family: Rubik;' textLength='255.43px' lengthAdjust='spacingAndGlyphs'>Promedio de agresiones reportadas</text></g>
<g clip-path='url(#cpMC4wMHw3MjAuMDB8NDMyLjAwfDAuMDA=)'><text x='308.87' y='62.16' style='font-size: 16.00px; font-weight: bold; fill: #666666; font-family: Rubik;' textLength='249.25px' lengthAdjust='spacingAndGlyphs'>Según su adscripción indígena</text></g>
<g clip-path='url(#cpMC4wMHw3MjAuMDB8NDMyLjAwfDAuMDA=)'><text x='251.04' y='19.48' style='font-size: 20.00px; font-weight: bold; font-family: Rubik;' textLength='364.90px' lengthAdjust='spacingAndGlyphs'>Promedio de agresiones reportadas</text></g>
<g clip-path='url(#cpMC4wMHw3MjAuMDB8NDMyLjAwfDAuMDA=)'><text x='296.02' y='41.08' style='font-size: 20.00px; font-weight: bold; font-family: Rubik;' textLength='274.94px' lengthAdjust='spacingAndGlyphs'>por mujeres en Nuevo León</text></g>
<g clip-path='url(#cpMC4wMHw3MjAuMDB8NDMyLjAwfDAuMDA=)'><text x='152.46' y='424.32' style='font-size: 10.00px; font-style: italic; fill: #595959; font-family: Rubik;' textLength='289.14px' lengthAdjust='spacingAndGlyphs'>Fuente: Elaboración propia con datos de la ENDIREH (2016)</text></g>
</svg>
