<?xml version='1.0' encoding='UTF-8' ?>
<svg xmlns='http://www.w3.org/2000/svg' xmlns:xlink='http://www.w3.org/1999/xlink' viewBox='0 0 720.00 432.00'>
<defs>
  <style type='text/css'><![CDATA[
    line, polyline, polygon, path, rect, circle {
      fill: none;
      stroke: #000000;
      stroke-linecap: round;
      stroke-linejoin: round;
      stroke-miterlimit: 10.00;
    }
  ]]></style>
</defs>
<rect width='100%' height='100%' style='stroke: none; fill: #FFFFFF;'/>
<defs>
  <clipPath id='cpNDAuNzR8Mzc0Ljg5fDM4MC4yNXw4OC4zNg=='>
    <rect x='40.74' y='88.36' width='334.15' height='291.89' />
  </clipPath>
</defs>
<polyline points='40.74,317.88 374.89,317.88 ' style='stroke-width: 0.53; stroke: #EBEBEB; stroke-dasharray: 4.00,4.00; stroke-linecap: butt;' clip-path='url(#cpNDAuNzR8Mzc0Ljg5fDM4MC4yNXw4OC4zNg==)' />
<polyline points='40.74,216.81 374.89,216.81 ' style='stroke-width: 0.53; stroke: #EBEBEB; stroke-dasharray: 4.00,4.00; stroke-linecap: butt;' clip-path='url(#cpNDAuNzR8Mzc0Ljg5fDM4MC4yNXw4OC4zNg==)' />
<polyline points='40.74,115.74 374.89,115.74 ' style='stroke-width: 0.53; stroke: #EBEBEB; stroke-dasharray: 4.00,4.00; stroke-linecap: butt;' clip-path='url(#cpNDAuNzR8Mzc0Ljg5fDM4MC4yNXw4OC4zNg==)' />
<polyline points='93.90,380.25 93.90,88.36 ' style='stroke-width: 0.53; stroke: #EBEBEB; stroke-dasharray: 4.00,4.00; stroke-linecap: butt;' clip-path='url(#cpNDAuNzR8Mzc0Ljg5fDM4MC4yNXw4OC4zNg==)' />
<polyline points='169.85,380.25 169.85,88.36 ' style='stroke-width: 0.53; stroke: #EBEBEB; stroke-dasharray: 4.00,4.00; stroke-linecap: butt;' clip-path='url(#cpNDAuNzR8Mzc0Ljg5fDM4MC4yNXw4OC4zNg==)' />
<polyline points='245.79,380.25 245.79,88.36 ' style='stroke-width: 0.53; stroke: #EBEBEB; stroke-dasharray: 4.00,4.00; stroke-linecap: butt;' clip-path='url(#cpNDAuNzR8Mzc0Ljg5fDM4MC4yNXw4OC4zNg==)' />
<polyline points='321.73,380.25 321.73,88.36 ' style='stroke-width: 0.53; stroke: #EBEBEB; stroke-dasharray: 4.00,4.00; stroke-linecap: butt;' clip-path='url(#cpNDAuNzR8Mzc0Ljg5fDM4MC4yNXw4OC4zNg==)' />
<polyline points='40.74,368.42 374.89,368.42 ' style='stroke-width: 1.07; stroke: #EBEBEB; stroke-dasharray: 5.69,5.69; stroke-linecap: butt;' clip-path='url(#cpNDAuNzR8Mzc0Ljg5fDM4MC4yNXw4OC4zNg==)' />
<polyline points='40.74,267.35 374.89,267.35 ' style='stroke-width: 1.07; stroke: #EBEBEB; stroke-dasharray: 5.69,5.69; stroke-linecap: butt;' clip-path='url(#cpNDAuNzR8Mzc0Ljg5fDM4MC4yNXw4OC4zNg==)' />
<polyline points='40.74,166.28 374.89,166.28 ' style='stroke-width: 1.07; stroke: #EBEBEB; stroke-dasharray: 5.69,5.69; stroke-linecap: butt;' clip-path='url(#cpNDAuNzR8Mzc0Ljg5fDM4MC4yNXw4OC4zNg==)' />
<polyline points='55.93,380.25 55.93,88.36 ' style='stroke-width: 1.07; stroke: #EBEBEB; stroke-dasharray: 5.69,5.69; stroke-linecap: butt;' clip-path='url(#cpNDAuNzR8Mzc0Ljg5fDM4MC4yNXw4OC4zNg==)' />
<polyline points='131.87,380.25 131.87,88.36 ' style='stroke-width: 1.07; stroke: #EBEBEB; stroke-dasharray: 5.69,5.69; stroke-linecap: butt;' clip-path='url(#cpNDAuNzR8Mzc0Ljg5fDM4MC4yNXw4OC4zNg==)' />
<polyline points='207.82,380.25 207.82,88.36 ' style='stroke-width: 1.07; stroke: #EBEBEB; stroke-dasharray: 5.69,5.69; stroke-linecap: butt;' clip-path='url(#cpNDAuNzR8Mzc0Ljg5fDM4MC4yNXw4OC4zNg==)' />
<polyline points='283.76,380.25 283.76,88.36 ' style='stroke-width: 1.07; stroke: #EBEBEB; stroke-dasharray: 5.69,5.69; stroke-linecap: butt;' clip-path='url(#cpNDAuNzR8Mzc0Ljg5fDM4MC4yNXw4OC4zNg==)' />
<polyline points='359.70,380.25 359.70,88.36 ' style='stroke-width: 1.07; stroke: #EBEBEB; stroke-dasharray: 5.69,5.69; stroke-linecap: butt;' clip-path='url(#cpNDAuNzR8Mzc0Ljg5fDM4MC4yNXw4OC4zNg==)' />
<polyline points='55.93,364.83 71.12,361.27 101.50,361.31 116.69,364.87 131.87,364.88 147.06,357.83 162.25,350.80 177.44,361.38 192.63,347.32 207.82,280.60 223.01,101.63 238.19,235.09 253.38,287.75 268.57,343.87 283.76,336.86 298.95,336.86 314.14,336.85 329.33,308.77 344.51,287.68 359.70,315.73 ' style='stroke-width: 4.27; stroke: #6B6D75; stroke-linecap: butt;' clip-path='url(#cpNDAuNzR8Mzc0Ljg5fDM4MC4yNXw4OC4zNg==)' />
<polyline points='55.93,365.48 71.12,366.98 86.31,365.61 116.69,359.01 131.87,365.78 147.06,363.25 162.25,360.82 177.44,357.23 192.63,355.00 207.82,340.85 223.01,280.08 238.19,300.10 253.38,327.41 268.57,344.88 283.76,356.28 298.95,348.86 314.14,341.67 329.33,339.95 344.51,343.47 359.70,341.77 ' style='stroke-width: 4.27; stroke: #F3C1B9; stroke-linecap: butt;' clip-path='url(#cpNDAuNzR8Mzc0Ljg5fDM4MC4yNXw4OC4zNg==)' />
<polyline points='55.93,352.93 71.12,352.67 86.31,353.43 101.50,353.56 116.69,354.91 131.87,353.63 147.06,352.89 162.25,354.47 177.44,350.51 192.63,339.41 207.82,327.15 223.01,324.32 238.19,319.25 253.38,331.97 268.57,335.85 283.76,335.82 298.95,324.70 314.14,312.90 329.33,310.11 344.51,308.29 359.70,314.07 ' style='stroke-width: 4.27; stroke: #384D57; stroke-linecap: butt;' clip-path='url(#cpNDAuNzR8Mzc0Ljg5fDM4MC4yNXw4OC4zNg==)' />
<circle cx='55.93' cy='364.83' r='3.56' style='stroke-width: 0.71; stroke: #6B6D75; fill: #6B6D75;' clip-path='url(#cpNDAuNzR8Mzc0Ljg5fDM4MC4yNXw4OC4zNg==)' />
<circle cx='55.93' cy='365.48' r='3.56' style='stroke-width: 0.71; stroke: #F3C1B9; fill: #F3C1B9;' clip-path='url(#cpNDAuNzR8Mzc0Ljg5fDM4MC4yNXw4OC4zNg==)' />
<circle cx='55.93' cy='352.93' r='3.56' style='stroke-width: 0.71; stroke: #384D57; fill: #384D57;' clip-path='url(#cpNDAuNzR8Mzc0Ljg5fDM4MC4yNXw4OC4zNg==)' />
<circle cx='71.12' cy='361.27' r='3.56' style='stroke-width: 0.71; stroke: #6B6D75; fill: #6B6D75;' clip-path='url(#cpNDAuNzR8Mzc0Ljg5fDM4MC4yNXw4OC4zNg==)' />
<circle cx='71.12' cy='366.98' r='3.56' style='stroke-width: 0.71; stroke: #F3C1B9; fill: #F3C1B9;' clip-path='url(#cpNDAuNzR8Mzc0Ljg5fDM4MC4yNXw4OC4zNg==)' />
<circle cx='71.12' cy='352.67' r='3.56' style='stroke-width: 0.71; stroke: #384D57; fill: #384D57;' clip-path='url(#cpNDAuNzR8Mzc0Ljg5fDM4MC4yNXw4OC4zNg==)' />
<circle cx='86.31' cy='365.61' r='3.56' style='stroke-width: 0.71; stroke: #F3C1B9; fill: #F3C1B9;' clip-path='url(#cpNDAuNzR8Mzc0Ljg5fDM4MC4yNXw4OC4zNg==)' />
<circle cx='86.31' cy='353.43' r='3.56' style='stroke-width: 0.71; stroke: #384D57; fill: #384D57;' clip-path='url(#cpNDAuNzR8Mzc0Ljg5fDM4MC4yNXw4OC4zNg==)' />
<circle cx='101.50' cy='361.31' r='3.56' style='stroke-width: 0.71; stroke: #6B6D75; fill: #6B6D75;' clip-path='url(#cpNDAuNzR8Mzc0Ljg5fDM4MC4yNXw4OC4zNg==)' />
<circle cx='101.50' cy='353.56' r='3.56' style='stroke-width: 0.71; stroke: #384D57; fill: #384D57;' clip-path='url(#cpNDAuNzR8Mzc0Ljg5fDM4MC4yNXw4OC4zNg==)' />
<circle cx='116.69' cy='364.87' r='3.56' style='stroke-width: 0.71; stroke: #6B6D75; fill: #6B6D75;' clip-path='url(#cpNDAuNzR8Mzc0Ljg5fDM4MC4yNXw4OC4zNg==)' />
<circle cx='116.69' cy='359.01' r='3.56' style='stroke-width: 0.71; stroke: #F3C1B9; fill: #F3C1B9;' clip-path='url(#cpNDAuNzR8Mzc0Ljg5fDM4MC4yNXw4OC4zNg==)' />
<circle cx='116.69' cy='354.91' r='3.56' style='stroke-width: 0.71; stroke: #384D57; fill: #384D57;' clip-path='url(#cpNDAuNzR8Mzc0Ljg5fDM4MC4yNXw4OC4zNg==)' />
<circle cx='131.87' cy='364.88' r='3.56' style='stroke-width: 0.71; stroke: #6B6D75; fill: #6B6D75;' clip-path='url(#cpNDAuNzR8Mzc0Ljg5fDM4MC4yNXw4OC4zNg==)' />
<circle cx='131.87' cy='365.78' r='3.56' style='stroke-width: 0.71; stroke: #F3C1B9; fill: #F3C1B9;' clip-path='url(#cpNDAuNzR8Mzc0Ljg5fDM4MC4yNXw4OC4zNg==)' />
<circle cx='131.87' cy='353.63' r='3.56' style='stroke-width: 0.71; stroke: #384D57; fill: #384D57;' clip-path='url(#cpNDAuNzR8Mzc0Ljg5fDM4MC4yNXw4OC4zNg==)' />
<circle cx='147.06' cy='357.83' r='3.56' style='stroke-width: 0.71; stroke: #6B6D75; fill: #6B6D75;' clip-path='url(#cpNDAuNzR8Mzc0Ljg5fDM4MC4yNXw4OC4zNg==)' />
<circle cx='147.06' cy='363.25' r='3.56' style='stroke-width: 0.71; stroke: #F3C1B9; fill: #F3C1B9;' clip-path='url(#cpNDAuNzR8Mzc0Ljg5fDM4MC4yNXw4OC4zNg==)' />
<circle cx='147.06' cy='352.89' r='3.56' style='stroke-width: 0.71; stroke: #384D57; fill: #384D57;' clip-path='url(#cpNDAuNzR8Mzc0Ljg5fDM4MC4yNXw4OC4zNg==)' />
<circle cx='162.25' cy='350.80' r='3.56' style='stroke-width: 0.71; stroke: #6B6D75; fill: #6B6D75;' clip-path='url(#cpNDAuNzR8Mzc0Ljg5fDM4MC4yNXw4OC4zNg==)' />
<circle cx='162.25' cy='360.82' r='3.56' style='stroke-width: 0.71; stroke: #F3C1B9; fill: #F3C1B9;' clip-path='url(#cpNDAuNzR8Mzc0Ljg5fDM4MC4yNXw4OC4zNg==)' />
<circle cx='162.25' cy='354.47' r='3.56' style='stroke-width: 0.71; stroke: #384D57; fill: #384D57;' clip-path='url(#cpNDAuNzR8Mzc0Ljg5fDM4MC4yNXw4OC4zNg==)' />
<circle cx='177.44' cy='361.38' r='3.56' style='stroke-width: 0.71; stroke: #6B6D75; fill: #6B6D75;' clip-path='url(#cpNDAuNzR8Mzc0Ljg5fDM4MC4yNXw4OC4zNg==)' />
<circle cx='177.44' cy='357.23' r='3.56' style='stroke-width: 0.71; stroke: #F3C1B9; fill: #F3C1B9;' clip-path='url(#cpNDAuNzR8Mzc0Ljg5fDM4MC4yNXw4OC4zNg==)' />
<circle cx='177.44' cy='350.51' r='3.56' style='stroke-width: 0.71; stroke: #384D57; fill: #384D57;' clip-path='url(#cpNDAuNzR8Mzc0Ljg5fDM4MC4yNXw4OC4zNg==)' />
<circle cx='192.63' cy='347.32' r='3.56' style='stroke-width: 0.71; stroke: #6B6D75; fill: #6B6D75;' clip-path='url(#cpNDAuNzR8Mzc0Ljg5fDM4MC4yNXw4OC4zNg==)' />
<circle cx='192.63' cy='355.00' r='3.56' style='stroke-width: 0.71; stroke: #F3C1B9; fill: #F3C1B9;' clip-path='url(#cpNDAuNzR8Mzc0Ljg5fDM4MC4yNXw4OC4zNg==)' />
<circle cx='192.63' cy='339.41' r='3.56' style='stroke-width: 0.71; stroke: #384D57; fill: #384D57;' clip-path='url(#cpNDAuNzR8Mzc0Ljg5fDM4MC4yNXw4OC4zNg==)' />
<circle cx='207.82' cy='280.60' r='3.56' style='stroke-width: 0.71; stroke: #6B6D75; fill: #6B6D75;' clip-path='url(#cpNDAuNzR8Mzc0Ljg5fDM4MC4yNXw4OC4zNg==)' />
<circle cx='207.82' cy='340.85' r='3.56' style='stroke-width: 0.71; stroke: #F3C1B9; fill: #F3C1B9;' clip-path='url(#cpNDAuNzR8Mzc0Ljg5fDM4MC4yNXw4OC4zNg==)' />
<circle cx='207.82' cy='327.15' r='3.56' style='stroke-width: 0.71; stroke: #384D57; fill: #384D57;' clip-path='url(#cpNDAuNzR8Mzc0Ljg5fDM4MC4yNXw4OC4zNg==)' />
<circle cx='223.01' cy='101.63' r='3.56' style='stroke-width: 0.71; stroke: #6B6D75; fill: #6B6D75;' clip-path='url(#cpNDAuNzR8Mzc0Ljg5fDM4MC4yNXw4OC4zNg==)' />
<circle cx='223.01' cy='280.08' r='3.56' style='stroke-width: 0.71; stroke: #F3C1B9; fill: #F3C1B9;' clip-path='url(#cpNDAuNzR8Mzc0Ljg5fDM4MC4yNXw4OC4zNg==)' />
<circle cx='223.01' cy='324.32' r='3.56' style='stroke-width: 0.71; stroke: #384D57; fill: #384D57;' clip-path='url(#cpNDAuNzR8Mzc0Ljg5fDM4MC4yNXw4OC4zNg==)' />
<circle cx='238.19' cy='235.09' r='3.56' style='stroke-width: 0.71; stroke: #6B6D75; fill: #6B6D75;' clip-path='url(#cpNDAuNzR8Mzc0Ljg5fDM4MC4yNXw4OC4zNg==)' />
<circle cx='238.19' cy='300.10' r='3.56' style='stroke-width: 0.71; stroke: #F3C1B9; fill: #F3C1B9;' clip-path='url(#cpNDAuNzR8Mzc0Ljg5fDM4MC4yNXw4OC4zNg==)' />
<circle cx='238.19' cy='319.25' r='3.56' style='stroke-width: 0.71; stroke: #384D57; fill: #384D57;' clip-path='url(#cpNDAuNzR8Mzc0Ljg5fDM4MC4yNXw4OC4zNg==)' />
<circle cx='253.38' cy='287.75' r='3.56' style='stroke-width: 0.71; stroke: #6B6D75; fill: #6B6D75;' clip-path='url(#cpNDAuNzR8Mzc0Ljg5fDM4MC4yNXw4OC4zNg==)' />
<circle cx='253.38' cy='327.41' r='3.56' style='stroke-width: 0.71; stroke: #F3C1B9; fill: #F3C1B9;' clip-path='url(#cpNDAuNzR8Mzc0Ljg5fDM4MC4yNXw4OC4zNg==)' />
<circle cx='253.38' cy='331.97' r='3.56' style='stroke-width: 0.71; stroke: #384D57; fill: #384D57;' clip-path='url(#cpNDAuNzR8Mzc0Ljg5fDM4MC4yNXw4OC4zNg==)' />
<circle cx='268.57' cy='343.87' r='3.56' style='stroke-width: 0.71; stroke: #6B6D75; fill: #6B6D75;' clip-path='url(#cpNDAuNzR8Mzc0Ljg5fDM4MC4yNXw4OC4zNg==)' />
<circle cx='268.57' cy='344.88' r='3.56' style='stroke-width: 0.71; stroke: #F3C1B9; fill: #F3C1B9;' clip-path='url(#cpNDAuNzR8Mzc0Ljg5fDM4MC4yNXw4OC4zNg==)' />
<circle cx='268.57' cy='335.85' r='3.56' style='stroke-width: 0.71; stroke: #384D57; fill: #384D57;' clip-path='url(#cpNDAuNzR8Mzc0Ljg5fDM4MC4yNXw4OC4zNg==)' />
<circle cx='283.76' cy='336.86' r='3.56' style='stroke-width: 0.71; stroke: #6B6D75; fill: #6B6D75;' clip-path='url(#cpNDAuNzR8Mzc0Ljg5fDM4MC4yNXw4OC4zNg==)' />
<circle cx='283.76' cy='356.28' r='3.56' style='stroke-width: 0.71; stroke: #F3C1B9; fill: #F3C1B9;' clip-path='url(#cpNDAuNzR8Mzc0Ljg5fDM4MC4yNXw4OC4zNg==)' />
<circle cx='283.76' cy='335.82' r='3.56' style='stroke-width: 0.71; stroke: #384D57; fill: #384D57;' clip-path='url(#cpNDAuNzR8Mzc0Ljg5fDM4MC4yNXw4OC4zNg==)' />
<circle cx='298.95' cy='336.86' r='3.56' style='stroke-width: 0.71; stroke: #6B6D75; fill: #6B6D75;' clip-path='url(#cpNDAuNzR8Mzc0Ljg5fDM4MC4yNXw4OC4zNg==)' />
<circle cx='298.95' cy='348.86' r='3.56' style='stroke-width: 0.71; stroke: #F3C1B9; fill: #F3C1B9;' clip-path='url(#cpNDAuNzR8Mzc0Ljg5fDM4MC4yNXw4OC4zNg==)' />
<circle cx='298.95' cy='324.70' r='3.56' style='stroke-width: 0.71; stroke: #384D57; fill: #384D57;' clip-path='url(#cpNDAuNzR8Mzc0Ljg5fDM4MC4yNXw4OC4zNg==)' />
<circle cx='314.14' cy='336.85' r='3.56' style='stroke-width: 0.71; stroke: #6B6D75; fill: #6B6D75;' clip-path='url(#cpNDAuNzR8Mzc0Ljg5fDM4MC4yNXw4OC4zNg==)' />
<circle cx='314.14' cy='341.67' r='3.56' style='stroke-width: 0.71; stroke: #F3C1B9; fill: #F3C1B9;' clip-path='url(#cpNDAuNzR8Mzc0Ljg5fDM4MC4yNXw4OC4zNg==)' />
<circle cx='314.14' cy='312.90' r='3.56' style='stroke-width: 0.71; stroke: #384D57; fill: #384D57;' clip-path='url(#cpNDAuNzR8Mzc0Ljg5fDM4MC4yNXw4OC4zNg==)' />
<circle cx='329.33' cy='308.77' r='3.56' style='stroke-width: 0.71; stroke: #6B6D75; fill: #6B6D75;' clip-path='url(#cpNDAuNzR8Mzc0Ljg5fDM4MC4yNXw4OC4zNg==)' />
<circle cx='329.33' cy='339.95' r='3.56' style='stroke-width: 0.71; stroke: #F3C1B9; fill: #F3C1B9;' clip-path='url(#cpNDAuNzR8Mzc0Ljg5fDM4MC4yNXw4OC4zNg==)' />
<circle cx='329.33' cy='310.11' r='3.56' style='stroke-width: 0.71; stroke: #384D57; fill: #384D57;' clip-path='url(#cpNDAuNzR8Mzc0Ljg5fDM4MC4yNXw4OC4zNg==)' />
<circle cx='344.51' cy='287.68' r='3.56' style='stroke-width: 0.71; stroke: #6B6D75; fill: #6B6D75;' clip-path='url(#cpNDAuNzR8Mzc0Ljg5fDM4MC4yNXw4OC4zNg==)' />
<circle cx='344.51' cy='343.47' r='3.56' style='stroke-width: 0.71; stroke: #F3C1B9; fill: #F3C1B9;' clip-path='url(#cpNDAuNzR8Mzc0Ljg5fDM4MC4yNXw4OC4zNg==)' />
<circle cx='344.51' cy='308.29' r='3.56' style='stroke-width: 0.71; stroke: #384D57; fill: #384D57;' clip-path='url(#cpNDAuNzR8Mzc0Ljg5fDM4MC4yNXw4OC4zNg==)' />
<circle cx='359.70' cy='315.73' r='3.56' style='stroke-width: 0.71; stroke: #6B6D75; fill: #6B6D75;' clip-path='url(#cpNDAuNzR8Mzc0Ljg5fDM4MC4yNXw4OC4zNg==)' />
<circle cx='359.70' cy='341.77' r='3.56' style='stroke-width: 0.71; stroke: #F3C1B9; fill: #F3C1B9;' clip-path='url(#cpNDAuNzR8Mzc0Ljg5fDM4MC4yNXw4OC4zNg==)' />
<circle cx='359.70' cy='314.07' r='3.56' style='stroke-width: 0.71; stroke: #384D57; fill: #384D57;' clip-path='url(#cpNDAuNzR8Mzc0Ljg5fDM4MC4yNXw4OC4zNg==)' />
<defs>
  <clipPath id='cpMC4wMHw3MjAuMDB8NDMyLjAwfDAuMDA='>
    <rect x='0.00' y='0.00' width='720.00' height='432.00' />
  </clipPath>
</defs>
<defs>
  <clipPath id='cpMzgwLjM3fDcxNC41MnwzODAuMjV8ODguMzY='>
    <rect x='380.37' y='88.36' width='334.15' height='291.89' />
  </clipPath>
</defs>
<polyline points='380.37,317.88 714.52,317.88 ' style='stroke-width: 0.53; stroke: #EBEBEB; stroke-dasharray: 4.00,4.00; stroke-linecap: butt;' clip-path='url(#cpMzgwLjM3fDcxNC41MnwzODAuMjV8ODguMzY=)' />
<polyline points='380.37,216.81 714.52,216.81 ' style='stroke-width: 0.53; stroke: #EBEBEB; stroke-dasharray: 4.00,4.00; stroke-linecap: butt;' clip-path='url(#cpMzgwLjM3fDcxNC41MnwzODAuMjV8ODguMzY=)' />
<polyline points='380.37,115.74 714.52,115.74 ' style='stroke-width: 0.53; stroke: #EBEBEB; stroke-dasharray: 4.00,4.00; stroke-linecap: butt;' clip-path='url(#cpMzgwLjM3fDcxNC41MnwzODAuMjV8ODguMzY=)' />
<polyline points='433.53,380.25 433.53,88.36 ' style='stroke-width: 0.53; stroke: #EBEBEB; stroke-dasharray: 4.00,4.00; stroke-linecap: butt;' clip-path='url(#cpMzgwLjM3fDcxNC41MnwzODAuMjV8ODguMzY=)' />
<polyline points='509.47,380.25 509.47,88.36 ' style='stroke-width: 0.53; stroke: #EBEBEB; stroke-dasharray: 4.00,4.00; stroke-linecap: butt;' clip-path='url(#cpMzgwLjM3fDcxNC41MnwzODAuMjV8ODguMzY=)' />
<polyline points='585.42,380.25 585.42,88.36 ' style='stroke-width: 0.53; stroke: #EBEBEB; stroke-dasharray: 4.00,4.00; stroke-linecap: butt;' clip-path='url(#cpMzgwLjM3fDcxNC41MnwzODAuMjV8ODguMzY=)' />
<polyline points='661.36,380.25 661.36,88.36 ' style='stroke-width: 0.53; stroke: #EBEBEB; stroke-dasharray: 4.00,4.00; stroke-linecap: butt;' clip-path='url(#cpMzgwLjM3fDcxNC41MnwzODAuMjV8ODguMzY=)' />
<polyline points='380.37,368.42 714.52,368.42 ' style='stroke-width: 1.07; stroke: #EBEBEB; stroke-dasharray: 5.69,5.69; stroke-linecap: butt;' clip-path='url(#cpMzgwLjM3fDcxNC41MnwzODAuMjV8ODguMzY=)' />
<polyline points='380.37,267.35 714.52,267.35 ' style='stroke-width: 1.07; stroke: #EBEBEB; stroke-dasharray: 5.69,5.69; stroke-linecap: butt;' clip-path='url(#cpMzgwLjM3fDcxNC41MnwzODAuMjV8ODguMzY=)' />
<polyline points='380.37,166.28 714.52,166.28 ' style='stroke-width: 1.07; stroke: #EBEBEB; stroke-dasharray: 5.69,5.69; stroke-linecap: butt;' clip-path='url(#cpMzgwLjM3fDcxNC41MnwzODAuMjV8ODguMzY=)' />
<polyline points='395.56,380.25 395.56,88.36 ' style='stroke-width: 1.07; stroke: #EBEBEB; stroke-dasharray: 5.69,5.69; stroke-linecap: butt;' clip-path='url(#cpMzgwLjM3fDcxNC41MnwzODAuMjV8ODguMzY=)' />
<polyline points='471.50,380.25 471.50,88.36 ' style='stroke-width: 1.07; stroke: #EBEBEB; stroke-dasharray: 5.69,5.69; stroke-linecap: butt;' clip-path='url(#cpMzgwLjM3fDcxNC41MnwzODAuMjV8ODguMzY=)' />
<polyline points='547.45,380.25 547.45,88.36 ' style='stroke-width: 1.07; stroke: #EBEBEB; stroke-dasharray: 5.69,5.69; stroke-linecap: butt;' clip-path='url(#cpMzgwLjM3fDcxNC41MnwzODAuMjV8ODguMzY=)' />
<polyline points='623.39,380.25 623.39,88.36 ' style='stroke-width: 1.07; stroke: #EBEBEB; stroke-dasharray: 5.69,5.69; stroke-linecap: butt;' clip-path='url(#cpMzgwLjM3fDcxNC41MnwzODAuMjV8ODguMzY=)' />
<polyline points='699.33,380.25 699.33,88.36 ' style='stroke-width: 1.07; stroke: #EBEBEB; stroke-dasharray: 5.69,5.69; stroke-linecap: butt;' clip-path='url(#cpMzgwLjM3fDcxNC41MnwzODAuMjV8ODguMzY=)' />
<polyline points='395.56,364.83 410.75,361.27 425.94,364.86 441.13,364.87 456.31,361.33 471.50,347.20 486.69,354.30 501.88,361.37 517.07,364.90 532.26,357.87 547.45,357.88 562.63,312.25 577.82,315.79 593.01,329.84 608.20,343.87 623.39,322.83 638.58,354.39 653.77,361.40 668.95,340.35 684.14,340.33 699.33,336.80 ' style='stroke-width: 4.27; stroke: #6B6D75; stroke-linecap: butt;' clip-path='url(#cpMzgwLjM3fDcxNC41MnwzODAuMjV8ODguMzY=)' />
<polyline points='395.56,362.54 425.94,361.40 441.13,360.18 456.31,357.67 471.50,363.15 486.69,359.38 501.88,363.35 517.07,354.75 532.26,348.89 547.45,344.45 562.63,350.75 577.82,344.10 593.01,359.31 608.20,351.61 623.39,360.70 638.58,345.61 653.77,355.58 668.95,348.38 684.14,337.23 699.33,341.77 ' style='stroke-width: 4.27; stroke: #F3C1B9; stroke-linecap: butt;' clip-path='url(#cpMzgwLjM3fDcxNC41MnwzODAuMjV8ODguMzY=)' />
<polyline points='395.56,348.60 410.75,348.60 425.94,349.45 441.13,348.94 456.31,348.35 471.50,347.74 486.69,349.93 501.88,352.15 517.07,348.03 532.26,343.27 547.45,343.46 562.63,344.86 577.82,343.56 593.01,340.92 608.20,341.32 623.39,341.11 638.58,337.58 653.77,335.54 668.95,336.17 684.14,338.18 699.33,338.42 ' style='stroke-width: 4.27; stroke: #384D57; stroke-linecap: butt;' clip-path='url(#cpMzgwLjM3fDcxNC41MnwzODAuMjV8ODguMzY=)' />
<circle cx='395.56' cy='364.83' r='3.56' style='stroke-width: 0.71; stroke: #6B6D75; fill: #6B6D75;' clip-path='url(#cpMzgwLjM3fDcxNC41MnwzODAuMjV8ODguMzY=)' />
<circle cx='395.56' cy='362.54' r='3.56' style='stroke-width: 0.71; stroke: #F3C1B9; fill: #F3C1B9;' clip-path='url(#cpMzgwLjM3fDcxNC41MnwzODAuMjV8ODguMzY=)' />
<circle cx='395.56' cy='348.60' r='3.56' style='stroke-width: 0.71; stroke: #384D57; fill: #384D57;' clip-path='url(#cpMzgwLjM3fDcxNC41MnwzODAuMjV8ODguMzY=)' />
<circle cx='410.75' cy='361.27' r='3.56' style='stroke-width: 0.71; stroke: #6B6D75; fill: #6B6D75;' clip-path='url(#cpMzgwLjM3fDcxNC41MnwzODAuMjV8ODguMzY=)' />
<circle cx='410.75' cy='348.60' r='3.56' style='stroke-width: 0.71; stroke: #384D57; fill: #384D57;' clip-path='url(#cpMzgwLjM3fDcxNC41MnwzODAuMjV8ODguMzY=)' />
<circle cx='425.94' cy='364.86' r='3.56' style='stroke-width: 0.71; stroke: #6B6D75; fill: #6B6D75;' clip-path='url(#cpMzgwLjM3fDcxNC41MnwzODAuMjV8ODguMzY=)' />
<circle cx='425.94' cy='361.40' r='3.56' style='stroke-width: 0.71; stroke: #F3C1B9; fill: #F3C1B9;' clip-path='url(#cpMzgwLjM3fDcxNC41MnwzODAuMjV8ODguMzY=)' />
<circle cx='425.94' cy='349.45' r='3.56' style='stroke-width: 0.71; stroke: #384D57; fill: #384D57;' clip-path='url(#cpMzgwLjM3fDcxNC41MnwzODAuMjV8ODguMzY=)' />
<circle cx='441.13' cy='364.87' r='3.56' style='stroke-width: 0.71; stroke: #6B6D75; fill: #6B6D75;' clip-path='url(#cpMzgwLjM3fDcxNC41MnwzODAuMjV8ODguMzY=)' />
<circle cx='441.13' cy='360.18' r='3.56' style='stroke-width: 0.71; stroke: #F3C1B9; fill: #F3C1B9;' clip-path='url(#cpMzgwLjM3fDcxNC41MnwzODAuMjV8ODguMzY=)' />
<circle cx='441.13' cy='348.94' r='3.56' style='stroke-width: 0.71; stroke: #384D57; fill: #384D57;' clip-path='url(#cpMzgwLjM3fDcxNC41MnwzODAuMjV8ODguMzY=)' />
<circle cx='456.31' cy='361.33' r='3.56' style='stroke-width: 0.71; stroke: #6B6D75; fill: #6B6D75;' clip-path='url(#cpMzgwLjM3fDcxNC41MnwzODAuMjV8ODguMzY=)' />
<circle cx='456.31' cy='357.67' r='3.56' style='stroke-width: 0.71; stroke: #F3C1B9; fill: #F3C1B9;' clip-path='url(#cpMzgwLjM3fDcxNC41MnwzODAuMjV8ODguMzY=)' />
<circle cx='456.31' cy='348.35' r='3.56' style='stroke-width: 0.71; stroke: #384D57; fill: #384D57;' clip-path='url(#cpMzgwLjM3fDcxNC41MnwzODAuMjV8ODguMzY=)' />
<circle cx='471.50' cy='347.20' r='3.56' style='stroke-width: 0.71; stroke: #6B6D75; fill: #6B6D75;' clip-path='url(#cpMzgwLjM3fDcxNC41MnwzODAuMjV8ODguMzY=)' />
<circle cx='471.50' cy='363.15' r='3.56' style='stroke-width: 0.71; stroke: #F3C1B9; fill: #F3C1B9;' clip-path='url(#cpMzgwLjM3fDcxNC41MnwzODAuMjV8ODguMzY=)' />
<circle cx='471.50' cy='347.74' r='3.56' style='stroke-width: 0.71; stroke: #384D57; fill: #384D57;' clip-path='url(#cpMzgwLjM3fDcxNC41MnwzODAuMjV8ODguMzY=)' />
<circle cx='486.69' cy='354.30' r='3.56' style='stroke-width: 0.71; stroke: #6B6D75; fill: #6B6D75;' clip-path='url(#cpMzgwLjM3fDcxNC41MnwzODAuMjV8ODguMzY=)' />
<circle cx='486.69' cy='359.38' r='3.56' style='stroke-width: 0.71; stroke: #F3C1B9; fill: #F3C1B9;' clip-path='url(#cpMzgwLjM3fDcxNC41MnwzODAuMjV8ODguMzY=)' />
<circle cx='486.69' cy='349.93' r='3.56' style='stroke-width: 0.71; stroke: #384D57; fill: #384D57;' clip-path='url(#cpMzgwLjM3fDcxNC41MnwzODAuMjV8ODguMzY=)' />
<circle cx='501.88' cy='361.37' r='3.56' style='stroke-width: 0.71; stroke: #6B6D75; fill: #6B6D75;' clip-path='url(#cpMzgwLjM3fDcxNC41MnwzODAuMjV8ODguMzY=)' />
<circle cx='501.88' cy='363.35' r='3.56' style='stroke-width: 0.71; stroke: #F3C1B9; fill: #F3C1B9;' clip-path='url(#cpMzgwLjM3fDcxNC41MnwzODAuMjV8ODguMzY=)' />
<circle cx='501.88' cy='352.15' r='3.56' style='stroke-width: 0.71; stroke: #384D57; fill: #384D57;' clip-path='url(#cpMzgwLjM3fDcxNC41MnwzODAuMjV8ODguMzY=)' />
<circle cx='517.07' cy='364.90' r='3.56' style='stroke-width: 0.71; stroke: #6B6D75; fill: #6B6D75;' clip-path='url(#cpMzgwLjM3fDcxNC41MnwzODAuMjV8ODguMzY=)' />
<circle cx='517.07' cy='354.75' r='3.56' style='stroke-width: 0.71; stroke: #F3C1B9; fill: #F3C1B9;' clip-path='url(#cpMzgwLjM3fDcxNC41MnwzODAuMjV8ODguMzY=)' />
<circle cx='517.07' cy='348.03' r='3.56' style='stroke-width: 0.71; stroke: #384D57; fill: #384D57;' clip-path='url(#cpMzgwLjM3fDcxNC41MnwzODAuMjV8ODguMzY=)' />
<circle cx='532.26' cy='357.87' r='3.56' style='stroke-width: 0.71; stroke: #6B6D75; fill: #6B6D75;' clip-path='url(#cpMzgwLjM3fDcxNC41MnwzODAuMjV8ODguMzY=)' />
<circle cx='532.26' cy='348.89' r='3.56' style='stroke-width: 0.71; stroke: #F3C1B9; fill: #F3C1B9;' clip-path='url(#cpMzgwLjM3fDcxNC41MnwzODAuMjV8ODguMzY=)' />
<circle cx='532.26' cy='343.27' r='3.56' style='stroke-width: 0.71; stroke: #384D57; fill: #384D57;' clip-path='url(#cpMzgwLjM3fDcxNC41MnwzODAuMjV8ODguMzY=)' />
<circle cx='547.45' cy='357.88' r='3.56' style='stroke-width: 0.71; stroke: #6B6D75; fill: #6B6D75;' clip-path='url(#cpMzgwLjM3fDcxNC41MnwzODAuMjV8ODguMzY=)' />
<circle cx='547.45' cy='344.45' r='3.56' style='stroke-width: 0.71; stroke: #F3C1B9; fill: #F3C1B9;' clip-path='url(#cpMzgwLjM3fDcxNC41MnwzODAuMjV8ODguMzY=)' />
<circle cx='547.45' cy='343.46' r='3.56' style='stroke-width: 0.71; stroke: #384D57; fill: #384D57;' clip-path='url(#cpMzgwLjM3fDcxNC41MnwzODAuMjV8ODguMzY=)' />
<circle cx='562.63' cy='312.25' r='3.56' style='stroke-width: 0.71; stroke: #6B6D75; fill: #6B6D75;' clip-path='url(#cpMzgwLjM3fDcxNC41MnwzODAuMjV8ODguMzY=)' />
<circle cx='562.63' cy='350.75' r='3.56' style='stroke-width: 0.71; stroke: #F3C1B9; fill: #F3C1B9;' clip-path='url(#cpMzgwLjM3fDcxNC41MnwzODAuMjV8ODguMzY=)' />
<circle cx='562.63' cy='344.86' r='3.56' style='stroke-width: 0.71; stroke: #384D57; fill: #384D57;' clip-path='url(#cpMzgwLjM3fDcxNC41MnwzODAuMjV8ODguMzY=)' />
<circle cx='577.82' cy='315.79' r='3.56' style='stroke-width: 0.71; stroke: #6B6D75; fill: #6B6D75;' clip-path='url(#cpMzgwLjM3fDcxNC41MnwzODAuMjV8ODguMzY=)' />
<circle cx='577.82' cy='344.10' r='3.56' style='stroke-width: 0.71; stroke: #F3C1B9; fill: #F3C1B9;' clip-path='url(#cpMzgwLjM3fDcxNC41MnwzODAuMjV8ODguMzY=)' />
<circle cx='577.82' cy='343.56' r='3.56' style='stroke-width: 0.71; stroke: #384D57; fill: #384D57;' clip-path='url(#cpMzgwLjM3fDcxNC41MnwzODAuMjV8ODguMzY=)' />
<circle cx='593.01' cy='329.84' r='3.56' style='stroke-width: 0.71; stroke: #6B6D75; fill: #6B6D75;' clip-path='url(#cpMzgwLjM3fDcxNC41MnwzODAuMjV8ODguMzY=)' />
<circle cx='593.01' cy='359.31' r='3.56' style='stroke-width: 0.71; stroke: #F3C1B9; fill: #F3C1B9;' clip-path='url(#cpMzgwLjM3fDcxNC41MnwzODAuMjV8ODguMzY=)' />
<circle cx='593.01' cy='340.92' r='3.56' style='stroke-width: 0.71; stroke: #384D57; fill: #384D57;' clip-path='url(#cpMzgwLjM3fDcxNC41MnwzODAuMjV8ODguMzY=)' />
<circle cx='608.20' cy='343.87' r='3.56' style='stroke-width: 0.71; stroke: #6B6D75; fill: #6B6D75;' clip-path='url(#cpMzgwLjM3fDcxNC41MnwzODAuMjV8ODguMzY=)' />
<circle cx='608.20' cy='351.61' r='3.56' style='stroke-width: 0.71; stroke: #F3C1B9; fill: #F3C1B9;' clip-path='url(#cpMzgwLjM3fDcxNC41MnwzODAuMjV8ODguMzY=)' />
<circle cx='608.20' cy='341.32' r='3.56' style='stroke-width: 0.71; stroke: #384D57; fill: #384D57;' clip-path='url(#cpMzgwLjM3fDcxNC41MnwzODAuMjV8ODguMzY=)' />
<circle cx='623.39' cy='322.83' r='3.56' style='stroke-width: 0.71; stroke: #6B6D75; fill: #6B6D75;' clip-path='url(#cpMzgwLjM3fDcxNC41MnwzODAuMjV8ODguMzY=)' />
<circle cx='623.39' cy='360.70' r='3.56' style='stroke-width: 0.71; stroke: #F3C1B9; fill: #F3C1B9;' clip-path='url(#cpMzgwLjM3fDcxNC41MnwzODAuMjV8ODguMzY=)' />
<circle cx='623.39' cy='341.11' r='3.56' style='stroke-width: 0.71; stroke: #384D57; fill: #384D57;' clip-path='url(#cpMzgwLjM3fDcxNC41MnwzODAuMjV8ODguMzY=)' />
<circle cx='638.58' cy='354.39' r='3.56' style='stroke-width: 0.71; stroke: #6B6D75; fill: #6B6D75;' clip-path='url(#cpMzgwLjM3fDcxNC41MnwzODAuMjV8ODguMzY=)' />
<circle cx='638.58' cy='345.61' r='3.56' style='stroke-width: 0.71; stroke: #F3C1B9; fill: #F3C1B9;' clip-path='url(#cpMzgwLjM3fDcxNC41MnwzODAuMjV8ODguMzY=)' />
<circle cx='638.58' cy='337.58' r='3.56' style='stroke-width: 0.71; stroke: #384D57; fill: #384D57;' clip-path='url(#cpMzgwLjM3fDcxNC41MnwzODAuMjV8ODguMzY=)' />
<circle cx='653.77' cy='361.40' r='3.56' style='stroke-width: 0.71; stroke: #6B6D75; fill: #6B6D75;' clip-path='url(#cpMzgwLjM3fDcxNC41MnwzODAuMjV8ODguMzY=)' />
<circle cx='653.77' cy='355.58' r='3.56' style='stroke-width: 0.71; stroke: #F3C1B9; fill: #F3C1B9;' clip-path='url(#cpMzgwLjM3fDcxNC41MnwzODAuMjV8ODguMzY=)' />
<circle cx='653.77' cy='335.54' r='3.56' style='stroke-width: 0.71; stroke: #384D57; fill: #384D57;' clip-path='url(#cpMzgwLjM3fDcxNC41MnwzODAuMjV8ODguMzY=)' />
<circle cx='668.95' cy='340.35' r='3.56' style='stroke-width: 0.71; stroke: #6B6D75; fill: #6B6D75;' clip-path='url(#cpMzgwLjM3fDcxNC41MnwzODAuMjV8ODguMzY=)' />
<circle cx='668.95' cy='348.38' r='3.56' style='stroke-width: 0.71; stroke: #F3C1B9; fill: #F3C1B9;' clip-path='url(#cpMzgwLjM3fDcxNC41MnwzODAuMjV8ODguMzY=)' />
<circle cx='668.95' cy='336.17' r='3.56' style='stroke-width: 0.71; stroke: #384D57; fill: #384D57;' clip-path='url(#cpMzgwLjM3fDcxNC41MnwzODAuMjV8ODguMzY=)' />
<circle cx='684.14' cy='340.33' r='3.56' style='stroke-width: 0.71; stroke: #6B6D75; fill: #6B6D75;' clip-path='url(#cpMzgwLjM3fDcxNC41MnwzODAuMjV8ODguMzY=)' />
<circle cx='684.14' cy='337.23' r='3.56' style='stroke-width: 0.71; stroke: #F3C1B9; fill: #F3C1B9;' clip-path='url(#cpMzgwLjM3fDcxNC41MnwzODAuMjV8ODguMzY=)' />
<circle cx='684.14' cy='338.18' r='3.56' style='stroke-width: 0.71; stroke: #384D57; fill: #384D57;' clip-path='url(#cpMzgwLjM3fDcxNC41MnwzODAuMjV8ODguMzY=)' />
<circle cx='699.33' cy='336.80' r='3.56' style='stroke-width: 0.71; stroke: #6B6D75; fill: #6B6D75;' clip-path='url(#cpMzgwLjM3fDcxNC41MnwzODAuMjV8ODguMzY=)' />
<circle cx='699.33' cy='341.77' r='3.56' style='stroke-width: 0.71; stroke: #F3C1B9; fill: #F3C1B9;' clip-path='url(#cpMzgwLjM3fDcxNC41MnwzODAuMjV8ODguMzY=)' />
<circle cx='699.33' cy='338.42' r='3.56' style='stroke-width: 0.71; stroke: #384D57; fill: #384D57;' clip-path='url(#cpMzgwLjM3fDcxNC41MnwzODAuMjV8ODguMzY=)' />
<defs>
  <clipPath id='cpMC4wMHw3MjAuMDB8NDMyLjAwfDAuMDA='>
    <rect x='0.00' y='0.00' width='720.00' height='432.00' />
  </clipPath>
</defs>
<defs>
  <clipPath id='cpNDAuNzR8Mzc0Ljg5fDg4LjM2fDY4LjU2'>
    <rect x='40.74' y='68.56' width='334.15' height='19.81' />
  </clipPath>
</defs>
<rect x='40.74' y='68.56' width='334.15' height='19.81' style='stroke-width: 1.07; fill: #525252;' clip-path='url(#cpNDAuNzR8Mzc0Ljg5fDg4LjM2fDY4LjU2)' />
<g clip-path='url(#cpNDAuNzR8Mzc0Ljg5fDg4LjM2fDY4LjU2)'><text x='174.28' y='82.66' style='font-size: 12.00px; font-weight: bold; fill: #FAF9F6; font-family: Rubik;' textLength='67.08px' lengthAdjust='spacingAndGlyphs'>Vía pública</text></g>
<defs>
  <clipPath id='cpMC4wMHw3MjAuMDB8NDMyLjAwfDAuMDA='>
    <rect x='0.00' y='0.00' width='720.00' height='432.00' />
  </clipPath>
</defs>
<defs>
  <clipPath id='cpMzgwLjM3fDcxNC41Mnw4OC4zNnw2OC41Ng=='>
    <rect x='380.37' y='68.56' width='334.15' height='19.81' />
  </clipPath>
</defs>
<rect x='380.37' y='68.56' width='334.15' height='19.81' style='stroke-width: 1.07; fill: #525252;' clip-path='url(#cpMzgwLjM3fDcxNC41Mnw4OC4zNnw2OC41Ng==)' />
<g clip-path='url(#cpMzgwLjM3fDcxNC41Mnw4OC4zNnw2OC41Ng==)'><text x='520.75' y='82.66' style='font-size: 12.00px; font-weight: bold; fill: #FAF9F6; font-family: Rubik;' textLength='53.39px' lengthAdjust='spacingAndGlyphs'>Vivienda</text></g>
<defs>
  <clipPath id='cpMC4wMHw3MjAuMDB8NDMyLjAwfDAuMDA='>
    <rect x='0.00' y='0.00' width='720.00' height='432.00' />
  </clipPath>
</defs>
<g clip-path='url(#cpMC4wMHw3MjAuMDB8NDMyLjAwfDAuMDA=)'><text x='39.29' y='393.58' style='font-size: 12.00px; font-weight: bold; fill: #4D4D4D; font-family: Rubik;' textLength='33.29px' lengthAdjust='spacingAndGlyphs'>2000</text></g>
<g clip-path='url(#cpMC4wMHw3MjAuMDB8NDMyLjAwfDAuMDA=)'><text x='115.42' y='393.58' style='font-size: 12.00px; font-weight: bold; fill: #4D4D4D; font-family: Rubik;' textLength='32.92px' lengthAdjust='spacingAndGlyphs'>2005</text></g>
<g clip-path='url(#cpMC4wMHw3MjAuMDB8NDMyLjAwfDAuMDA=)'><text x='192.21' y='393.58' style='font-size: 12.00px; font-weight: bold; fill: #4D4D4D; font-family: Rubik;' textLength='31.22px' lengthAdjust='spacingAndGlyphs'>2010</text></g>
<g clip-path='url(#cpMC4wMHw3MjAuMDB8NDMyLjAwfDAuMDA=)'><text x='268.33' y='393.58' style='font-size: 12.00px; font-weight: bold; fill: #4D4D4D; font-family: Rubik;' textLength='30.85px' lengthAdjust='spacingAndGlyphs'>2015</text></g>
<g clip-path='url(#cpMC4wMHw3MjAuMDB8NDMyLjAwfDAuMDA=)'><text x='343.19' y='393.58' style='font-size: 12.00px; font-weight: bold; fill: #4D4D4D; font-family: Rubik;' textLength='33.02px' lengthAdjust='spacingAndGlyphs'>2020</text></g>
<g clip-path='url(#cpMC4wMHw3MjAuMDB8NDMyLjAwfDAuMDA=)'><text x='378.92' y='393.58' style='font-size: 12.00px; font-weight: bold; fill: #4D4D4D; font-family: Rubik;' textLength='33.29px' lengthAdjust='spacingAndGlyphs'>2000</text></g>
<g clip-path='url(#cpMC4wMHw3MjAuMDB8NDMyLjAwfDAuMDA=)'><text x='455.04' y='393.58' style='font-size: 12.00px; font-weight: bold; fill: #4D4D4D; font-family: Rubik;' textLength='32.92px' lengthAdjust='spacingAndGlyphs'>2005</text></g>
<g clip-path='url(#cpMC4wMHw3MjAuMDB8NDMyLjAwfDAuMDA=)'><text x='531.83' y='393.58' style='font-size: 12.00px; font-weight: bold; fill: #4D4D4D; font-family: Rubik;' textLength='31.22px' lengthAdjust='spacingAndGlyphs'>2010</text></g>
<g clip-path='url(#cpMC4wMHw3MjAuMDB8NDMyLjAwfDAuMDA=)'><text x='607.96' y='393.58' style='font-size: 12.00px; font-weight: bold; fill: #4D4D4D; font-family: Rubik;' textLength='30.85px' lengthAdjust='spacingAndGlyphs'>2015</text></g>
<g clip-path='url(#cpMC4wMHw3MjAuMDB8NDMyLjAwfDAuMDA=)'><text x='682.82' y='393.58' style='font-size: 12.00px; font-weight: bold; fill: #4D4D4D; font-family: Rubik;' textLength='33.02px' lengthAdjust='spacingAndGlyphs'>2020</text></g>
<g clip-path='url(#cpMC4wMHw3MjAuMDB8NDMyLjAwfDAuMDA=)'><text x='27.42' y='372.62' style='font-size: 12.00px; font-weight: bold; fill: #4D4D4D; font-family: Rubik;' textLength='8.39px' lengthAdjust='spacingAndGlyphs'>0</text></g>
<g clip-path='url(#cpMC4wMHw3MjAuMDB8NDMyLjAwfDAuMDA=)'><text x='27.80' y='271.55' style='font-size: 12.00px; font-weight: bold; fill: #4D4D4D; font-family: Rubik;' textLength='8.02px' lengthAdjust='spacingAndGlyphs'>5</text></g>
<g clip-path='url(#cpMC4wMHw3MjAuMDB8NDMyLjAwfDAuMDA=)'><text x='21.10' y='170.48' style='font-size: 12.00px; font-weight: bold; fill: #4D4D4D; font-family: Rubik;' textLength='14.71px' lengthAdjust='spacingAndGlyphs'>10</text></g>
<line x1='238.64' y1='43.48' x2='252.47' y2='43.48' style='stroke-width: 4.27; stroke: #6B6D75; stroke-linecap: butt;' clip-path='url(#cpMC4wMHw3MjAuMDB8NDMyLjAwfDAuMDA=)' />
<circle cx='245.56' cy='43.48' r='3.56' style='stroke-width: 0.71; stroke: #6B6D75; fill: #6B6D75;' clip-path='url(#cpMC4wMHw3MjAuMDB8NDMyLjAwfDAuMDA=)' />
<line x1='327.44' y1='43.48' x2='341.26' y2='43.48' style='stroke-width: 4.27; stroke: #F3C1B9; stroke-linecap: butt;' clip-path='url(#cpMC4wMHw3MjAuMDB8NDMyLjAwfDAuMDA=)' />
<circle cx='334.35' cy='43.48' r='3.56' style='stroke-width: 0.71; stroke: #F3C1B9; fill: #F3C1B9;' clip-path='url(#cpMC4wMHw3MjAuMDB8NDMyLjAwfDAuMDA=)' />
<line x1='425.06' y1='43.48' x2='438.88' y2='43.48' style='stroke-width: 4.27; stroke: #384D57; stroke-linecap: butt;' clip-path='url(#cpMC4wMHw3MjAuMDB8NDMyLjAwfDAuMDA=)' />
<circle cx='431.97' cy='43.48' r='3.56' style='stroke-width: 0.71; stroke: #384D57; fill: #384D57;' clip-path='url(#cpMC4wMHw3MjAuMDB8NDMyLjAwfDAuMDA=)' />
<g clip-path='url(#cpMC4wMHw3MjAuMDB8NDMyLjAwfDAuMDA=)'><text x='261.17' y='47.68' style='font-size: 12.00px; fill: #595959; font-family: Rubik;' textLength='57.56px' lengthAdjust='spacingAndGlyphs'>Monterrey</text></g>
<g clip-path='url(#cpMC4wMHw3MjAuMDB8NDMyLjAwfDAuMDA=)'><text x='349.96' y='47.68' style='font-size: 12.00px; fill: #595959; font-family: Rubik;' textLength='66.40px' lengthAdjust='spacingAndGlyphs'>Nuevo León</text></g>
<g clip-path='url(#cpMC4wMHw3MjAuMDB8NDMyLjAwfDAuMDA=)'><text x='447.59' y='47.68' style='font-size: 12.00px; fill: #595959; font-family: Rubik;' textLength='77.74px' lengthAdjust='spacingAndGlyphs'>Resto del país</text></g>
<g clip-path='url(#cpMC4wMHw3MjAuMDB8NDMyLjAwfDAuMDA=)'><text x='9.96' y='19.48' style='font-size: 20.00px; font-weight: bold; font-family: Rubik;' textLength='735.34px' lengthAdjust='spacingAndGlyphs'>Tasa de mujeres asesinadas en Nuevo León, Monterrey y el resto del país</text></g>
<g clip-path='url(#cpMC4wMHw3MjAuMDB8NDMyLjAwfDAuMDA=)'><text x='40.74' y='424.32' style='font-size: 10.00px; font-style: italic; fill: #595959; font-family: Rubik;' textLength='300.22px' lengthAdjust='spacingAndGlyphs'>Fuente: Elaboración propia con datos de mortalidad del INEGI</text></g>
</svg>
