1) I need you [inizia alla linea: 2] [Num. linee: 12]
2) Not a second time [inizia alla linea: 18] [Num. linee: 12]
3) The long and winding road  [inizia alla linea: 34] [Num. linee: 14]
4) I'll be back [inizia alla linea: 52] [Num. linee: 13]
5) I'll cry instead [inizia alla linea: 69] [Num. linee: 13]
6) Carry that weight [inizia alla linea: 86] [Num. linee: 14]
7) Golden slumbers [inizia alla linea: 104] [Num. linee: 14]
8) Norwegian wood [inizia alla linea: 122] [Num. linee: 14]
9) Yesterday [inizia alla linea: 140] [Num. linee: 14]
10) A taste of honey [inizia alla linea: 158] [Num. linee: 15]
11) Any time at all [inizia alla linea: 177] [Num. linee: 15]
12) For you blue [inizia alla linea: 196] [Num. linee: 15]
13) Mean Mr. Mustard [inizia alla linea: 215] [Num. linee: 15]
14) All my loving [inizia alla linea: 234] [Num. linee: 16]
15) And your bird can sing [inizia alla linea: 254] [Num. linee: 16]
16) Can't buy me love [inizia alla linea: 274] [Num. linee: 17]
17) Day tripper [inizia alla linea: 295] [Num. linee: 17]
18) I'll follow the sun [inizia alla linea: 316] [Num. linee: 17]
19) Long, long, long [inizia alla linea: 337] [Num. linee: 17]
20) Within you without you [inizia alla linea: 358] [Num. linee: 17]
21) Tell me what you see [inizia alla linea: 379] [Num. linee: 18]
22) What you're doing [inizia alla linea: 401] [Num. linee: 18]
23) Please please me [inizia alla linea: 423] [Num. linee: 19]
24) Good day sunshine [inizia alla linea: 446] [Num. linee: 20]
25) I'm so tired [inizia alla linea: 470] [Num. linee: 20]
26) It's only love [inizia alla linea: 494] [Num. linee: 20]
27) Love you to [inizia alla linea: 518] [Num. linee: 20]
28) The fool on the hill [inizia alla linea: 542] [Num. linee: 20]
29) Tomorrow never knows [inizia alla linea: 566] [Num. linee: 20]
30) Being for the benefit of Mr. Kite! [inizia alla linea: 590] [Num. linee: 21]
31) Come together [inizia alla linea: 615] [Num. linee: 21]
32) Dear prudence [inizia alla linea: 640] [Num. linee: 21]
33) Julia [inizia alla linea: 665] [Num. linee: 21]
34) Little child [inizia alla linea: 690] [Num. linee: 21]
35) She's a woman [inizia alla linea: 715] [Num. linee: 21]
36) Taxman [inizia alla linea: 740] [Num. linee: 21]
37) The inner light [inizia alla linea: 765] [Num. linee: 21]
38) While my guitar gently weeps [inizia alla linea: 790] [Num. linee: 21]
39) Bad boy [inizia alla linea: 815] [Num. linee: 22]
40) Birthday [inizia alla linea: 841] [Num. linee: 22]
41) Blackbird [inizia alla linea: 867] [Num. linee: 22]
42) Glass onion [inizia alla linea: 893] [Num. linee: 22]
43) I will [inizia alla linea: 919] [Num. linee: 22]
44) Magical mystery tour [inizia alla linea: 945] [Num. linee: 22]
45) Old brown shoe [inizia alla linea: 971] [Num. linee: 22]
46) Piggies [inizia alla linea: 997] [Num. linee: 22]
47) Strawberry fields forever [inizia alla linea: 1023] [Num. linee: 22]
48) Doctor Robert [inizia alla linea: 1049] [Num. linee: 23]
49) In my life [inizia alla linea: 1076] [Num. linee: 23]
50) Another girl [inizia alla linea: 1103] [Num. linee: 24]
51) Good night [inizia alla linea: 1131] [Num. linee: 24]
52) Here comes the sun [inizia alla linea: 1159] [Num. linee: 24]
53) Hey bulldog [inizia alla linea: 1187] [Num. linee: 24]
54) Honey don't [inizia alla linea: 1215] [Num. linee: 24]
55) It won't be long [inizia alla linea: 1243] [Num. linee: 24]
56) Lady Madonna [inizia alla linea: 1271] [Num. linee: 24]
57) Lovely Rita [inizia alla linea: 1299] [Num. linee: 24]
58) Martha my dear [inizia alla linea: 1327] [Num. linee: 24]
59) Rain [inizia alla linea: 1355] [Num. linee: 24]
60) She came in through the bathroom window [inizia alla linea: 1383] [Num. linee: 24]
61) There is a place, [inizia alla linea: 1411] [Num. linee: 24]
62) Across the universe [inizia alla linea: 1439] [Num. linee: 25]
63) Baby's in black [inizia alla linea: 1468] [Num. linee: 25]
64) I'm looking through you [inizia alla linea: 1497] [Num. linee: 25]
65) If I fell [inizia alla linea: 1526] [Num. linee: 25]
66) Misery [inizia alla linea: 1555] [Num. linee: 25]
67) Ob-la-di, ob-la-da [inizia alla linea: 1584] [Num. linee: 25]
68) Only a northern song [inizia alla linea: 1613] [Num. linee: 25]
69) Something [inizia alla linea: 1642] [Num. linee: 25]
70) Tell me why [inizia alla linea: 1671] [Num. linee: 25]
71) This boy [inizia alla linea: 1700] [Num. linee: 25]
72) You've got to hide your love away [inizia alla linea: 1729] [Num. linee: 25]
73) Blue jay way [inizia alla linea: 1758] [Num. linee: 26]
74) Don't let me down [inizia alla linea: 1788] [Num. linee: 26]
75) Getting better [inizia alla linea: 1818] [Num. linee: 26]
76) Good morning, good morning [inizia alla linea: 1848] [Num. linee: 26]
77) I me mine [inizia alla linea: 1878] [Num. linee: 26]
78) Nowhere man [inizia alla linea: 1908] [Num. linee: 26]
79) One after 909 [inizia alla linea: 1938] [Num. linee: 26]
80) Your mother should know [inizia alla linea: 1968] [Num. linee: 56]
81) Chains [inizia alla linea: 2028] [Num. linee: 27]
82) Every little thing [inizia alla linea: 2059] [Num. linee: 27]
83) Fixing a hole [inizia alla linea: 2090] [Num. linee: 27]
84) Happiness is a warm gun [inizia alla linea: 2121] [Num. linee: 27]
85) I want to tell you [inizia alla linea: 2152] [Num. linee: 27]
86) If I needed someone [inizia alla linea: 2183] [Num. linee: 27]
87) Sgt. Pepper's Lonely Hearts Club Band [inizia alla linea: 2214] [Num. linee: 27]
88) Slow down [inizia alla linea: 2245] [Num. linee: 27]
89) Till there was you [inizia alla linea: 2276] [Num. linee: 27]
90) And I love her [inizia alla linea: 2307] [Num. linee: 28]
91) Eight days a week [inizia alla linea: 2339] [Num. linee: 28]
92) Here, there, and everywhere [inizia alla linea: 2371] [Num. linee: 28]
93) I feel fine [inizia alla linea: 2403] [Num. linee: 28]
94) Michelle [inizia alla linea: 2435] [Num. linee: 28]
95) She said, she said [inizia alla linea: 2467] [Num. linee: 28]
96) You can't do that [inizia alla linea: 2499] [Num. linee: 28]
97) You never give me your money You never give me your money [inizia alla linea: 2531] [Num. linee: 28]
98) A little help from my friends [inizia alla linea: 2563] [Num. linee: 29]
99) Act naturally [inizia alla linea: 2596] [Num. linee: 29]
100) All I've got to do [inizia alla linea: 2629] [Num. linee: 29]
101) Ask me why [inizia alla linea: 2662] [Num. linee: 29]
102) I don't want to spoil the party [inizia alla linea: 2695] [Num. linee: 29]
103) I'm down [inizia alla linea: 2728] [Num. linee: 29]
104) I've got a feeling [inizia alla linea: 2761] [Num. linee: 29]
105) Oh! Darling [inizia alla linea: 2794] [Num. linee: 29]
106) The night before [inizia alla linea: 2827] [Num. linee: 29]
107) Free as a bird [inizia alla linea: 2860] [Num. linee: 30]
108) Honey pie [inizia alla linea: 2894] [Num. linee: 30]
109) I wanna be your man [inizia alla linea: 2928] [Num. linee: 30]
110) Love me do [inizia alla linea: 2962] [Num. linee: 30]
111) Lucy in the Sky with Diamonds [inizia alla linea: 2996] [Num. linee: 30]
112) Please mister postman [inizia alla linea: 3030] [Num. linee: 30]
113) Savoy truffle [inizia alla linea: 3064] [Num. linee: 30]
114) The continuing story of Bungalow Bill [inizia alla linea: 3098] [Num. linee: 30]
115) Baby it's you [inizia alla linea: 3132] [Num. linee: 31]
116) Boys [inizia alla linea: 3167] [Num. linee: 31]
117) Don't bother me [inizia alla linea: 3202] [Num. linee: 31]
118) From me to you [inizia alla linea: 3237] [Num. linee: 31]
119) Hey Jude [inizia alla linea: 3272] [Num. linee: 31]
120) Octopus's garden [inizia alla linea: 3307] [Num. linee: 31]
121) Paperback writer [inizia alla linea: 3342] [Num. linee: 31]
122) She's leaving home [inizia alla linea: 3377] [Num. linee: 31]
123) Thank you girl [inizia alla linea: 3412] [Num. linee: 31]
124) Yes it is [inizia alla linea: 3447] [Num. linee: 31]
125) You're going to lose that girl [inizia alla linea: 3482] [Num. linee: 31]
126) Baby, you're a rich man [inizia alla linea: 3517] [Num. linee: 32]
127) Back in the U.S.S.R. [inizia alla linea: 3553] [Num. linee: 32]
128) Dig a pony [inizia alla linea: 3589] [Num. linee: 32]
129) Do you want to know a secret [inizia alla linea: 3625] [Num. linee: 32]
130) Don't pass me by [inizia alla linea: 3661] [Num. linee: 32]
131) Eleanor Rigby [inizia alla linea: 3697] [Num. linee: 32]
132) I saw her standing there [inizia alla linea: 3733] [Num. linee: 32]
133) I'll get you [inizia alla linea: 3769] [Num. linee: 32]
134) Sexy Sadie [inizia alla linea: 3805] [Num. linee: 32]
135) When I'm sixty-four [inizia alla linea: 3841] [Num. linee: 32]
136) Yer blues [inizia alla linea: 3877] [Num. linee: 32]
137) Anna (go to him) [inizia alla linea: 3913] [Num. linee: 33]
138) Help! [inizia alla linea: 3950] [Num. linee: 33]
139) I'm a loser [inizia alla linea: 3987] [Num. linee: 33]
140) No reply [inizia alla linea: 4024] [Num. linee: 33]
141) Rocky raccoon [inizia alla linea: 4061] [Num. linee: 33]
142) The word [inizia alla linea: 4098] [Num. linee: 33]
143) Twist and shout [inizia alla linea: 4135] [Num. linee: 33]
144) When I get home [inizia alla linea: 4172] [Num. linee: 33]
145) Dizzy Miss Lizzie [inizia alla linea: 4209] [Num. linee: 34]
146) For no one [inizia alla linea: 4247] [Num. linee: 34]
147) Girl [inizia alla linea: 4285] [Num. linee: 34]
148) Hello, goodbye [inizia alla linea: 4323] [Num. linee: 34]
149) Hold me tight [inizia alla linea: 4361] [Num. linee: 34]
150) It's all too much [inizia alla linea: 4399] [Num. linee: 34]
151) Long tall Sally [inizia alla linea: 4437] [Num. linee: 34]
152) Matchbox [inizia alla linea: 4475] [Num. linee: 34]
153) Things we said today [inizia alla linea: 4513] [Num. linee: 34]
154) Helter skelter [inizia alla linea: 4551] [Num. linee: 35]
155) I want to hold your hand [inizia alla linea: 4590] [Num. linee: 35]
156) Let it be [inizia alla linea: 4629] [Num. linee: 35]
157) You like me too much [inizia alla linea: 4668] [Num. linee: 35]
158) I'm only sleeping [inizia alla linea: 4707] [Num. linee: 36]
159) P.S. I love you [inizia alla linea: 4747] [Num. linee: 36]
160) A day in the life [inizia alla linea: 4787] [Num. linee: 37]
161) Got to get you into my life [inizia alla linea: 4828] [Num. linee: 37]
162) I'm just happy to dance with you [inizia alla linea: 4869] [Num. linee: 37]
163) You really got a hold on me [inizia alla linea: 4910] [Num. linee: 37]
164) Revolution [inizia alla linea: 4951] [Num. linee: 38]
165) Get back [inizia alla linea: 4993] [Num. linee: 39]
166) Penny Lane [inizia alla linea: 5036] [Num. linee: 39]
167) Think for yourself [inizia alla linea: 5079] [Num. linee: 39]
168) I am the Walrus [inizia alla linea: 5122] [Num. linee: 40]
169) Real love [inizia alla linea: 5166] [Num. linee: 40]
170) We can work it out [inizia alla linea: 5210] [Num. linee: 40]
171) Drive my car [inizia alla linea: 5254] [Num. linee: 41]
172) I've just seen a face [inizia alla linea: 5299] [Num. linee: 41]
173) Money (that's what I want) [inizia alla linea: 5344] [Num. linee: 41]
174) What goes on [inizia alla linea: 5389] [Num. linee: 41]
175) Devil in her heart [inizia alla linea: 5434] [Num. linee: 42]
176) All you need is love [inizia alla linea: 5480] [Num. linee: 43]
177) Maxwell's silver hammer [inizia alla linea: 5527] [Num. linee: 43]
178) Run for your life [inizia alla linea: 5574] [Num. linee: 43]
179) Yellow submarine [inizia alla linea: 5621] [Num. linee: 44]
180) She loves you [inizia alla linea: 5669] [Num. linee: 47]
181) You won't see me [inizia alla linea: 5720] [Num. linee: 47]
182) Two of us [inizia alla linea: 5771] [Num. linee: 48]
183) The ballad of John and Yoko [inizia alla linea: 5823] [Num. linee: 49]
184) You know my name (look up the number) [inizia alla linea: 5876] [Num. linee: 49]
185) Roll over Beethoven [inizia alla linea: 5929] [Num. linee: 50]
186) Wait [inizia alla linea: 5983] [Num. linee: 50]
187) Cry baby cry [inizia alla linea: 6037] [Num. linee: 51]
188) Ticket to ride [inizia alla linea: 6092] [Num. linee: 57]
189) Rock and roll music [inizia alla linea: 6153] 