{
  "restaurants": [
    {
      "id": 1,
      "name": "Restaurant 1",
      "address": "Address 1",
      "email": "email1@restaurant1.com"
    },
    {
      "id": 2,
      "name": "Restaurant 2",
      "address": "Address 2",
      "email": "email2@restaurant2.com"
    },
    {
      "id": 3,
      "name": "Restaurant 3",
      "address": "Address 3",
      "email": "email3@restaurant3.com"
    }
  ],
  "users": [
    {
      "name": "User 1",
      "email": "user1@example.org",
      "password": "test",
      "id": 1
    }
  ]
}