%!PS-Adobe-3.0 EPSF-3.0
%%Creator: cairo 1.10.2 (http://cairographics.org)
%%CreationDate: Mon May  7 01:19:50 2012
%%Pages: 1
%%BoundingBox: 0 -1 219 92
%%DocumentData: Clean7Bit
%%LanguageLevel: 2
%%EndComments
%%BeginProlog
/cairo_eps_state save def
/dict_count countdictstack def
/op_count count 1 sub def
userdict begin
/q { gsave } bind def
/Q { grestore } bind def
/cm { 6 array astore concat } bind def
/w { setlinewidth } bind def
/J { setlinecap } bind def
/j { setlinejoin } bind def
/M { setmiterlimit } bind def
/d { setdash } bind def
/m { moveto } bind def
/l { lineto } bind def
/c { curveto } bind def
/h { closepath } bind def
/re { exch dup neg 3 1 roll 5 3 roll moveto 0 rlineto
      0 exch rlineto 0 rlineto closepath } bind def
/S { stroke } bind def
/f { fill } bind def
/f* { eofill } bind def
/n { newpath } bind def
/W { clip } bind def
/W* { eoclip } bind def
/BT { } bind def
/ET { } bind def
/pdfmark where { pop globaldict /?pdfmark /exec load put }
    { globaldict begin /?pdfmark /pop load def /pdfmark
    /cleartomark load def end } ifelse
/BDC { mark 3 1 roll /BDC pdfmark } bind def
/EMC { mark /EMC pdfmark } bind def
/cairo_store_point { /cairo_point_y exch def /cairo_point_x exch def } def
/Tj { show currentpoint cairo_store_point } bind def
/TJ {
  {
    dup
    type /stringtype eq
    { show } { -0.001 mul 0 cairo_font_matrix dtransform rmoveto } ifelse
  } forall
  currentpoint cairo_store_point
} bind def
/cairo_selectfont { cairo_font_matrix aload pop pop pop 0 0 6 array astore
    cairo_font exch selectfont cairo_point_x cairo_point_y moveto } bind def
/Tf { pop /cairo_font exch def /cairo_font_matrix where
      { pop cairo_selectfont } if } bind def
/Td { matrix translate cairo_font_matrix matrix concatmatrix dup
      /cairo_font_matrix exch def dup 4 get exch 5 get cairo_store_point
      /cairo_font where { pop cairo_selectfont } if } bind def
/Tm { 2 copy 8 2 roll 6 array astore /cairo_font_matrix exch def
      cairo_store_point /cairo_font where { pop cairo_selectfont } if } bind def
/g { setgray } bind def
/rg { setrgbcolor } bind def
/d1 { setcachedevice } bind def
%%EndProlog
%%Page: 1 1
%%BeginPageSetup
%%PageBoundingBox: 0 -1 219 92
%%EndPageSetup
q 0 -1 219 93 rectclip q
0 91.2 218.371 -91.199 re W n
q
0 91.2 218 -91 re W n
[ 1 0 0 1 0 -0.800003 ] concat
  q
Q q
0.211765 0.152941 0.00392157 rg
130.871 60.965 m 126.086 60.965 122.52 58.613 122.52 52.957 c 122.52 
48.691 124.867 45.734 130.613 45.734 c 135.484 45.734 138.793 48.602 
138.793 53.133 c 138.793 58.266 135.832 60.965 130.871 60.965 c h
121.301 21.012 m 120.168 19.621 119.039 18.145 119.039 16.402 c 119.039 
12.922 123.473 11.875 129.566 11.875 c 134.617 11.875 141.492 12.23 
141.492 16.922 c 141.492 19.711 138.184 19.887 134.004 20.148 c h
147.059 60.703 m 148.625 58.699 150.281 55.914 150.281 51.91 c 150.281 
42.25 142.707 36.594 131.746 36.594 c 128.957 36.594 126.434 36.941 
124.867 37.375 c 121.996 32.766 l 130.523 32.242 l 145.582 31.285 
154.457 30.848 154.457 19.277 c 154.457 9.266 145.668 3.613 130.523 
3.613 c 114.773 3.613 108.766 7.617 108.766 14.492 c 108.766 18.41 
110.508 20.492 113.555 23.367 c 110.68 24.582 109.723 26.758 109.723 
29.109 c 109.723 31.023 110.68 32.766 112.25 34.418 c 113.816 36.07 
115.555 37.727 117.645 39.641 c 113.379 41.73 110.16 46.254 110.16 
52.695 c 110.16 62.703 116.773 69.578 130.086 69.578 c 133.832 69.578 
136.094 69.234 138.098 68.707 c 155.07 68.707 l 155.07 61.312 l 147.059 
60.703 l f
170.379 76.516 m 165.418 76.516 162.547 79.391 162.547 84.355 c 162.547 
89.309 165.418 92.012 170.379 92.012 c 175.426 92.012 178.301 89.309 
178.301 84.355 c 178.301 79.391 175.426 76.516 170.379 76.516 c h
159.152 24.215 m 159.152 31.086 l 163.59 31.695 l 164.809 31.871 
164.984 32.129 164.984 33.438 c 164.984 59.027 l 164.984 59.98 164.723 
60.594 163.848 60.852 c 159.152 62.508 l 160.109 69.555 l 178.125 
69.555 l 178.125 33.438 l 178.125 32.043 178.207 31.871 179.516 31.695 
c 183.957 31.086 l 183.957 24.215 l 159.152 24.215 l f
218.371 27.59 m 214.629 25.766 209.148 24.109 204.184 24.109 c 193.828 
24.109 189.914 28.285 189.914 38.121 c 189.914 60.922 l 189.914 61.445 
189.914 61.793 189.215 61.793 c 183.121 61.793 l 183.121 69.539 l 
190.785 70.41 193.828 74.242 194.785 83.727 c 203.055 83.727 l 203.055 
71.363 l 203.055 70.758 203.055 70.496 203.75 70.496 c 216.02 70.496 l 
216.02 61.793 l 203.055 61.793 l 203.055 40.996 l 203.055 35.859 
204.273 33.859 208.969 33.859 c 211.41 33.859 213.93 34.465 216.02 
35.25 c 218.371 27.59 l f
0.941176 0.235294 0.180392 rg
89.422 50.43 m 49.629 90.219 l 47.336 92.512 43.621 92.512 41.328 
90.219 c 33.066 81.957 l 43.547 71.473 l 45.984 72.297 48.777 71.746 
50.719 69.805 c 52.668 67.848 53.215 65.031 52.375 62.586 c 62.477 
52.484 l 64.918 53.328 67.738 52.785 69.691 50.828 c 72.418 48.102 
72.418 43.68 69.691 40.953 c 66.961 38.223 62.543 38.223 59.812 40.953 
c 57.762 43.004 57.254 46.02 58.293 48.547 c 48.871 57.969 l 48.871 
33.176 l 49.535 32.848 50.164 32.406 50.719 31.855 c 53.445 29.129 
53.445 24.711 50.719 21.977 c 47.988 19.25 43.566 19.25 40.84 21.977 c 
38.113 24.711 38.113 29.129 40.84 31.855 c 41.516 32.527 42.297 33.039 
43.129 33.379 c 43.129 58.402 l 42.297 58.742 41.516 59.25 40.84 59.926 
c 38.773 61.992 38.277 65.023 39.336 67.562 c 29.004 77.895 l 1.719 
50.613 l -0.574 48.32 -0.574 44.602 1.719 42.309 c 41.512 2.52 l 43.805 
0.227 47.52 0.227 49.812 2.52 c 89.422 42.125 l 91.711 44.418 91.711 
48.137 89.422 50.43 c f
  Q
Q
Q Q
showpage
%%Trailer
count op_count sub {pop} repeat
countdictstack dict_count sub {end} repeat
cairo_eps_state restore
%%EOF
