%!PS-Adobe-3.0 EPSF-3.0
%%Creator: GIMP PostScript file plugin V 1.17 by Peter Kirchgessner
%%Title: sigla.eps
%%CreationDate: Wed Jun 27 16:18:55 2012
%%DocumentData: Clean7Bit
%%LanguageLevel: 2
%%Pages: 1
%%BoundingBox: 14 14 57 60
%%EndComments
%%BeginProlog
% Use own dictionary to avoid conflicts
10 dict begin
%%EndProlog
%%Page: 1 1
% Translate for offset
14.173228346456694 14.173228346456694 translate
% Translate to begin of first scanline
0 44.994375703037122 translate
42.744656917885266 -44.994375703037122 scale
% Image geometry
57 60 8
% Transformation matrix
[ 57 0 0 60 0 0 ]
% Strings to hold RGB-samples per scanline
/rstr 57 string def
/gstr 57 string def
/bstr 57 string def
{currentfile /ASCII85Decode filter /RunLengthDecode filter rstr readstring pop}
{currentfile /ASCII85Decode filter /RunLengthDecode filter gstr readstring pop}
{currentfile /ASCII85Decode filter /RunLengthDecode filter bstr readstring pop}
true 3
%%BeginData:         4355 ASCII Bytes
colorimage
aT$b~>
aT$b~>
aT$b~>
o`"nOf)L7~>
o`"p!f)L7~>
o`"pRf)L7~>
pAY+ArZqOlf`-I~>
pAY,rriH1'f`-I~>
pAY-RrSuQ1J,~>
q#C.9!&!"*J,~>
q#C/l!3k2WJ,~>
q#C0M!9Dl6J,~>
qYpOJp*B\ih#Dm~>
qYpQ#p8n>!h#Dm~>
qYpQVp>Z/6h#Dm~>
qu6Xeo-FAlhZ&*~>
qu6Z)o;r"uhZ&*~>
qu6Z7oA]i4hZ&*~>
qu6`hh`13RhuA3~>
qu6`Wh6QXShuA3~>
qu6^J4OWi]huA3~>
qu?Ze!N%49,lfd\s*t~>
qu?ZT!7(2<!4(S`J,~>
qu?XG!H6uiirJ3"s*t~>
qu?Tc!."/^ir=N~>
qu?TR!5nE1ir=N~>
qu?RE!1<B<ir=N~>
qu?Qb!V'mq-05)V~>
qu?NP!5J--jSs`~>
qu?OD!A12?j5g5j~>
qu?K`!TZN;-0G5X~>
qu?KO!T(3TXlfY6~>
qu?IB!BJ?pj6$Al~>
qu?E^!T#m/-0YAZ~>
qu?EM!St'QXm#e8~>
qu?C@!C"m%j66Mn~>
qu??\!R!+f,lf=Xs*t~>
qu??K!SFUJXT5Nhs*t~>
qu?=>!D_D@j6HYp~>
qu?<[!V0ss,lfO_s*t~>
qu?9I!5A*-!3kehJ,~>
qu?:=!A(,?irJ0+s*t~>
qu?6Y!U)uE,lfC]s*t~>
qu?6H!T1<WXT5Nks*t~>
qu?4;!B%mhirJ0-s*t~>
qu?0W!TZE9,lf[gs*t~>
qu?0F!T(0TXT5Wps*t~>
qu?.9!BA?rirJ30s*t~>
qu?*U!UNhX-1V"c~>
qu?*D!T:N[XmuFA~>
qu?(7!AV+Uj73/"~>
qu?$S!-.TVo)F4~>
qu?$B!5\9/o)F4~>
qu?"5!2&lCo)F4~>
qu?Qb!q9*Wo^`+Q?1TB7s*t~>
qu?QQ!oRU[o\oo1]CW/ss*t~>
qu?OD!\@A=oIBqpZ1I#Js*t~>
qu?Qb"Ro>-)3+:[!Ua1`-2.@h~>
qu?QQ"Q3fL2j3gm!TCZ^XnMdF~>
qu?OD">!SbAOc;B!ALhNj7`M'~>
qu?Qb!UN/P)$*\*p%&4TH1N?Vs*t~>
qu?QQ!SpiV2Z[LIo\okgo<%ceJ,~>
qu?OD!A.LSAH>d^od^%oR.KA4s*t~>
qu?Qb!UW;Q)$*P$p%&4SDt>:Ns*t~>
qu?QQ!SplU2Z[@Do\okdo<%igJ,~>
qu?OD!A.LQAH>j`od^%oT_%4>s*t~>
qu?Na!,_QMoCE"E61cH'.Js-q~>
qu?NP!."E"oATf-[.LI#Y5A6L~>
qu?LC!)NH&o.'i#b4O]ojSSt-~>
qu?Na!,_QMnace82Y89q-iO'q~>
qu?NP!."E"n_sT(Z1P-uY5SBN~>
qu?LC!)NH&nLFW+eFV`!s*t~>
qu?Na!,_QMs8N,ko^q_Uj?N8_!%IpIJ,~>
qu?NP!."E"s8N,ZjRhF4hR)pW!3Z>$J,~>
qu?LC!)NH&s8N*M2tSU$36_$T!9F.ZJ,~>
qu?Na!,_QMrr<#jp%&4H7J%l.,THd`J,~>
qu?NP!."E"rr<#Zp#6#0[IgR'V+1LbJ,~>
qu?LC!)NH&rr<!Wod^&$`q89ng33MrJ,~>
qu?Na!,_QMr;ZK^!TH35,m5>.)?9_e~>
qu?NP!."E"r;ZfV!9<n7!T(0TXTX#22uio.~>
qu?LC!)NH&r;ZdI!&OF$!BSR!irlMsAcMd\~>
qu?Na!,_QMqYpTfo_e:]dk^PA!$M4Xs8RT~>
qu?NP!."E"qZ$TUr8Ib1Yk5$tIf25*s*t~>
qu?LC!)NH&qYpRN2>es*8D!Lo!3uK6s8RT~>
qu?Na!,_QMq#:Hfo^Q/W,lf"`)?9_e~>
qu?NP!."E"q#CBS!TCZ^XT3582uio.~>
qu?LC!)NH&q#:FL2(c-*irG_KAcMd\~>
qu?Na!,_QMp\t6co-FA]q&054J,~>
qu?NP!."E"p\t6Ro;r%Z48Lo9s*t~>
qu?LC!)NH&p\t4NoA]kpC&2E@s*t~>
qu?Na!,_QMq#:=AoHaM`)u(<Ns*t~>
qu?NP!."E"q#:>soW8.m9DCIGs*t~>
qu?LC!)NH&q#BsG!Sr(sAcMd\~>
qu?Na!,_QMqZ$.5!@/WX)?9_e~>
qu?NP!."E"qZ$/h!N8`d2uio.~>
qu?LC!)NH&qZ$0I!T&7uAcMd\~>
qu?Na!,_QMqu6XDoHaJ\oGR]/J,~>
qu?NP!."E"qu6Z!oW8.I3;#61s*t~>
qu?LC!)NH&qu?9J!Ol\6AcMd\~>
qu?Na!,_QMrVuI8!@/TT)?9_e~>
qu?NP!."E"rVuJk!MMmP2uio.~>
qu?LC!)NH&rVuKL!S2;_AcMd\~>
qu?Na!,_QMs8N'JoHaM_)Y=mM-lFB3s*t~>
qu?NP!."E"s8N)%oW8.c5P-l;6oRI4s*t~>
qu?LC!)NH&s8N)[o]#u$DY.KCDe3ecs*t~>
qu?Na!,_QM!%[[f!@&NT)$2-.+oVFk~>
qu?NP!."E"!3c$s!M;XL2Zc<055kM3~>
qu?LC!)NH&!9Ee4!Ru&[AHH^aC]49`~>
qu?Qb!U`JT)#t]L,lo81oGIZX,Q%Lk~>
qu?QQ!T%&X2Z[?gorS7n9_:7E6pUYLJ,~>
qu?OD!A%CNAH@tRp#?)/Hh:kMDf#=NJ,~>
qu?Qb!U`GS)#t]M,leqW)$1m#*W#ed~>
qu?QQ!T%#W2Z[EipT4Ir;=ldK4?GY$s*t~>
qu?OD!A%CNAHA%TpYu;4JFmCSBkV2Vs*t~>
qu?Qb!UW>Q)#t`P,leqW)$1a#+8Gkd~>
qu?QQ!SprV2ZRC`XT>J&oJZh35!8W?J,~>
qu?OD!A.IOAH8"jirS+noOS)9CMESDJ,~>
qu?Qb!V'1e)#tZP,lo80oGIZK+nkqd~>
qu?QQ!T@Yf2ZZaSqQ0dn7.`D=3Bm0:J,~>
qu?LC!*/o-!J')(irRhRoOS&8C\IdY~>
qu?Qb!V'1e)#tZR,lo81nehEHp&BO~>
qu?QQ!T@Yf2ZZdUr2g!s8Fe\>3VEE&~>
qu?LC!*/o-!J0/+irRnYnmqf5p&BO~>
qu?Qb!Ure[)#t]T,leqV)$(fsoDa=~>
qu?QQ!T.8]2Z[*_riH4$;=c^I4?)m3J,~>
qu?OD!A%=LAH@_Jro4%;Jb*FRBk?o9J,~>
qu?Qb!U;fE)#tcX,lf"X)?1ZGs*t~>
qu?QQ!S^NL2ZRjsXT2r(2ubo.s*t~>
qu?OD!A.RRAH8M)irGD:AcHB4s*t~>
qu?Qb!V0^s)$:g',T?4kn,In~>
qu?QQ!TA"p2ZlOFTgSB0n,In~>
qu?LC!)i]*"*N>KEq3f1s*t~>
qu?Qb!V0^s)?1WH)$(Zomf.e~>
qu?QQ!TA"p2uc&42ZYotmf.e~>
qu?LC!)i]*s(q:<!G5p2s*t~>
qu?Qb!V0^c)=7BR~>
qu?QQ!TA"`2sgQp~>
qu?LC!)i,om/MS~>
qu?Qb!UN,A)$1s!)=%6P~>
qu?QQ!SpfG2Zc0%2sUEn~>
qu?OD!A.LEAHHXYAa9;G~>
qu?Na!,1m?!?rlSs*t~>
qu?NP!-Rfj!Brj6s*t~>
qu?LC!)W2s!GcT:s*t~>
qu?Na!.",Q!?EBIs*t~>
qu?NP!.sc#!BWL.s*t~>
qu?LC!))lo!GH93s*t~>
qu?Qb!UreU)$1a()<LmK~>
qu?QQ!T.8W2Zc!+2s('i~>
qu?OD!A%=FAHHI]A``rB~>
qu?Qb!UiYT)$2-*,3/]R~>
qu?QQ!T.5X2Zc<-53)Zn~>
qu?OD!A%@IAHH^^CZGGF~>
qu?Qb!U`MS)$1fr)r^gI~>
qu?QQ!T%)W2Zc'"3T:!g~>
qu?OD!A%CLAHHOVBArl@~>
qu?Na!-n>Xs!$A#J,~>
qu?NP!.ju*!Bra*s*t~>
qu?LC!)36#s(gNlJ,~>
qu6Zgqssf)r##PV)&qH4J,~>
qu6ZWqr.U$r&4[=2`]apJ,~>
qu6XUq^VYBr+,qCAS9m"J,~>
qZ$Ha!,_TNh#Dm~>
qYpTUj8Is;H2BPUs*t~>
qYpRH1]8g(:]"_Ys*t~>
q#:?drpp8,)&XD3gAc[~>
q#:?Tro+'(2`E`UgAc[~>
q#:=Sr[S+JAS#LcgAc[~>
p\tHioCRbT)'%?0J,~>
p\tHYj5c1Y2`]RkJ,~>
p\tFV0K_m;AS9]rJ,~>
p&>*cL.'YnJ,~>
p&>*SNEk*8J,~>
p&>(R8:oInJ,~>
aT$b~>
aT$b~>
aT$b~>
aT$b~>
aT$b~>
aT$b~>
%%EndData
showpage
%%Trailer
end
%%EOF
