<svg xmlns:dc="http://purl.org/dc/elements/1.1/" xmlns:cc="http://creativecommons.org/ns#" xmlns:rdf="http://www.w3.org/1999/02/22-rdf-syntax-ns#" xmlns:svg="http://www.w3.org/2000/svg" xmlns="http://www.w3.org/2000/svg" id="svg893" height="106.22343" width="159.59895" version="1.1">
  <defs id="defs4">
    <marker style="overflow:visible" id="Arrow1Lend" refX="0" refY="0" orient="auto">
      <path transform="matrix(-0.8,0,0,-0.8,-10,0)" style="fill:#000000;fill-opacity:1;fill-rule:evenodd;stroke:#000000;stroke-width:1pt;stroke-opacity:1" d="M 0,0 5,-5 -12.5,0 5,5 Z" id="path2112"/>
    </marker>
    <marker style="overflow:visible" id="Arrow1Lstart" refX="0" refY="0" orient="auto">
      <path transform="matrix(0.8,0,0,0.8,10,0)" style="fill:#000000;fill-opacity:1;fill-rule:evenodd;stroke:#000000;stroke-width:1pt;stroke-opacity:1" d="M 0,0 5,-5 -12.5,0 5,5 Z" id="path2109"/>
    </marker>
  <svg:marker xmlns:ns0="http://www.inkscape.org/namespaces/inkscape" style="overflow:visible" id="Arrow1Lstart5815" refX="0" refY="0" orient="auto" ns0:stockid="Arrow1Lstart5815">
      <svg:path transform="matrix(0.8,0,0,0.8,10,0)" style="fill:#000000;fill-opacity:1.0;fill-rule:evenodd;stroke:#000000;stroke-width:1pt;stroke-opacity:1.0" d="M 0,0 5,-5 -12.5,0 5,5 Z" id="path2109-1"/>
    </svg:marker>
  <svg:marker xmlns:ns1="http://www.inkscape.org/namespaces/inkscape" style="overflow:visible" id="Arrow1Lend8555" refX="0" refY="0" orient="auto" ns1:stockid="Arrow1Lend8555">
      <svg:path transform="matrix(-0.8,0,0,-0.8,-10,0)" style="fill:#000000;fill-opacity:1.0;fill-rule:evenodd;stroke:#000000;stroke-width:1pt;stroke-opacity:1.0" d="M 0,0 5,-5 -12.5,0 5,5 Z" id="path2112-1"/>
    </svg:marker>
    </defs>
  <metadata id="metadata7">
    <rdf:RDF>
      <cc:Work rdf:about="">
        <dc:format>image/svg+xml</dc:format>
        <dc:type rdf:resource="http://purl.org/dc/dcmitype/StillImage"/>
        <dc:title/>
      </cc:Work>
    </rdf:RDF>
  </metadata>
  <path id="dimension" d="M 1.6186702,105.1461 157.98028,1.0773298" style="fill:none;fill-rule:evenodd;stroke:#000000;stroke-width:1.00157;stroke-linecap:butt;stroke-linejoin:miter;stroke-miterlimit:4;stroke-dasharray:none;stroke-opacity:1;marker-start:url(#Arrow1Lstart5815);marker-end:url(#Arrow1Lend8555)"/>
</svg>