<?xml version="1.0" encoding="UTF-8" standalone="no"?>
<svg width="160px" height="29px" viewBox="0 0 160 29" version="1.1" xmlns="http://www.w3.org/2000/svg" xmlns:xlink="http://www.w3.org/1999/xlink">
    <!-- Generator: Sketch 46.2 (44496) - http://www.bohemiancoding.com/sketch -->
    <title>Page 1</title>
    <desc>Created with Sketch.</desc>
    <defs>
        <polygon id="path-1" points="0 28.0871558 159.971859 28.0871558 159.971859 0.00032160804 0 0.00032160804"></polygon>
    </defs>
    <g id="Page-1" stroke="none" stroke-width="1" fill="none" fill-rule="evenodd">
        <g id="OUD-Landing_Final" transform="translate(-695.000000, -2007.000000)">
            <g id="Projects" transform="translate(0.000000, 1536.000000)">
                <g id="Logos" transform="translate(142.000000, 234.000000)">
                    <g id="Page-1" transform="translate(553.000000, 237.000000)">
                        <path d="M23.159799,10.5760804 C23.159799,9.69648241 23.0480402,8.92703518 22.8277387,8.28944724 C22.6098492,7.65748744 22.3019095,7.05849246 21.9143719,6.64763819 C21.5276382,6.23758794 21.0677387,5.93125628 20.5467337,5.73346734 C20.0201005,5.53487437 19.441206,5.43437186 18.8277387,5.43437186 C18.2239196,5.43437186 17.6506533,5.53487437 17.1240201,5.73427136 C16.6030151,5.93045226 16.1431156,6.23758794 15.7571859,6.64763819 C15.3696482,7.05849246 14.9668342,7.65668342 14.7489447,8.28944724 C14.5286432,8.92623116 14.4168844,9.69567839 14.4168844,10.5760804 C14.4168844,11.4564824 14.5286432,12.2259296 14.7489447,12.8627136 C14.9676382,13.4970854 15.3696482,14.0253266 15.7571859,14.4353769 C16.1439196,14.8454271 16.6046231,15.1525628 17.1240201,15.3479397 C18.1829146,15.7507538 19.5055276,15.7435176 20.5467337,15.3487437 C21.0669347,15.1525628 21.5268342,14.8446231 21.9143719,14.4353769 C22.3019095,14.0253266 22.6090452,13.4962814 22.8277387,12.8635176 C23.0480402,12.2251256 23.159799,11.4556784 23.159799,10.5760804 Z M24.6158794,8.04422111 C24.919799,8.7839196 25.0741709,9.63537688 25.0741709,10.5760804 C25.0741709,11.5175879 24.919799,12.3698492 24.6158794,13.1079397 C24.3111558,13.8500503 23.8769849,14.4868342 23.3270352,14.999799 C22.7778894,15.5127638 22.1113568,15.9011055 21.3443216,16.1519598 C20.5853266,16.401206 19.7378894,16.5266332 18.8277387,16.5266332 C17.9272362,16.5266332 17.0862312,16.401206 16.3264322,16.1519598 C15.559397,15.9003015 14.8920603,15.5127638 14.3437186,14.999799 C13.7937688,14.4868342 13.360402,13.8500503 13.0548744,13.1071357 C12.7509548,12.3698492 12.5965829,11.5175879 12.5965829,10.5760804 C12.5965829,9.63537688 12.7509548,8.7839196 13.0548744,8.04422111 C13.360402,7.30291457 13.7937688,6.66693467 14.3437186,6.15316583 C14.8936683,5.63939698 15.560201,5.2438191 16.3240201,4.97688442 C17.0838191,4.71155779 17.9264322,4.57648241 18.8277387,4.57648241 C19.7394975,4.57648241 20.5869347,4.71155779 21.3475377,4.97688442 C22.1105528,5.2438191 22.7770854,5.63939698 23.3270352,6.15316583 C23.8769849,6.66693467 24.3103518,7.30291457 24.6158794,8.04422111 Z" id="Fill-1" fill="#447EC0"></path>
                        <path d="M37.8056683,9.84040201 C37.7863719,9.28241206 37.7453668,8.76140704 37.6834573,8.27658291 C38.0348141,8.33366834 38.3170251,8.36100503 38.5308945,8.36100503 C38.7447638,8.36100503 39.0269749,8.33366834 39.3791357,8.27658291 C39.3164221,8.76140704 39.2754171,9.28241206 39.2569246,9.84040201 C39.2376281,10.398392 39.2279799,10.9306533 39.2279799,11.4379899 L39.2279799,13.1963819 C39.2279799,13.7037186 39.2376281,14.2359799 39.2569246,14.7939698 C39.2754171,15.3519598 39.3164221,15.8568844 39.3791357,16.3071357 C39.0896884,16.2846231 38.8074774,16.2733668 38.5308945,16.2733668 C38.2543116,16.2733668 37.9721005,16.2846231 37.6834573,16.3071357 C37.7453668,15.8568844 37.7863719,15.3519598 37.8056683,14.7939698 C37.8241608,14.2359799 37.833809,13.7037186 37.833809,13.1963819 L37.833809,11.4379899 C37.833809,10.9306533 37.8241608,10.398392 37.8056683,9.84040201 M37.8402412,4.92462312 C38.0267739,4.73889447 38.2494874,4.64562814 38.510794,4.64562814 C38.7712965,4.64562814 38.9948141,4.73889447 39.1813467,4.92462312 C39.3670754,5.11115578 39.4603417,5.33467337 39.4603417,5.5959799 C39.4603417,5.85567839 39.3670754,6.07919598 39.1813467,6.26572864 C38.9948141,6.45226131 38.7712965,6.54472362 38.510794,6.54472362 C38.2494874,6.54472362 38.0267739,6.45226131 37.8402412,6.26572864 C37.6537085,6.07919598 37.5604422,5.85567839 37.5604422,5.5959799 C37.5604422,5.33467337 37.6537085,5.11115578 37.8402412,4.92462312" id="Fill-3" fill="#447EC0"></path>
                        <path d="M60.1475377,9.77921608 C59.8219095,9.34745729 59.3732663,9.13117588 58.800804,9.13117588 C58.0152764,9.13117588 57.7338693,9.37318593 57.3696482,9.85479397 C57.0046231,10.337206 56.8221106,11.016603 56.8221106,11.8921809 L56.8221106,13.3225327 C56.8221106,13.8274573 56.8309548,14.3581106 56.8478392,14.9136884 C56.8647236,15.4692663 56.9009045,15.8302714 56.9571859,16.2781106 C56.6990955,16.256402 56.2938693,16.2451457 56.0478392,16.2451457 C55.800201,16.2451457 55.5477387,16.256402 55.2904523,16.2781106 C55.3459296,15.8302714 55.3821106,15.3277588 55.398995,14.7721809 C55.4166834,14.216603 55.4239196,13.6867538 55.4239196,13.1818291 L55.4239196,11.4306734 C55.4239196,10.9257487 55.4166834,10.3950955 55.398995,9.83951759 C55.3821106,9.2839397 55.3459296,8.76534673 55.2904523,8.28293467 C55.6040201,8.33921608 55.8564824,8.36655276 56.0478392,8.36655276 C56.1491457,8.36655276 56.2319598,8.35851256 56.3421106,8.34162814 C56.4490452,8.32474372 56.7553769,8.30866332 56.9017085,8.28615075 C56.8671357,8.73479397 56.8510553,9.08132663 56.8510553,9.52996985 L56.8840201,9.52996985 C57.199196,9.04755779 57.3961809,8.77419095 57.8351759,8.51047236 C58.2741709,8.24675377 58.7975879,8.11409045 59.4054271,8.11409045 C59.720603,8.11409045 60.038995,8.1599196 60.359799,8.24916583 C60.680603,8.33921608 60.9700503,8.49278392 61.2289447,8.71228141 C61.4886432,8.93097487 61.6992965,9.22846231 61.8625126,9.60474372 C62.0257286,9.98022111 62.1077387,10.4594171 62.1077387,11.0439397 C62.1077387,11.5263518 62.0956784,12.0224322 62.0731658,12.5329849 C62.0514573,13.0443417 62.040201,13.5854472 62.040201,14.1579095 L62.040201,15.2521809 C62.040201,15.4314774 62.0426131,15.6083618 62.0482412,15.7820302 C62.0538693,15.9565025 62.0627136,16.1213266 62.0731658,16.2781106 C61.8464322,16.256402 61.6076382,16.2451457 61.358392,16.2451457 C61.119598,16.2451457 60.6725628,16.2379095 60.4458291,16.2604221 C60.4683417,15.6767035 60.5648241,15.2361005 60.5929648,14.6186131 C60.6219095,14.0019296 60.6355779,13.3675578 60.6355779,12.7163015 L60.6355779,11.6903719 C60.6355779,10.8485628 60.4731658,10.2109749 60.1475377,9.77921608" id="Fill-5" fill="#447EC0"></path>
                        <path d="M70.319196,15.574995 C70.2106533,15.6063518 70.0860302,15.6328844 69.9485427,15.6521809 C69.8086432,15.6722814 69.6960804,15.6827337 69.6132663,15.6827337 C69.318191,15.6827337 69.0938693,15.6232362 68.9459296,15.5050452 C68.7915578,15.3828342 68.6741709,15.217206 68.5961809,15.0121809 C68.5133668,14.7950955 68.4635176,14.5450452 68.4482412,14.2692663 C68.4313568,13.9782111 68.4225126,13.6831357 68.4225126,13.3816281 C68.4225126,13.0230352 68.4257286,12.616201 68.4313568,12.1603216 C68.4361809,11.7036382 68.4450251,11.2678593 68.4562814,10.8489648 C68.4675377,10.4324824 68.481206,10.0722814 68.4972864,9.76836181 C68.5077387,9.58826131 68.5157789,9.47328643 68.521407,9.4001206 L69.1959799,9.4001206 C69.3712563,9.4001206 69.5368844,9.40253266 69.6912563,9.40896482 C69.7925628,9.41137688 69.8464322,9.41700503 69.9131658,9.42263317 L70.2830151,9.47489447 L70.2026131,9.24172864 C70.2026131,9.22886432 70.2050251,9.21278392 70.2066332,9.19429146 C70.2098492,9.15971859 70.2138693,9.12112563 70.2138693,9.08253266 L70.2138693,8.7400201 C70.2138693,8.68936683 70.2090452,8.65318593 70.1977889,8.63710553 L70.2741709,8.41037186 L70.0353769,8.42323618 C69.6478392,8.44494472 69.3913568,8.45861307 69.0592965,8.46424121 C68.8462312,8.46826131 68.6757789,8.47067337 68.5487437,8.47147739 C68.5672362,8.12574874 68.5833166,7.78323618 68.598593,7.44233166 C68.6146734,7.04675377 68.639598,6.64474372 68.6725628,6.23308543 L68.6870352,6.05780905 L68.4273367,6.05780905 L66.8723618,6.68494472 L66.879598,6.80072362 C66.9021106,7.14645226 66.9157789,7.48092462 66.921407,7.80494472 C66.9254271,8.05177889 66.9310553,8.2680603 66.9390955,8.45378894 C66.7429146,8.44735678 66.4976884,8.43127638 66.119799,8.40715578 L65.9091457,8.39348744 L65.9509548,8.6001206 C65.960603,8.65077387 65.9686432,8.6998191 65.9734673,8.7480603 C65.9782915,8.79790955 65.9807035,8.84615075 65.9807035,8.89519598 C65.9807035,8.95549749 65.9782915,9.01338693 65.9734673,9.0680603 C65.9678392,9.12434171 65.959799,9.18223116 65.9493467,9.24333668 L65.9139698,9.45238191 L66.1254271,9.43228141 C66.2339698,9.42102513 66.3368844,9.41298492 66.4365829,9.40896482 L66.5089447,9.40333668 C66.5403015,9.40172864 66.5539698,9.4001206 66.6078392,9.4001206 L66.9801005,9.4001206 C66.9784925,9.94444221 66.9728643,10.4413266 66.9632161,10.8899698 C66.9519598,11.3844422 66.9382915,11.8338894 66.921407,12.2415276 C66.9045226,12.6491658 66.8908543,13.0254472 66.879598,13.3679598 C66.8683417,13.7128844 66.8627136,14.0320804 66.8627136,14.3279598 C66.8627136,15.0218291 67.0476382,15.5597186 67.4110553,15.9271558 C67.7752764,16.2937889 68.3364824,16.4803216 69.079397,16.4803216 C69.3029146,16.4803216 69.5360804,16.4537889 69.7724623,16.4031357 C69.9975879,16.3548945 70.2042211,16.3146935 70.3923618,16.2817286 L70.5266332,16.2584121 L70.5266332,15.5146935 L70.319196,15.574995 Z" id="Fill-7" fill="#447EC0"></path>
                        <path d="M78.214593,12.3488643 L78.1575075,14.5116784 C77.9886633,14.777809 77.7490653,15.015799 77.4451457,15.2192161 C77.1307739,15.4306734 76.7930854,15.5327839 76.4127839,15.5327839 C76.095196,15.5327839 75.7510754,15.4194171 75.4897688,15.1854472 C75.2324824,14.9554975 75.1078593,14.617809 75.1078593,14.1538894 C75.1078593,13.8829347 75.1577085,13.6586131 75.255799,13.4889648 C75.3554975,13.3169045 75.4913769,13.1705729 75.6594171,13.0539899 C75.8330854,12.934995 76.0356985,12.8385126 76.2608241,12.7677588 C76.5068543,12.6913769 76.8107739,12.6302714 77.0415276,12.5852462 C77.2883618,12.537809 77.5319799,12.4911759 77.7739899,12.4477588 C77.9307739,12.4196181 78.0787136,12.3866533 78.214593,12.3488643 L78.214593,12.3488643 Z M80.457005,15.4756985 C80.4224322,15.495799 80.3910754,15.5062513 80.3565025,15.5094673 C80.1723819,15.5247437 80.014794,15.5118794 79.9456482,15.4475578 C79.8837387,15.3896683 79.8338894,15.3140905 79.8001206,15.2248442 C79.7639397,15.1275578 79.7430352,15.014191 79.7382111,14.8863518 C79.7317789,14.7416281 79.7293668,14.6073568 79.7293668,14.4787136 C79.7293668,13.814593 79.7398191,13.1641407 79.7623317,12.5458492 C79.7832362,11.9476583 79.7936884,11.3261508 79.7936884,10.6982111 C79.7936884,10.3211256 79.7229347,9.96896482 79.5838392,9.64976884 C79.4431357,9.33298492 79.2477588,9.05881407 79.0025327,8.83529648 C78.7565025,8.60856281 78.457407,8.43409045 78.1132864,8.31429146 C77.3985126,8.06424121 76.4899698,8.08032161 75.6730854,8.33680402 C75.2485628,8.47027136 74.7790151,8.72996985 74.2773065,9.10866332 L74.2129849,9.15770854 L74.2129849,10.2431357 L74.6519799,10.2431357 L74.697005,10.1571055 C74.8666533,9.83871357 75.1175075,9.4519799 75.4640402,9.27027136 C75.8129849,9.08936683 76.1948945,8.99690452 76.5977085,8.99690452 C76.894392,8.99690452 77.1492663,9.04836181 77.3526834,9.14966834 C77.5577085,9.25258291 77.7241407,9.38685427 77.8479598,9.54926633 C77.976603,9.71891457 78.0690653,9.91268342 78.1285628,10.1410251 C78.1896683,10.375799 78.2202211,10.7681608 78.2202211,11.0230352 C78.2202211,11.1685628 78.2065528,11.2851457 78.1792161,11.3711759 C78.1615276,11.4282613 78.0923819,11.4877588 77.9814271,11.5416281 C77.8342915,11.6123819 77.6019296,11.6815276 77.2891658,11.7482613 C76.9675578,11.817407 76.5229347,11.8994171 75.9303719,11.9991156 C75.1906734,12.1229347 74.6005226,12.375397 74.176804,12.7508744 C73.737809,13.1384121 73.5150955,13.6875578 73.5150955,14.3806231 C73.5150955,14.7191156 73.5834372,15.0254472 73.7185126,15.2907739 C73.8519799,15.5528844 74.0280603,15.7788141 74.2419296,15.9637387 C74.457407,16.1510754 74.7082613,16.2877588 74.9904724,16.3713769 C75.2638392,16.4501709 75.5460503,16.4903719 75.8282613,16.4903719 C76.4007236,16.4903719 76.8927839,16.3922814 77.2891658,16.1985126 C77.6131859,16.0409246 77.9428342,15.8093668 78.2716784,15.5086633 C78.336,15.6984121 78.4405226,15.8632362 78.5836382,15.9991156 C78.8007236,16.2065528 79.1094673,16.3126834 79.5026332,16.3126834 C79.7277588,16.3126834 79.936,16.294995 80.1233367,16.2604221 C80.3163015,16.2266533 80.4746935,16.1800201 80.6081608,16.1197186 L80.7030352,16.0754975 L80.7030352,15.3261508 L80.457005,15.4756985 Z" id="Fill-9" fill="#447EC0"></path>
                        <path d="M85.2448643,7.36611055 C85.2400402,6.92631156 85.231196,6.49133668 85.2207437,6.06279397 C85.2094874,5.63344724 85.1958191,5.22339698 85.1789347,4.83344724 C85.1620503,4.44269347 85.1427538,4.10982915 85.1210452,3.83405025 C85.4289849,3.88952764 85.6766231,3.91686432 85.8639598,3.91686432 C86.0504925,3.91686432 86.5562211,3.88952764 86.8641608,3.83405025 C86.8424523,4.10982915 86.8231558,4.44269347 86.8070754,4.83344724 C86.790191,5.22339698 86.7765226,5.63344724 86.7660704,6.06279397 C86.7548141,6.49133668 86.7467739,6.92631156 86.7403417,7.36611055 C86.7355176,7.80671357 86.7331055,8.21354774 86.7331055,8.58822111 L86.7331055,11.5751558 C86.7331055,11.9490251 86.7355176,12.3558593 86.7403417,12.7964623 C86.7467739,13.2362613 86.7548141,13.6704322 86.7660704,14.0997789 C86.7765226,14.5291256 86.790191,14.9359598 86.8070754,15.3210854 C86.8231558,15.7070151 86.8424523,16.0262111 86.8641608,16.2786734 C86.6116985,16.2569648 86.1059698,16.2457085 85.8639598,16.2457085 C85.6219497,16.2457085 85.3743116,16.2569648 85.1210452,16.2786734 C85.1427538,16.0262111 85.1620503,15.7070151 85.1789347,15.3210854 C85.1958191,14.9359598 85.2094874,14.5291256 85.2207437,14.0997789 C85.231196,13.6704322 85.2400402,13.2362613 85.2448643,12.7964623 C85.2504925,12.3558593 85.2529045,11.9490251 85.2529045,11.5751558 L85.2529045,8.58822111 C85.2529045,8.21354774 85.2504925,7.80671357 85.2448643,7.36611055" id="Fill-11" fill="#447EC0"></path>
                        <path d="M101.669628,6.74026131 C102.054754,6.33423116 102.513045,6.02950754 103.031638,5.83493467 C103.555859,5.63794975 104.132342,5.53825126 104.745005,5.53825126 C105.112442,5.53825126 105.455759,5.58729648 105.763698,5.68458291 C106.075658,5.78347739 106.358673,5.90649246 106.603899,6.04960804 C106.853146,6.19433166 107.073447,6.34709548 107.260784,6.50307538 C107.444101,6.65503518 107.589628,6.79573869 107.692543,6.91875377 L107.763296,7.0039799 L108.056764,6.90669347 L108.074452,6.81262312 C108.105809,6.64136683 108.148422,6.42669347 108.203095,6.16940704 C108.252945,5.92739698 108.31807,5.73684422 108.394452,5.60176884 L108.482894,5.44739698 L108.321286,5.37342714 C107.859779,5.16518593 107.325106,4.98508543 106.733347,4.83875377 C106.135156,4.69081407 105.466211,4.61523618 104.745005,4.61523618 C103.83807,4.61523618 102.993045,4.74870352 102.23405,5.01242211 C101.473447,5.27694472 100.810131,5.66930653 100.260985,6.17905528 C99.7126432,6.68960804 99.2800804,7.32076382 98.9761608,8.05483417 C98.6738492,8.78970854 98.5194774,9.63392965 98.5194774,10.5657889 C98.5194774,11.4984523 98.6738492,12.3426734 98.9761608,13.0775477 C99.2800804,13.8116181 99.7070151,14.4427739 100.244101,14.9517186 C100.780382,15.4606633 101.428422,15.846593 102.171337,16.0958392 C102.906211,16.3426734 103.718271,16.4681005 104.583397,16.4681005 C104.991035,16.4681005 105.386613,16.4343317 105.759678,16.367598 C106.125508,16.3040804 106.464804,16.2301106 106.768724,16.1472965 C107.075859,16.0628744 107.341186,15.967196 107.556663,15.8618693 C107.776161,15.7549347 107.943397,15.6520201 108.054352,15.5555377 L108.098573,15.5161407 L108.265005,14.4218693 L108.039879,14.1967437 L107.926513,14.286794 C107.777769,14.4041809 107.593648,14.5392563 107.376563,14.6936281 C107.161889,14.8447839 106.918271,14.9870955 106.653749,15.1173467 C106.388422,15.247598 106.092543,15.3617688 105.774955,15.4542312 C105.461387,15.5474975 105.114854,15.5941307 104.745005,15.5941307 C104.132342,15.5941307 103.555859,15.4936281 103.031638,15.2966432 C102.513045,15.1020704 102.054754,14.7973467 101.669628,14.3913166 C101.282894,13.9836784 100.976563,13.4594573 100.760281,12.8331256 C100.540784,12.2027739 100.429025,11.4397588 100.429025,10.5657889 C100.429025,9.69262312 100.540784,8.92960804 100.760281,8.29845226 C100.976563,7.67292462 101.28209,7.14870352 101.669628,6.74026131" id="Fill-13" fill="#447EC0"></path>
                        <path d="M116.004583,8.92566834 C116.448402,8.92566834 116.823879,9.01652261 117.121367,9.19501508 C117.421266,9.37431156 117.664884,9.62034171 117.844181,9.92506533 C118.029106,10.2386332 118.161769,10.6004422 118.238955,11.0008442 C118.317749,11.4108945 118.357146,11.8434573 118.357146,12.2848643 C118.357146,12.7262714 118.317749,13.1588342 118.238955,13.5680804 C118.161769,13.9692864 118.029106,14.3310955 117.844181,14.6438593 C117.664884,14.9485829 117.421266,15.1946131 117.121367,15.3739095 C116.823879,15.553206 116.448402,15.6432563 116.004583,15.6432563 C115.560764,15.6432563 115.184482,15.553206 114.886995,15.3739095 C114.587899,15.1946131 114.344281,14.9493869 114.164985,14.6438593 C113.980864,14.3327035 113.848201,13.9708945 113.770211,13.5680804 C113.691417,13.1588342 113.65202,12.7262714 113.65202,12.2848643 C113.65202,11.8434573 113.691417,11.4108945 113.770211,11.0008442 C113.847397,10.5988342 113.980864,10.2370251 114.164985,9.92506533 C114.344281,9.61953769 114.587899,9.37431156 114.886995,9.19501508 C115.184482,9.01652261 115.560764,8.92566834 116.004583,8.92566834 M119.745688,10.3431558 C119.504482,9.81009045 119.18207,9.37029146 118.786492,9.03742714 C118.392523,8.70536683 117.947899,8.4601407 117.464683,8.30898492 C116.518352,8.01069347 115.530211,8.00506533 114.552523,8.3081809 C114.062874,8.4601407 113.615839,8.70536683 113.222673,9.03742714 C112.827095,9.37029146 112.503879,9.81009045 112.262673,10.3431558 C112.021467,10.8762211 111.899256,11.5290854 111.899256,12.2848643 C111.899256,13.0406432 112.021467,13.6935075 112.262673,14.2257688 C112.503879,14.7596382 112.827095,15.1994372 113.222673,15.5323015 C113.617447,15.8643618 114.06609,16.1023518 114.557347,16.2382312 C115.038955,16.3708945 115.526995,16.4384322 116.004583,16.4384322 C116.494231,16.4384322 116.983075,16.3708945 117.459859,16.2382312 C117.944683,16.1023518 118.390915,15.8651658 118.786492,15.5323015 C119.18207,15.1986332 119.504482,14.7588342 119.745688,14.2257688 C119.987698,13.6927035 120.10991,13.0398392 120.10991,12.2848643 C120.10991,11.5298894 119.987698,10.8770251 119.745688,10.3431558" id="Fill-15" fill="#447EC0"></path>
                        <path d="M128.423638,12.3387337 L128.364945,14.5272764 C128.194492,14.7982312 127.951678,15.0386332 127.645347,15.2436583 C127.326151,15.4567236 126.985246,15.5612462 126.600925,15.5612462 C126.279317,15.5612462 125.993889,15.4454673 125.730171,15.2082814 C125.469668,14.9759196 125.342633,14.6342111 125.342633,14.1654673 C125.342633,13.8904925 125.393286,13.6637588 125.492181,13.4925025 C125.594291,13.3164221 125.731779,13.1692864 125.901427,13.0527035 C126.077508,12.9304925 126.281729,12.833206 126.51007,12.7624523 C126.751276,12.6876784 126.995698,12.6249648 127.236101,12.5775276 C127.485347,12.5292864 127.730573,12.4826533 127.975799,12.4392362 C128.134995,12.4110955 128.284543,12.3773266 128.423638,12.3387337 L128.423638,12.3387337 Z M130.691779,15.5017487 C130.655598,15.5226533 130.621829,15.5339095 130.585648,15.5371256 C130.530171,15.5419497 130.478714,15.5443618 130.42806,15.5443618 C130.345246,15.5443618 130.233487,15.5323015 130.16997,15.473608 C130.107256,15.4149146 130.057407,15.3393367 130.022834,15.2476784 C129.985045,15.1487839 129.964141,15.0346131 129.960121,14.9059698 C129.954492,14.7596382 129.95208,14.6229548 129.95208,14.4935075 C129.95208,13.8100905 129.962533,13.151598 129.984241,12.5397387 C130.00595,11.910191 130.017206,11.2822513 130.017206,10.672 C130.017206,10.2900905 129.945648,9.93471357 129.803337,9.61471357 C129.662633,9.29471357 129.464844,9.01652261 129.216402,8.78898492 C128.968764,8.56144724 128.666452,8.38536683 128.318312,8.2639598 C127.593085,8.01069347 126.673286,8.02838191 125.853186,8.28647236 C125.423035,8.42235176 124.948663,8.68446231 124.442935,9.06717588 L124.378613,9.11541709 L124.378613,10.2112965 L124.819216,10.2112965 L124.865045,10.1244623 C125.035497,9.80526633 125.296,9.552 125.640925,9.37270352 C125.993889,9.18858291 126.379819,9.09531658 126.787457,9.09531658 C127.088161,9.09531658 127.345447,9.14757789 127.55208,9.25049246 C127.757106,9.35340704 127.92595,9.49009045 128.052985,9.65491457 C128.181628,9.82375879 128.277307,10.0255678 128.336804,10.2531055 C128.39791,10.4902915 128.429266,10.7411457 128.429266,11.0000402 C128.429266,11.1479799 128.415598,11.2669749 128.388261,11.353005 C128.369769,11.4108945 128.299819,11.471196 128.186452,11.5258693 C128.039317,11.5974271 127.804543,11.6673769 127.486955,11.7357186 C127.15409,11.8064724 126.691779,11.8908945 126.113688,11.9881809 C125.367558,12.112804 124.771779,12.3684824 124.341628,12.7471759 C123.897809,13.1395377 123.673487,13.6935075 123.673487,14.3946131 C123.673487,14.7355176 123.742633,15.0450653 123.879317,15.313608 C124.013588,15.5765226 124.191276,15.8056683 124.407558,15.993005 C124.625447,16.1819497 124.879518,16.3202412 125.163337,16.4038593 C125.43992,16.4842613 125.724543,16.5252663 126.009166,16.5252663 C126.586452,16.5252663 127.084141,16.4255678 127.486151,16.2293869 C127.814191,16.070191 128.147055,15.8354171 128.480724,15.5314975 C128.545045,15.7236583 128.651176,15.8908945 128.796704,16.0291859 C129.014593,16.2382312 129.326553,16.3451658 129.723739,16.3451658 C129.950472,16.3451658 130.16193,16.3274774 130.35007,16.2929045 C130.545447,16.2583317 130.706251,16.2116985 130.841327,16.1497889 L130.935397,16.1063719 L130.935397,15.3586332 L130.691779,15.5017487 Z" id="Fill-17" fill="#447EC0"></path>
                        <path d="M139.425367,12.6385528 C139.223558,12.3603618 138.966271,12.1392563 138.663156,11.9816683 C138.372905,11.8305126 138.049688,11.7115176 137.702352,11.6270955 C137.374312,11.5474975 137.069588,11.4542312 136.797025,11.3497085 C136.538131,11.2508141 136.320241,11.1133266 136.148181,10.9396583 C135.988985,10.7812663 135.911799,10.5561407 135.911799,10.2514171 C135.911799,10.0399598 135.949588,9.85664322 136.024362,9.70709548 C136.09994,9.5559397 136.195618,9.43051256 136.307377,9.33724623 C136.420744,9.24317588 136.550191,9.17161809 136.693307,9.12337688 C136.83803,9.07513568 136.985166,9.05021106 137.128281,9.05021106 C137.459538,9.05021106 137.72808,9.13945729 137.94999,9.32196985 C138.173508,9.50689447 138.325467,9.71754774 138.402653,9.94588945 L138.439638,10.0568442 L138.888281,10.0568442 L138.911598,9.92176884 C138.930894,9.80196985 138.977528,9.62347739 139.051497,9.39111558 C139.123859,9.16357789 139.201849,8.97141709 139.283055,8.81945729 L139.373106,8.65141709 L139.193005,8.58870352 C138.946171,8.50347739 138.686472,8.40619095 138.412302,8.29845226 C138.11803,8.18428141 137.756221,8.12558794 137.339739,8.12558794 C136.891095,8.12558794 136.483457,8.19232161 136.130492,8.32257286 C135.776724,8.45443216 135.473608,8.63774874 135.231598,8.86850251 C134.98798,9.10086432 134.800643,9.37905528 134.673608,9.69664322 C134.547377,10.0118191 134.483859,10.3623719 134.483859,10.7386533 C134.483859,11.2266935 134.589186,11.6190553 134.798231,11.9044824 C135.000844,12.1818693 135.255719,12.407799 135.556422,12.5750352 C135.848281,12.7390553 136.172302,12.8668945 136.519638,12.9561407 C136.85009,13.0413668 137.15401,13.1402613 137.424161,13.249608 C137.686271,13.3557387 137.905769,13.4916181 138.079437,13.6548342 C138.237025,13.8035779 138.313407,14.0166432 138.313407,14.3076985 C138.313407,14.5199598 138.27401,14.7097085 138.198432,14.8713166 C138.121246,15.0345327 138.022352,15.1647839 137.893709,15.2693065 C137.763457,15.3754372 137.611497,15.4590553 137.441045,15.5169447 C137.081648,15.6415678 136.663558,15.6327236 136.317829,15.5032764 C136.132101,15.4325226 135.96406,15.3432764 135.820141,15.2395578 C135.674613,15.1342312 135.546774,15.0184523 135.441447,14.8994573 C135.336925,14.7804623 135.260543,14.6719196 135.213106,14.5762412 L135.168884,14.486191 L134.710593,14.486191 L134.710593,14.648603 C134.710593,14.7957387 134.677628,14.9846834 134.611698,15.2122211 C134.543357,15.446191 134.478231,15.6327236 134.41793,15.7653869 L134.355216,15.9004623 L134.483859,15.9736281 C134.720241,16.1087035 135.016121,16.2285025 135.363457,16.329809 C135.712402,16.4303116 136.148181,16.4817688 136.657126,16.4817688 C137.129085,16.4817688 137.557628,16.4102111 137.931497,16.2687035 C138.306975,16.127196 138.634211,15.9245829 138.903558,15.6664925 C139.172101,15.409206 139.380342,15.1157387 139.523457,14.7957387 C139.667377,14.4749347 139.740543,14.1412663 139.740543,13.8043819 C139.740543,13.3163417 139.634412,12.9247839 139.425367,12.6385528" id="Fill-19" fill="#447EC0"></path>
                        <path d="M147.327116,15.5224121 C147.225005,15.5529648 147.104402,15.5778894 146.968523,15.598794 C146.831839,15.6180905 146.724101,15.6285427 146.642894,15.6285427 C146.358271,15.6285427 146.141186,15.5698492 145.998874,15.4540704 C145.849327,15.3326633 145.735156,15.1678392 145.659578,14.9636181 C145.579176,14.7473367 145.530131,14.4988945 145.515658,14.2247236 C145.499578,13.9344724 145.490734,13.641005 145.490734,13.3411055 C145.490734,12.9849246 145.493146,12.5796985 145.499578,12.1254271 C145.504402,11.6719598 145.512442,11.2377889 145.522894,10.8221106 C145.534151,10.4072362 145.547819,10.0486432 145.563899,9.7479397 C145.573548,9.56864322 145.580784,9.45527638 145.586412,9.38211055 L146.237668,9.38211055 C146.408925,9.38211055 146.568121,9.38452261 146.718472,9.39015075 C146.86802,9.39497487 147.011136,9.4038191 147.149427,9.41346734 L147.388221,9.42954774 L147.316663,9.20040201 C147.316663,9.20040201 147.307819,9.17386935 147.307819,9.08944724 L147.307819,8.74854271 C147.307819,8.65125628 147.316663,8.62231156 147.316663,8.62231156 L147.391437,8.39477387 L147.152643,8.40844221 C146.776362,8.43015075 146.427417,8.44301508 146.105005,8.44864322 C145.89998,8.45266332 145.73596,8.45507538 145.612945,8.4558794 C145.630633,8.11336683 145.646714,7.77246231 145.661186,7.43396985 C145.67807,7.04080402 145.701387,6.64040201 145.733548,6.23035176 L145.74802,6.0558794 L145.490734,6.0558794 L143.975156,6.68140704 L143.981588,6.79638191 C144.003296,7.13969849 144.016965,7.47256281 144.022593,7.79417085 C144.026613,8.03939698 144.032241,8.25407035 144.039477,8.43819095 C143.823196,8.43256281 143.528925,8.41728643 143.148623,8.39236181 L142.93797,8.37788945 L142.978975,8.58613065 C142.988623,8.63517588 142.995859,8.68502513 143.001487,8.73165829 C143.005508,8.78150754 143.00792,8.82974874 143.00792,8.87879397 C143.00792,8.93909548 143.005508,8.99698492 143.001487,9.05085427 C142.995859,9.10633166 142.987819,9.16422111 142.978171,9.22532663 L142.942794,9.43437186 L143.154251,9.41346734 C143.259578,9.40301508 143.36008,9.39497487 143.456563,9.39015075 C143.549829,9.38452261 143.639075,9.38211055 143.722693,9.38211055 L144.079678,9.38211055 C144.07807,9.92241206 144.072442,10.4160804 144.062794,10.8623116 C144.052342,11.3543719 144.038673,11.8022111 144.022593,12.2066332 C144.006513,12.6134673 143.992844,12.9865327 143.981588,13.3274372 C143.971136,13.6707538 143.966312,13.9883417 143.966312,14.281809 C143.966312,14.9716583 144.145608,15.5063317 144.498573,15.8713568 C144.85395,16.2379899 145.400683,16.4237186 146.124302,16.4237186 C146.340583,16.4237186 146.568121,16.3979899 146.799678,16.3473367 C147.018372,16.2990955 147.219377,16.2588945 147.401085,16.2267337 L147.535357,16.2034171 L147.535357,15.4596985 L147.327116,15.5224121 Z" id="Fill-21" fill="#447EC0"></path>
                        <path d="M45.7965025,10.7015879 C45.8833367,10.3896281 46.0127839,10.0993769 46.1824322,9.83807035 C46.3472563,9.58239196 46.5611256,9.36611055 46.817608,9.19485427 C47.0652462,9.02922613 47.376402,8.94560804 47.7414271,8.94560804 C48.1265528,8.94560804 48.4385126,9.02922613 48.6700704,9.19244221 C48.9072563,9.36048241 49.094593,9.57515578 49.2280603,9.83163819 C49.3655477,10.0961608 49.4580101,10.384804 49.5038392,10.6903317 C49.5424322,10.9476181 49.5657487,11.1968643 49.5721809,11.4332462 L48.6612261,11.4605829 C47.9400201,11.4847035 47.255799,11.4847035 46.5209246,11.4605829 L45.6477588,11.4340503 C45.6750955,11.2024925 45.7249447,10.9564623 45.7965025,10.7015879 M51.0186131,10.2408844 C50.8763015,9.82038191 50.654392,9.44892462 50.3577085,9.13455276 C50.0618291,8.82259296 49.6919799,8.56932663 49.257809,8.38359799 C48.8228342,8.19706533 48.3018291,8.10219095 47.7092663,8.10219095 C46.4533869,8.10219095 45.4805226,8.50420101 44.8180101,9.2961608 C44.1635377,10.0800804 43.8306734,11.1687236 43.8306734,12.5323417 C43.8306734,13.0919397 43.9303719,13.6201809 44.1273568,14.1017889 C44.3235377,14.585809 44.6089648,15.0111357 44.975598,15.3665126 C45.3406231,15.7210854 45.7804221,15.9944523 46.2813266,16.1809849 C46.7790151,16.3651055 47.336201,16.4583719 47.936,16.4583719 C48.4722814,16.4583719 48.9973065,16.3618894 49.494995,16.1721407 C49.9902714,15.983196 50.4115779,15.7508342 50.7468543,15.4814874 L50.7991156,15.4404824 L50.9173065,14.4756583 L50.6286633,14.3019899 L50.5394171,14.4049045 C50.4075578,14.5568643 50.2499698,14.702392 50.0706734,14.8350553 C49.8905729,14.9693266 49.694392,15.0867136 49.4893668,15.184804 C49.2819296,15.2820905 49.0680603,15.3608844 48.8517789,15.4171658 C48.1876583,15.5908342 47.5701709,15.4967638 47.094191,15.2812864 C46.7693668,15.1333467 46.4927839,14.9339497 46.2724824,14.6871156 C46.0497688,14.4394774 45.8777085,14.1395779 45.7611256,13.7946533 C45.6437387,13.4457085 45.5834372,13.064603 45.5834372,12.6617889 L45.5834372,12.4511357 C45.5834372,12.4197789 45.5842412,12.3916382 45.5850452,12.3651055 L46.5048442,12.3377688 C47.4294673,12.3088241 48.374995,12.3200804 49.295598,12.3377688 L51.1826332,12.3723417 L51.1971055,12.223598 C51.2075578,12.1134472 51.215598,12.0057085 51.2220302,11.8995779 C51.2268543,11.7942513 51.2300704,11.6849045 51.2300704,11.5747538 C51.2300704,11.104402 51.1585126,10.6557588 51.0186131,10.2408844" id="Fill-23" fill="#447EC0"></path>
                        <path d="M33.44,8.21579899 C33.3177889,8.16755779 33.2188945,8.13780905 33.1368844,8.12494472 C33.0596985,8.11288442 32.9680402,8.10645226 32.8603015,8.10645226 C32.1270352,8.10645226 31.4532663,8.5679598 30.8542714,9.47971859 C30.8550754,9.43951759 30.8558794,9.4001206 30.8566834,9.3599196 C30.8623116,9.13961809 30.8864322,8.83248241 30.9290452,8.44896482 L30.9531658,8.2318794 L30.7376884,8.27127638 C30.6211055,8.29378894 30.5085427,8.31147739 30.4032161,8.32836181 C30.1805025,8.36132663 29.9835176,8.35409045 29.8026131,8.32836181 C29.6956784,8.31147739 29.5839196,8.29378894 29.4673367,8.27127638 L29.2655276,8.23429146 L29.2751759,8.43851256 C29.3073367,9.14203015 29.3258291,9.77881407 29.3314573,10.3311759 C29.3370854,10.8827337 29.3394975,11.3691658 29.3394975,11.7896683 L29.3394975,12.3098693 C29.3394975,13.2280603 29.3370854,14.0039397 29.3314573,14.6367035 C29.3258291,15.2646432 29.3073367,15.7655477 29.2751759,16.1241407 L29.2582915,16.3195176 L29.4536683,16.3002211 C29.8532663,16.2600201 30.3083417,16.256 30.7513568,16.3002211 L30.9563819,16.3203216 L30.9282412,16.1161005 C30.8968844,15.8861508 30.878392,15.5798191 30.8727638,15.2027337 C30.8679397,14.8200201 30.8655276,14.2660503 30.8655276,13.5424322 L30.8655276,11.7575075 C30.8655276,11.4600201 30.9009045,11.176201 30.9732663,10.9165025 C31.0432161,10.6600201 31.1445226,10.4365025 31.2739698,10.2531859 C31.399397,10.0730854 31.5569849,9.92755779 31.7411055,9.82142714 C32.0329648,9.65258291 32.4188945,9.61157789 32.7839196,9.73700503 C32.9567839,9.79650251 33.0130653,9.84715578 33.0283417,9.86564824 L33.1248241,9.98062312 L33.4287437,9.76434171 L33.4287437,9.68072362 C33.4287437,9.46605025 33.4343719,9.22886432 33.4448241,8.96514573 C33.4568844,8.66122613 33.4978894,8.50605025 33.5300503,8.42966834 L33.5935678,8.27690452 L33.44,8.21579899 Z" id="Fill-25" fill="#447EC0"></path>
                        <path d="M56.3081809,26.183799 C56.2438593,25.6370653 56.1787337,25.0847035 56.1144121,24.5251055 C56.0492864,23.9671156 55.9865729,23.3978693 55.9254673,22.8197789 C55.8635578,22.2408844 55.7976281,21.6410854 55.7260704,21.0195779 L55.7099899,20.8756583 L55.3425528,20.8756583 L54.7733065,21.9200804 C54.5851658,22.263397 54.3954171,22.6131457 54.2048643,22.9693266 L53.6420503,24.022593 C53.4579296,24.3675176 53.2850653,24.6883216 53.1242613,24.985809 C52.9618492,25.2841005 52.8195377,25.5478191 52.6965226,25.7769648 L52.5566231,26.0398794 C52.111196,25.2213869 51.6826533,24.4213869 51.270995,23.6398794 C50.8199397,22.7811859 50.3648643,21.8822915 49.9202412,20.9665126 L49.8760201,20.8756583 L49.4627538,20.8756583 L49.4482814,21.0211859 C49.3960201,21.5381709 49.3349146,22.0808844 49.2641608,22.6525427 C49.193407,23.224201 49.1162211,23.8030955 49.031799,24.3908342 C48.9473769,24.9785729 48.8605427,25.5630955 48.7704925,26.144402 C48.6796382,26.7257085 48.592804,27.2780704 48.5083819,27.8022915 L48.4746131,28.0169648 L48.6892864,27.9888241 C48.8838593,27.9638995 49.1331055,27.9638995 49.3276784,27.9888241 L49.510191,28.0121407 L49.510191,27.8280201 C49.510191,27.5715377 49.5262714,27.2410854 49.5584322,26.8463116 C49.5897889,26.4434975 49.6291859,26.0149548 49.6742111,25.5598794 C49.7192362,25.104804 49.7690854,24.6432965 49.8245628,24.1753568 C49.8567236,23.8979698 49.8872764,23.6342513 49.9162211,23.3801809 C50.2667739,24.0772663 50.6157186,24.7606834 50.9638593,25.4336482 C51.3835578,26.2441005 51.792,27.0666131 52.1795377,27.8778693 L52.2229548,27.9703317 L52.5188342,27.9703317 L52.5614472,27.8738492 C52.9457688,27.0022915 53.3566231,26.1556583 53.7827538,25.3588744 C54.1397387,24.6907337 54.5015477,24.0201809 54.8689849,23.345608 C54.9477789,24.0217889 55.0161206,24.6907337 55.0740101,25.3387739 C55.1447638,26.1476181 55.2155176,26.9813869 55.2870754,27.8408844 L55.3015477,28.0177688 L55.4760201,27.9880201 C55.5443618,27.9759598 55.6110955,27.9703317 55.6762211,27.9703317 L56.1329045,27.9703317 C56.1980302,27.9703317 56.2647638,27.9759598 56.3331055,27.9880201 L56.553407,28.025809 L56.5212462,27.8047035 C56.4432563,27.2692261 56.3725025,26.7297286 56.3081809,26.183799" id="Fill-27" fill="#447EC0"></path>
                        <path d="M61.4078392,26.8188945 C61.3121608,26.9644221 61.1786935,27.0954774 61.0098492,27.2080402 C60.6906533,27.4219095 60.2822111,27.481407 59.958995,27.1927638 C59.8198995,27.0689447 59.7523618,26.8832161 59.7523618,26.6251256 C59.7523618,26.4739698 59.7788945,26.3509548 59.8319598,26.2601005 C59.8874372,26.1636181 59.960603,26.0856281 60.0538693,26.0213065 C60.1527638,25.9537688 60.2677387,25.8982915 60.3955779,25.8580905 C60.5354774,25.8146734 60.6761809,25.7784925 60.8184925,25.7511558 C60.9656281,25.721407 61.1111558,25.6948744 61.2550754,25.6691457 C61.319397,25.6578894 61.3805025,25.6442211 61.439196,25.6305528 L61.4078392,26.8188945 Z M62.7819095,27.3704523 C62.6942714,27.3776884 62.6130653,27.3744724 62.5857286,27.3495477 C62.5559799,27.321407 62.5326633,27.2860302 62.5157789,27.241809 C62.4964824,27.1903518 62.4852261,27.1284422 62.4828141,27.0601005 C62.479598,26.9748744 62.4779899,26.8944724 62.4779899,26.8188945 C62.4779899,26.4128643 62.4844221,26.0293467 62.4972864,25.6651256 C62.5101508,25.2984925 62.5165829,24.9294472 62.5165829,24.558794 C62.5165829,24.3232161 62.4723618,24.1045226 62.3847236,23.9075377 C62.2978894,23.7089447 62.1756784,23.5368844 62.0221106,23.3961809 C61.8685427,23.2554774 61.6820101,23.1469347 61.4673367,23.0721608 C61.0275377,22.919397 60.4671357,22.9290452 59.9678392,23.0850251 C59.7049246,23.1686432 59.4178894,23.3270352 59.1139698,23.5569849 L59.0496482,23.6052261 L59.0496482,24.3529648 L59.4162814,24.3529648 L59.4613065,24.2661307 C59.5561809,24.0900503 59.7009045,23.9493467 59.8930653,23.8496482 C60.2347739,23.6703518 60.6938693,23.6438191 60.9632161,23.7780905 C61.0773869,23.8351759 61.1666332,23.9075377 61.2365829,23.998392 C61.3065327,24.0900503 61.359598,24.201005 61.3925628,24.3280402 C61.4271357,24.4631156 61.4456281,24.6062312 61.4456281,24.7525628 C61.4456281,24.8530653 61.4335678,24.9101508 61.4239196,24.9407035 C61.4215075,24.9487437 61.4022111,24.9744724 61.3386935,25.0042211 C61.2574874,25.0436181 61.1232161,25.0838191 60.9407035,25.1232161 C60.7461307,25.1650251 60.4759799,25.2140704 60.1310553,25.2719598 C59.6767839,25.3475377 59.3133668,25.5043216 59.0496482,25.7366834 C58.7730653,25.9819095 58.6323618,26.3260302 58.6323618,26.760201 C58.6323618,26.9732663 58.6757789,27.1662312 58.761005,27.3334673 C58.8438191,27.4966834 58.9539698,27.638191 59.0898492,27.7563819 C59.2249246,27.8745729 59.3841206,27.960603 59.561005,28.0128643 C59.7306533,28.0627136 59.9051256,28.0868342 60.080402,28.0868342 C60.4317588,28.0868342 60.7356784,28.0257286 60.9825126,27.9051256 C61.158593,27.8198995 61.3370854,27.6984925 61.5155779,27.5449246 C61.5565829,27.6309548 61.6120603,27.7081407 61.6820101,27.7756784 C61.8243216,27.9107538 62.0245226,27.9798995 62.2769849,27.9798995 C62.4168844,27.9798995 62.5455276,27.9694472 62.6596985,27.9485427 C62.7778894,27.9276382 62.880804,27.8970854 62.9644221,27.8592965 L63.0601005,27.8158794 L63.0601005,27.4974874 L63.0279397,27.2209045 L62.7819095,27.3704523 Z" id="Fill-29" fill="#447EC0"></path>
                        <path d="M67.7571055,22.9728643 C67.7080603,22.9656281 67.6501709,22.961608 67.5826332,22.961608 C67.1725829,22.961608 66.7954975,23.1859296 66.456201,23.6297487 C66.4634372,23.520402 66.4754975,23.3901508 66.4923819,23.238191 L66.5165025,23.0227136 L66.3026332,23.0613065 C66.2334874,23.0733668 66.1675578,23.0846231 66.1040402,23.0942714 C65.977809,23.1119598 65.8660503,23.1087437 65.7631357,23.0942714 C65.7004221,23.0846231 65.6336884,23.0733668 65.5645427,23.0613065 L65.3651457,23.0251256 L65.3739899,23.2285427 C65.3932864,23.6522613 65.4045427,24.0285427 65.4077588,24.3565829 C65.4109749,24.6862312 65.4125829,24.9764824 65.4125829,25.2281407 L65.4125829,25.5384925 C65.4125829,26.0876382 65.4109749,26.5507538 65.4077588,26.9294472 C65.4045427,27.3001005 65.3932864,27.5975879 65.3739899,27.8138693 L65.3571055,28.0092462 L65.5524824,27.9891457 C65.7888643,27.9658291 66.0533869,27.9626131 66.3146935,27.9891457 L66.5197186,28.0100503 L66.4923819,27.8066332 C66.4738894,27.6691457 66.4626332,27.4890452 66.4594171,27.2679397 C66.456201,27.038794 66.454593,26.7075377 66.454593,26.2757789 L66.454593,25.2088442 C66.454593,25.0375879 66.4754975,24.8735678 66.5173065,24.7232161 C66.5567035,24.5768844 66.6137889,24.4506533 66.6869548,24.3461307 C66.7577085,24.2464322 66.8445427,24.1660302 66.9458492,24.1081407 C67.1066533,24.0156784 67.3181106,23.9955779 67.5150955,24.0623116 C67.6091658,24.0944724 67.6324824,24.119397 67.6324824,24.119397 L67.7289648,24.2351759 L67.9870553,24.0510553 L67.9870553,23.9674372 C67.9870553,23.839598 67.9902714,23.6988945 67.9967035,23.5421106 C68.0039397,23.3692462 68.0256482,23.2848241 68.0425327,23.2438191 L68.1060503,23.0910553 L67.9516784,23.0307538 C67.8720804,22.998593 67.8101709,22.9809045 67.7571055,22.9728643" id="Fill-31" fill="#447EC0"></path>
                        <path d="M72.4583719,25.2736482 C72.2798794,25.1811859 72.0820905,25.1072161 71.8682211,25.0557588 C71.6760603,25.0091256 71.4967638,24.9544523 71.3359598,24.8925427 C71.1904322,24.8370653 71.0674171,24.7598794 70.9709347,24.662593 C70.8881206,24.5805829 70.8487236,24.4607839 70.8487236,24.2967638 C70.8487236,24.1801809 70.8688241,24.0812864 70.9090251,24.0008844 C70.9500302,23.9188744 71.0014874,23.8513367 71.0617889,23.8006834 C71.1236985,23.7492261 71.1936482,23.7098291 71.2708342,23.6849045 C71.5329447,23.5972663 71.7878191,23.6495276 71.9606834,23.7926432 C72.0845025,23.8939497 72.1681206,24.0089246 72.2099296,24.1351558 L72.2469146,24.2461106 L72.6183719,24.2461106 L72.6408844,24.1102312 C72.6529447,24.0378693 72.6802814,23.9357588 72.7220905,23.8030955 C72.7647035,23.6704322 72.8097286,23.5594774 72.8563618,23.4710352 L72.945608,23.304603 L72.7671156,23.2418894 C72.6199799,23.1904322 72.464804,23.1333467 72.302392,23.0698291 C71.9220905,22.9202814 71.3086231,22.9275176 70.8913367,23.0834975 C70.6718392,23.1647035 70.4836985,23.2788744 70.3317387,23.423598 C70.1789749,23.5683216 70.0615879,23.7419899 69.982794,23.9405829 C69.904,24.1375678 69.863799,24.3546533 69.863799,24.5878191 C69.863799,24.8925427 69.9313367,25.1401809 70.064804,25.3234975 C70.1918392,25.4979698 70.3518392,25.6394774 70.5391759,25.744 C70.7176683,25.8428945 70.9162613,25.9216884 71.1301307,25.9771658 C71.3247035,26.0270151 71.504,26.0857085 71.663196,26.1492261 C71.8119397,26.2095276 71.9365628,26.2867136 72.0346533,26.3791759 C72.1142513,26.4547538 72.1528442,26.5665126 72.1528442,26.7216884 C72.1528442,26.8398794 72.1319397,26.943598 72.0917387,27.0304322 C72.0491256,27.1196784 71.9960603,27.1904322 71.9269146,27.2459095 C71.8553568,27.305407 71.7725427,27.3496281 71.6768643,27.383397 C71.4750553,27.4517387 71.2386734,27.4485226 71.0489246,27.3745528 C70.942794,27.3351558 70.8479196,27.2845025 70.7667136,27.225809 C70.6814874,27.1638995 70.6107337,27.1003819 70.5512362,27.0320402 C70.4925427,26.9653065 70.4499296,26.905005 70.424201,26.8527437 L70.3791759,26.7634975 L70.0004824,26.7634975 L70.0004824,26.9251055 C70.0004824,27.0063116 69.9811859,27.1132462 69.943397,27.2443015 C69.903196,27.3817889 69.865407,27.4903317 69.8308342,27.5659095 L69.7681206,27.7009849 L69.8975678,27.7749548 C70.0438995,27.8585729 70.225608,27.9317387 70.4370653,27.9936482 C70.6509347,28.0555578 70.9178693,28.0869146 71.2290251,28.0869146 C71.5192764,28.0869146 71.783799,28.0426935 72.0137487,27.9550553 C72.2461106,27.8674171 72.4495276,27.7419899 72.6167638,27.5811859 C72.784,27.4211859 72.9134472,27.2394774 73.0018894,27.0400804 C73.0919397,26.8382714 73.1377688,26.6308342 73.1377688,26.4217889 C73.1377688,26.1154573 73.0694271,25.8678191 72.9367638,25.6853065 C72.8089246,25.5100302 72.6473166,25.3709347 72.4583719,25.2736482" id="Fill-33" fill="#447EC0"></path>
                        <path d="M77.9453266,26.8188945 C77.8496482,26.9644221 77.7161809,27.0954774 77.5473367,27.2080402 C77.2289447,27.4219095 76.8196985,27.481407 76.4964824,27.1927638 C76.3573869,27.0689447 76.2898492,26.8832161 76.2898492,26.6251256 C76.2898492,26.4739698 76.3163819,26.3509548 76.3694472,26.2601005 C76.4249246,26.1636181 76.4972864,26.0856281 76.5913568,26.0213065 C76.6902513,25.9537688 76.8052261,25.8982915 76.9330653,25.8580905 C77.0721608,25.8146734 77.2136683,25.7784925 77.3559799,25.7511558 C77.5031156,25.721407 77.6486432,25.6948744 77.7925628,25.6691457 C77.8568844,25.6578894 77.9179899,25.6442211 77.9766834,25.6305528 L77.9453266,26.8188945 Z M79.319397,27.3704523 C79.2317588,27.3776884 79.1505528,27.3744724 79.1232161,27.3495477 C79.0934673,27.321407 79.0701508,27.2860302 79.0532663,27.241809 C79.0339698,27.1903518 79.0227136,27.1284422 79.0203015,27.0601005 C79.0170854,26.9748744 79.0154774,26.8944724 79.0154774,26.8188945 C79.0154774,26.4128643 79.0219095,26.0293467 79.0347739,25.6651256 C79.0476382,25.2984925 79.0540704,24.9294472 79.0540704,24.558794 C79.0540704,24.3232161 79.0098492,24.1045226 78.9222111,23.9075377 C78.8353769,23.7089447 78.7131658,23.5368844 78.559598,23.3961809 C78.4060302,23.2554774 78.2194975,23.1469347 78.0048241,23.0721608 C77.5650251,22.919397 77.0046231,22.9290452 76.5053266,23.0850251 C76.2424121,23.1686432 75.9553769,23.3270352 75.6514573,23.5569849 L75.5871357,23.6052261 L75.5871357,24.3529648 L75.9529648,24.3529648 L75.998794,24.2661307 C76.0936683,24.0900503 76.238392,23.9493467 76.4305528,23.8496482 C76.7730653,23.6703518 77.2313568,23.6438191 77.5007035,23.7780905 C77.6148744,23.8351759 77.7041206,23.9075377 77.7740704,23.998392 C77.8440201,24.0900503 77.8970854,24.201005 77.9300503,24.3280402 C77.9646231,24.4631156 77.9831156,24.6062312 77.9831156,24.7525628 C77.9831156,24.8530653 77.9710553,24.9101508 77.961407,24.9407035 C77.958995,24.9487437 77.9396985,24.9744724 77.8761809,25.0042211 C77.7949749,25.0436181 77.6607035,25.0838191 77.478191,25.1232161 C77.2836181,25.1650251 77.0134673,25.2140704 76.6685427,25.2719598 C76.2142714,25.3475377 75.8508543,25.5043216 75.5871357,25.7366834 C75.3105528,25.9819095 75.1698492,26.3260302 75.1698492,26.760201 C75.1698492,26.9732663 75.2132663,27.1662312 75.2984925,27.3334673 C75.3813065,27.4966834 75.4914573,27.638191 75.6273367,27.7563819 C75.7624121,27.8745729 75.921608,27.960603 76.0984925,28.0128643 C76.2681407,28.0627136 76.4426131,28.0868342 76.6178894,28.0868342 C76.9692462,28.0868342 77.2731658,28.0257286 77.52,27.9051256 C77.6960804,27.8198995 77.8745729,27.6984925 78.0530653,27.5449246 C78.0940704,27.6309548 78.1495477,27.7081407 78.2194975,27.7756784 C78.361809,27.9107538 78.5620101,27.9798995 78.8144724,27.9798995 C78.9543719,27.9798995 79.0830151,27.9694472 79.1971859,27.9485427 C79.3153769,27.9276382 79.4182915,27.8970854 79.5019095,27.8592965 L79.5967839,27.8158794 L79.5967839,27.4974874 L79.5654271,27.2209045 L79.319397,27.3704523 Z" id="Fill-35" fill="#447EC0"></path>
                        <path d="M89.1322211,24.6569648 C89.0317186,24.6593769 88.9312161,24.6617889 88.8315176,24.663397 C88.4825729,24.6706332 88.1456884,24.6722412 87.7726231,24.6585729 C87.6761407,24.6553568 87.5812663,24.6529447 87.488804,24.6513367 L88.3016683,22.7554573 L89.1322211,24.6569648 Z M91.3633769,27.0826935 C91.2307136,26.785206 91.0827739,26.4483216 90.9179497,26.0704322 C90.7531256,25.6917387 90.5770452,25.2841005 90.3889045,24.8443015 C90.2023719,24.4053065 90.0150352,23.9622915 89.8276985,23.5168643 C89.6395578,23.0706332 89.4554372,22.6300302 89.2745327,22.1934472 L88.729407,20.8756583 L88.329809,20.8756583 L88.287196,20.9729447 C87.7830754,22.1307337 87.2829749,23.2676181 86.7844824,24.3860101 C86.2755377,25.5293266 85.7601608,26.664603 85.2536281,27.7596784 L85.1306131,28.023397 L85.4200603,27.9888241 C85.6274975,27.9638995 85.8912161,27.9638995 86.0986533,27.9888241 L86.2369447,28.0057085 L86.2747337,27.8714372 C86.3559397,27.582794 86.4813668,27.2065126 86.648603,26.7546533 C86.8102111,26.3164623 86.9854874,25.8670151 87.169608,25.4159598 C87.3328241,25.4111357 87.4944322,25.4079196 87.6536281,25.4047035 C88.0532261,25.3982714 88.4689045,25.3990754 88.8789548,25.4047035 C89.0558392,25.4079196 89.2295075,25.4119397 89.4015678,25.4159598 C89.4747337,25.6008844 89.5519196,25.7930452 89.6339296,25.9932462 L89.9209648,26.6911357 C90.0134271,26.9186734 90.0986533,27.1373668 90.1758392,27.345608 C90.2522211,27.5522412 90.3117186,27.7291256 90.3567437,27.8754573 L90.3977487,28.0089246 L90.5352362,27.9880201 C90.6180503,27.9759598 90.6960402,27.9703317 90.768402,27.9703317 L91.2837789,27.9703317 C91.3561407,27.9703317 91.4341307,27.9759598 91.5169447,27.9880201 L91.8377487,28.0354573 L91.6825729,27.7508342 C91.6005628,27.5988744 91.4928241,27.3737487 91.3633769,27.0826935 L91.3633769,27.0826935 Z" id="Fill-37" fill="#447EC0"></path>
                        <path d="M95.1407437,22.592 C95.1439598,22.3339095 95.1487839,22.0790352 95.1552161,21.8273769 C95.1616482,21.5765226 95.1696884,21.3361206 95.1793367,21.1085829 C95.1897889,20.8810452 95.1994372,20.6872764 95.2131055,20.5272764 L95.2299899,20.3182312 L95.0225528,20.3544121 C94.6816482,20.4163216 94.5441608,20.4147136 94.2072764,20.3544121 L94.0006432,20.3182312 L94.0167236,20.5272764 C94.0295879,20.6864724 94.0408442,20.8810452 94.0496884,21.1085829 C94.0593367,21.3361206 94.0673769,21.5765226 94.073809,21.8273769 C94.0802412,22.0790352 94.0850653,22.3339095 94.0882814,22.592 C94.0914975,22.8500905 94.0939095,23.0888844 94.0939095,23.3075779 L94.0939095,25.0635578 C94.0939095,25.2822513 94.0914975,25.5218492 94.0882814,25.7791357 C94.0850653,26.0372261 94.0802412,26.2921005 94.073809,26.5437588 C94.0673769,26.793809 94.0593367,27.033407 94.0496884,27.2585327 C94.0408442,27.4820503 94.0295879,27.6669749 94.0167236,27.8141106 L94.0006432,28.0070754 L94.192804,27.9893869 C94.4798392,27.9644623 94.7491859,27.9644623 95.0370251,27.9893869 L95.2299899,28.0070754 L95.2131055,27.8133065 C95.1994372,27.6661709 95.1897889,27.4812462 95.1793367,27.2585327 C95.1696884,27.033407 95.1616482,26.793809 95.1552161,26.5437588 C95.1487839,26.2921005 95.1439598,26.0372261 95.1407437,25.7791357 C95.1375276,25.5218492 95.1359196,25.2822513 95.1359196,25.0635578 L95.1359196,23.3075779 C95.1359196,23.0888844 95.1375276,22.8500905 95.1407437,22.592" id="Fill-39" fill="#447EC0"></path>
                        <path d="M100.545286,26.8188945 C100.449608,26.9644221 100.316141,27.0954774 100.147296,27.2080402 C99.8272965,27.4219095 99.4196583,27.481407 99.0964422,27.1927638 C98.9573467,27.0689447 98.889809,26.8832161 98.889809,26.6251256 C98.889809,26.4731658 98.9163417,26.3509548 98.969407,26.2601005 C99.0248844,26.1636181 99.0972462,26.0856281 99.1905126,26.0213065 C99.289407,25.9537688 99.4051859,25.8982915 99.5330251,25.8588945 C99.6721206,25.8146734 99.8136281,25.7784925 99.9559397,25.7511558 C100.102271,25.721407 100.247799,25.6948744 100.391719,25.6691457 C100.456844,25.6578894 100.51795,25.6442211 100.576643,25.6305528 L100.545286,26.8188945 Z M101.917749,27.3704523 C101.830915,27.3776884 101.748905,27.3744724 101.723176,27.3503518 C101.693427,27.321407 101.669307,27.2860302 101.652422,27.241809 C101.633126,27.1903518 101.621869,27.1284422 101.619457,27.0601005 C101.616241,26.9756784 101.615437,26.8944724 101.615437,26.8188945 C101.615437,26.4128643 101.621869,26.0293467 101.63393,25.6651256 C101.647598,25.2984925 101.65403,24.9294472 101.65403,24.558794 C101.65403,24.3232161 101.609809,24.1045226 101.522171,23.9075377 C101.435337,23.7097487 101.313126,23.5376884 101.158754,23.3961809 C101.005186,23.2562814 100.819457,23.1469347 100.604784,23.0721608 C100.164985,22.919397 99.6037789,22.9290452 99.1052864,23.0850251 C98.8423719,23.1686432 98.5553367,23.3270352 98.2514171,23.5569849 L98.1870955,23.6052261 L98.1870955,24.3529648 L98.5529246,24.3529648 L98.5987538,24.2661307 C98.6928241,24.0900503 98.8375477,23.9493467 99.0305126,23.8496482 C99.3730251,23.6703518 99.8321206,23.6438191 100.100663,23.7780905 C100.214834,23.8351759 100.30408,23.9075377 100.373226,23.998392 C100.44398,24.0900503 100.496241,24.201005 100.529206,24.3280402 C100.564583,24.4639196 100.583075,24.6070352 100.583075,24.7525628 C100.583075,24.8514573 100.571015,24.9101508 100.561367,24.9407035 C100.558955,24.9487437 100.538854,24.9736683 100.476141,25.0042211 C100.394935,25.0436181 100.260663,25.0838191 100.078151,25.1232161 C99.8827739,25.1650251 99.6126231,25.2140704 99.2685025,25.2719598 C98.8134271,25.3475377 98.4508141,25.5043216 98.1870955,25.7366834 C97.9105126,25.9819095 97.769809,26.3260302 97.769809,26.760201 C97.769809,26.9732663 97.8132261,27.1670352 97.8984523,27.3334673 C97.9812663,27.4966834 98.0922211,27.639799 98.2264925,27.7563819 C98.3631759,27.8745729 98.5215678,27.960603 98.6984523,28.0128643 C98.8681005,28.0627136 99.0425729,28.0868342 99.2170452,28.0868342 C99.5700101,28.0868342 99.8731256,28.0257286 100.119156,27.9051256 C100.295236,27.8198995 100.474533,27.6984925 100.652221,27.5449246 C100.693226,27.6309548 100.749508,27.7081407 100.819457,27.7756784 C100.962573,27.9107538 101.16197,27.9798995 101.414432,27.9798995 C101.553528,27.9798995 101.682975,27.9694472 101.796342,27.9485427 C101.915337,27.9276382 102.018251,27.8970854 102.101869,27.8592965 L102.196744,27.8158794 L102.196744,27.4974874 L102.164583,27.2209045 L101.917749,27.3704523 Z" id="Fill-41" fill="#447EC0"></path>
                        <path d="M111.479236,25.4714372 C111.485668,25.3017889 111.492101,25.1522412 111.498533,25.023598 C111.504965,24.8909347 111.508181,24.7687236 111.508181,24.6553568 C111.508181,24.3651055 111.467176,24.1110352 111.385166,23.9003819 C111.303156,23.6832965 111.184161,23.503196 111.033005,23.3632965 C110.882653,23.224201 110.704161,23.1212864 110.500744,23.0561608 C110.304563,22.9934472 110.088281,22.9612864 109.857528,22.9612864 C109.47803,22.9612864 109.137126,23.0529447 108.843658,23.2330452 C108.634613,23.3608844 108.455317,23.5305327 108.308181,23.7395779 C108.280844,23.6929447 108.251095,23.6471156 108.217327,23.6028945 C108.116824,23.4702312 107.995417,23.3544523 107.854714,23.2603819 C107.714814,23.1671156 107.559638,23.0939497 107.391598,23.0416884 C107.222754,22.9878191 107.046673,22.9612864 106.869789,22.9612864 C106.355216,22.9612864 105.923457,23.1470151 105.583357,23.5144523 C105.588181,23.4195779 105.593809,23.3263116 105.600241,23.2330452 L105.616322,23.0296281 L105.196623,23.0939497 C105.022955,23.1220905 104.887075,23.104402 104.642653,23.0609849 L104.42798,23.023196 L104.453709,23.2394774 C104.484261,23.5088241 104.505166,23.8055075 104.515618,24.1222915 C104.525266,24.4406834 104.53009,24.744603 104.53009,25.0340503 L104.53009,26.0430955 C104.53009,26.3325427 104.525266,26.6364623 104.515618,26.9548543 C104.505166,27.2708342 104.484261,27.5578693 104.453709,27.8079196 L104.428784,28.0073166 L104.628985,27.9896281 C104.91602,27.9638995 105.184563,27.9638995 105.473206,27.9896281 L105.674211,28.0073166 L105.648482,27.8079196 C105.617126,27.5570653 105.596221,27.2708342 105.586573,26.9548543 C105.576925,26.6364623 105.572101,26.3325427 105.572101,26.0430955 L105.572101,25.2181709 C105.572101,24.7510352 105.662955,24.3876181 105.840643,24.1391759 C106.010291,23.904402 106.273206,23.7902312 106.645467,23.7902312 C106.777327,23.7902312 106.907578,23.8264121 107.033005,23.8995779 C107.158432,23.9719397 107.25009,24.0579698 107.302352,24.1464121 C107.337729,24.2171658 107.365869,24.2822915 107.38597,24.3401809 C107.405266,24.3948543 107.420543,24.4672161 107.430995,24.5564623 C107.443859,24.6521407 107.451095,24.7815879 107.454312,24.945608 C107.457528,25.1160603 107.459136,25.3524422 107.459136,25.6555578 C107.459136,26.0085226 107.453508,26.3695276 107.441447,26.7361608 C107.430191,27.1019899 107.41009,27.462191 107.38195,27.8151558 L107.366673,28.0065126 L107.558834,27.9896281 C107.842653,27.9638995 108.089487,27.9638995 108.373307,27.9896281 L108.558231,28.0057085 L108.516422,27.0690251 C108.50597,26.8414874 108.50195,26.5898291 108.50195,26.3140503 C108.50195,25.8573668 108.504362,25.4979698 108.510794,25.2366633 C108.517226,24.9809849 108.528482,24.7799799 108.544563,24.6400804 C108.561447,24.4792764 108.584764,24.3980704 108.600844,24.3586734 C108.624965,24.2991759 108.659538,24.2396784 108.703759,24.1801809 C108.780141,24.0772663 108.890291,23.984804 109.031799,23.905206 C109.169286,23.8288241 109.342955,23.7902312 109.547176,23.7902312 C109.716824,23.7902312 109.856724,23.8159598 109.965266,23.8666131 C110.071397,23.9172663 110.154211,23.982392 110.216925,24.065206 C110.280442,24.1496281 110.327879,24.2541508 110.359236,24.3747538 C110.390593,24.504201 110.407477,24.6441005 110.407477,24.7920402 C110.407477,25.6603819 110.396221,26.3502312 110.373709,26.8406834 C110.351196,27.3295276 110.330291,27.6543518 110.311799,27.8079196 L110.285266,28.0274171 L110.502352,27.9880201 C110.564261,27.9759598 110.625367,27.9703317 110.686472,27.9703317 L111.103759,27.9703317 C111.16406,27.9703317 111.22597,27.9759598 111.287075,27.9880201 L111.493709,28.025809 L111.478432,27.8167638 C111.465568,27.6318392 111.458332,27.4597789 111.455116,27.2997789 C111.451095,27.1397789 111.450291,26.9725427 111.450291,26.7996784 C111.450291,26.5174673 111.453508,26.2674171 111.45994,26.0519397 C111.465568,25.8372663 111.472,25.6434975 111.479236,25.4714372" id="Fill-43" fill="#447EC0"></path>
                        <mask id="mask-2" fill="white">
                            <use xlink:href="#path-1"></use>
                        </mask>
                        <g id="Clip-46"></g>
                        <polygon id="Fill-45" fill="#447EC0" mask="url(#mask-2)" points="159.024724 19.8379095 159.971859 19.8379095 159.971859 0.00032160804 159.024724 0.00032160804"></polygon>
                        <polygon id="Fill-47" fill="#447EC0" mask="url(#mask-2)" points="0 19.8684623 0.843417085 19.8684623 0.843417085 -0.00048241206 0 -0.00048241206"></polygon>
                    </g>
                </g>
            </g>
        </g>
    </g>
</svg>