<?xml version="1.0" encoding="UTF-8" standalone="no"?>
<svg width="383px" height="55px" viewBox="0 0 383 55" version="1.1" xmlns="http://www.w3.org/2000/svg" xmlns:xlink="http://www.w3.org/1999/xlink">
    <!-- Generator: Sketch 46.2 (44496) - http://www.bohemiancoding.com/sketch -->
    <title>Full Logo</title>
    <desc>Created with Sketch.</desc>
    <defs>
        <polygon id="path-1" points="0 54.1523867 382.98307 54.1523867 382.98307 -0.00263816952 0 -0.00263816952"></polygon>
    </defs>
    <g id="Page-1" stroke="none" stroke-width="1" fill="none" fill-rule="evenodd">
        <g id="OUD-Hover" transform="translate(-60.000000, -60.000000)">
            <g id="Featured-Area" transform="translate(0.000000, -172.000000)">
                <g id="Full-Logo" transform="translate(60.000000, 232.000000)">
                    <path d="M33.1037512,39.0706311 C33.6907439,36.874355 33.9809426,34.4670253 33.9809426,31.8618329 C33.9809426,29.296213 33.6907439,26.9350513 33.1037512,24.7915386 C32.5233539,22.6480258 31.6659488,20.7947117 30.5447268,19.2381917 C29.4235047,17.6882671 28.0318703,16.4747091 26.3830143,15.617304 C24.727563,14.7533035 22.8346763,14.3180056 20.697759,14.3180056 C18.5014829,14.3180056 16.5756191,14.7533035 14.9135723,15.617304 C13.2515255,16.4747091 11.8664865,17.6882671 10.7518599,19.2381917 C9.63723327,20.7947117 8.79961445,22.6480258 8.232408,24.7915386 C7.66520155,26.9350513 7.38159833,29.296213 7.38159833,31.8618329 C7.38159833,34.4670253 7.66520155,36.874355 8.232408,39.0706311 C8.79961445,41.2735027 9.63723327,43.1729847 10.7518599,44.7690773 C11.8664865,46.3717653 13.2515255,47.6183004 14.9135723,48.515278 C16.5756191,49.4188511 18.5014829,49.8673399 20.697759,49.8673399 C22.8346763,49.8673399 24.727563,49.4188511 26.3830143,48.515278 C28.0318703,47.6183004 29.4235047,46.3717653 30.5447268,44.7690773 C31.6659488,43.1729847 32.5233539,41.2735027 33.1037512,39.0706311 Z M38.6175255,22.0544377 C39.4947169,23.4922401 40.1740455,25.0355692 40.6621069,26.6910206 C41.1501682,28.3398766 41.3876035,30.0678776 41.3876035,31.8618329 C41.3876035,33.6755744 41.1501682,35.4365526 40.6621069,37.1315765 C40.1740455,38.8266004 39.4947169,40.4160976 38.6175255,41.8868771 C37.7337387,43.364252 36.6652801,44.7031231 35.4055541,45.916681 C34.1524236,47.130239 32.7607892,48.1657206 31.2306508,49.0297211 C29.7071079,49.8937216 28.0516566,50.5598594 26.2708921,51.0347299 C24.4967231,51.5096004 22.6368136,51.7536311 20.697759,51.7536311 C18.752109,51.7536311 16.8987949,51.5096004 15.1180305,51.0347299 C13.337266,50.5598594 11.6884101,49.8937216 10.1582718,49.0297211 C8.63472885,48.1657206 7.23649901,47.130239 5.98336848,45.916681 C4.72364253,44.7031231 3.65518388,43.364252 2.77799251,41.8868771 C1.89420572,40.4160976 1.21487707,38.8331959 0.726815704,37.1447674 C0.238754342,35.4563389 0.00131908476,33.6953607 0.00131908476,31.8618329 C0.00131908476,30.0678776 0.238754342,28.3398766 0.726815704,26.6910206 C1.21487707,25.0355692 1.89420572,23.4922401 2.77799251,22.0544377 C3.65518388,20.6166353 4.72364253,19.3107414 5.98336848,18.1367559 C7.23649901,16.9561751 8.63472885,15.9470752 10.1582718,15.102861 C11.6884101,14.2586467 13.337266,13.6056998 15.1180305,13.1506155 C16.8987949,12.6889359 18.752109,12.458096 20.697759,12.458096 C22.6368136,12.458096 24.4967231,12.6889359 26.2708921,13.1506155 C28.0516566,13.6056998 29.7071079,14.2586467 31.2306508,15.102861 C32.7607892,15.9470752 34.1524236,16.9561751 35.4055541,18.1367559 C36.6652801,19.3107414 37.7337387,20.6166353 38.6175255,22.0544377 Z" id="Fill-1" fill="#FFFFFF"></path>
                    <path d="M111.335371,38.8562798 C110.537324,40.881075 109.442484,42.5760989 108.05085,43.947947 C106.659215,45.3263906 105.02355,46.3618721 103.157045,47.0609871 C101.29054,47.7666974 99.2987223,48.1096595 97.1749958,48.1096595 L90.4938315,48.1096595 L90.4938315,16.1020677 L97.2277592,16.1020677 C99.4570125,16.1020677 101.508189,16.4911977 103.387885,17.2694577 C105.260985,18.0543131 106.88346,19.1425581 108.235522,20.5341925 C109.594179,21.9258269 110.649447,23.5878737 111.401325,25.5203329 C112.159799,27.4527921 112.535738,29.5633277 112.535738,31.8651306 C112.535738,34.5033001 112.133417,36.8380802 111.335371,38.8562798 M118.339711,24.0627442 C117.277848,21.7147734 115.681755,19.6504057 113.558029,17.849855 C111.71131,16.2735487 109.396316,15.1193495 106.619643,14.4004484 C103.842969,13.6815472 100.525471,13.3253943 96.6671482,13.3253943 L84.1886063,13.3253943 L84.1886063,50.8599512 L98.1972865,50.8599512 C101.686266,50.8599512 104.779519,50.3652944 107.483643,49.3693854 C110.187767,48.3734764 112.456593,47.0016283 114.303311,45.2736272 C116.143435,43.5390307 117.541665,41.5076402 118.504596,39.1926465 C119.467528,36.8776527 119.948994,34.3977733 119.948994,31.7596038 C119.948994,28.9697395 119.414765,26.4107151 118.339711,24.0627442" id="Fill-3" fill="#FFFFFF"></path>
                    <path d="M76.5234048,37.6836135 C76.5234048,39.2863015 76.2529924,40.7900581 75.7121676,42.2014788 C75.6000454,42.4916774 75.4747324,42.7752807 75.3428239,43.0588839 L75.3428239,43.0654793 C75.3428239,43.0654793 74.9075259,44.3449915 73.3971739,45.9015116 L73.3971739,45.9015116 L73.3971739,45.9015116 C73.1663341,46.1389468 72.9157079,46.3763821 72.6387001,46.6204128 C72.6123185,46.640199 72.5925322,46.6599853 72.5661505,46.6797716 C70.2115842,48.7177575 65.9905129,50.9272245 58.63002,51.3493316 C59.9425093,51.6065532 61.3407392,51.7516525 62.8642821,51.7516525 C65.772864,51.7516525 68.2659342,51.3757133 70.3368972,50.6304304 C72.4144557,49.8851475 74.1160751,48.8694523 75.4483507,47.5899401 C76.7740309,46.3038324 77.7501536,44.8132666 78.3701234,43.1116473 C78.9900933,41.4166234 79.3000782,39.6028818 79.3000782,37.6836135 L79.3000782,13.3267134 L76.5234048,13.3267134 L76.5234048,37.6836135 Z" id="Fill-5" fill="#FFFFFF"></path>
                    <path d="M62.7739248,48.6491651 C63.4070854,48.5370429 64.0204599,48.4117299 64.5942617,48.273226 C64.7195748,48.2402488 64.8251016,48.2138671 64.9372238,48.1874855 C66.170568,47.8709051 67.2654084,47.494966 68.2349357,47.0794543 C68.2942945,47.0530726 68.3602487,47.0266909 68.426203,46.9937137 C68.5383252,46.9475458 68.6306611,46.8947824 68.7361879,46.8486144 C69.1516996,46.6441563 69.6001884,46.4001256 69.9893184,46.1297132 C70.0025093,46.1231178 70.0091047,46.1165224 70.0222955,46.1033315 L69.6727381,46.2682171 C68.2349357,46.8749961 66.6784157,47.0992405 64.8844604,47.0992405 C63.1036959,47.0992405 61.4944125,46.7892556 60.0566101,46.1824766 C58.6188078,45.5691022 57.3920589,44.7314834 56.3631728,43.6762156 C55.3408821,42.6143523 54.5560267,41.3810081 54.0086065,39.9695874 C53.4611863,38.5581667 53.1841785,37.0544101 53.1841785,35.4583175 L53.1841785,0.00131908476 L46.8789534,0.00131908476 L46.8789534,35.3198136 C46.8789534,37.2588682 47.2285108,39.092396 47.9210303,40.8203971 C48.6135498,42.5418027 49.6292451,44.0521547 50.9747116,45.3448578 C51.8321167,46.1692858 52.8280256,46.8618053 53.9426523,47.4619888 C55.4530043,48.2072717 58.5594489,49.3087075 62.7739248,48.6491651" id="Fill-7" fill="#FFFFFF"></path>
                    <mask id="mask-2" fill="white">
                        <use xlink:href="#path-1"></use>
                    </mask>
                    <g id="Clip-10"></g>
                    <polygon id="Fill-9" fill="#FFFFFF" mask="url(#mask-2)" points="141.907139 51.7516525 143.199842 51.7516525 143.199842 14.2170956 141.907139 14.2170956"></polygon>
                    <path d="M175.932271,37.916432 C171.368237,37.916432 168.037548,33.4843071 168.037548,27.396731 C168.037548,21.3421319 171.33526,18.2356873 174.962743,18.2356873 C179.203601,18.2356873 182.76513,21.8631704 182.76513,28.689434 C182.76513,34.9089187 179.526777,37.916432 175.932271,37.916432 M175.609095,17.0682973 C168.809213,17.0682973 164.733241,22.4765448 164.733241,28.300304 C164.733241,34.5197887 169.396206,39.083822 175.252942,39.083822 C181.175633,39.083822 186.062842,34.8099873 186.062842,27.8188381 C186.062842,21.3421319 181.109678,17.0682973 175.609095,17.0682973" id="Fill-11" fill="#FFFFFF" mask="url(#mask-2)"></path>
                    <path d="M200.496927,20.3719451 C200.496927,19.5013491 200.628835,19.1122191 200.85308,18.9473335 C201.110301,18.7560662 201.664317,18.6241578 202.600867,18.6241578 C205.06096,18.6241578 207.356167,19.9168608 207.356167,23.4124354 C207.356167,25.1602228 206.841724,26.4595212 205.581998,27.4290485 C204.770761,28.0754001 203.702303,28.3326216 202.053447,28.3326216 L200.496927,28.3326216 L200.496927,20.3719451 Z M203.379127,37.691528 C200.787125,37.4936653 200.496927,37.302398 200.496927,34.5521063 L200.496927,29.4010803 L201.532408,29.4010803 C203.214241,29.4010803 203.768257,29.7902103 204.315677,30.7003788 C205.285204,32.2832805 206.452594,34.2882893 207.587007,35.8777865 C209.044596,37.9817266 210.403253,38.6940324 212.830369,38.8193455 C213.219499,38.8523226 213.575652,38.8523226 213.964782,38.8523226 L214.090095,38.0147038 C213.377789,37.8168411 212.632506,37.4606882 211.76191,36.4911609 C210.98365,35.653542 210.304322,34.8093278 209.136932,33.1274947 C208.167405,31.6699061 206.808747,29.5000116 206.261327,28.431553 C208.655466,27.3960714 210.370276,25.6812612 210.370276,22.8979924 C210.370276,20.9523424 209.526062,19.5013491 208.233359,18.6571349 C207.000014,17.8458977 205.417113,17.5556991 203.055951,17.5556991 L195.02932,17.5556991 L195.02932,18.4592722 C197.548772,18.690112 197.812589,18.7890434 197.812589,21.5393351 L197.812589,34.5521063 C197.812589,37.302398 197.52239,37.4936653 194.864435,37.691528 L194.864435,38.5951011 L203.379127,38.5951011 L203.379127,37.691528 Z" id="Fill-12" fill="#FFFFFF" mask="url(#mask-2)"></path>
                    <path d="M230.045085,37.6895494 C227.393724,37.4982821 227.129908,37.3333965 227.129908,34.5501276 L227.129908,21.6033107 C227.129908,18.853019 227.393724,18.6551563 230.045085,18.463889 L230.045085,17.5537205 L221.464438,17.5537205 L221.464438,18.463889 C224.122394,18.6551563 224.379616,18.853019 224.379616,21.6033107 L224.379616,34.5501276 C224.379616,37.3004194 224.122394,37.4982821 221.464438,37.6895494 L221.464438,38.5931224 L230.045085,38.5931224 L230.045085,37.6895494 Z" id="Fill-13" fill="#FFFFFF" mask="url(#mask-2)"></path>
                    <path d="M252.861954,36.3955272 C252.149648,37.2397415 251.246075,37.496963 248.785982,37.496963 C247.163507,37.496963 246.029094,37.4639859 245.41572,37.0748559 C244.835323,36.6527487 244.63746,35.9734201 244.63746,34.4498772 L244.63746,28.3359193 L247.717523,28.3359193 C250.533769,28.3359193 250.758013,28.5271866 251.18012,30.8619666 L252.116671,30.8619666 L252.116671,24.642482 L251.18012,24.642482 C250.758013,26.8123764 250.593128,27.0695979 247.684546,27.0695979 L244.63746,27.0695979 L244.63746,19.7222958 C244.63746,18.7527685 244.703414,18.6868143 245.705919,18.6868143 L248.166012,18.6868143 C250.500792,18.6868143 251.371388,18.9176541 251.826472,19.5969828 C252.248579,20.3092885 252.571755,21.0215943 252.861954,22.3802516 L253.798504,22.215366 C253.706168,20.5665101 253.541282,18.3636385 253.541282,17.5589968 L239.103899,17.5589968 L239.103899,18.4625699 C241.629947,18.6868143 241.887168,18.7857456 241.887168,21.700923 L241.887168,34.5817857 C241.887168,37.2067643 241.629947,37.4639859 238.681792,37.6882303 L238.681792,38.5983988 L254.286565,38.5983988 C254.576764,37.5892989 255.223115,34.5488086 255.420978,33.4803499 L254.444855,33.3550368 C254.029344,34.6477399 253.409374,35.7491757 252.861954,36.3955272" id="Fill-14" fill="#FFFFFF" mask="url(#mask-2)"></path>
                    <path d="M285.874688,17.5556991 L278.237187,17.5556991 L278.237187,18.4592722 C280.46644,18.5911806 281.2447,19.0132878 281.409586,20.4708764 C281.501922,21.3744495 281.63383,22.8650153 281.63383,25.8395514 L281.63383,33.8068234 L281.534899,33.8068234 L268.040662,17.5556991 L263.245789,17.5556991 L263.245789,18.4592722 C264.769332,18.5911806 265.481637,18.8484022 266.127989,19.6596393 C266.714982,20.4378993 266.774341,20.5632124 266.774341,22.9309695 L266.774341,30.0474318 C266.774341,33.0285634 266.682005,34.578488 266.583073,35.5875878 C266.418188,37.1704895 265.613546,37.5925966 263.73385,37.691528 L263.73385,38.5951011 L271.404328,38.5951011 L271.404328,37.691528 C269.208052,37.5596195 268.462769,37.1704895 268.297883,35.5216336 C268.198952,34.578488 268.106616,33.0285634 268.106616,30.0474318 L268.106616,21.9284651 L268.165975,21.9284651 L281.957006,38.8852997 L282.959511,38.8852997 L282.959511,25.8395514 C282.959511,22.8320382 283.025465,21.3744495 283.157373,20.4049222 C283.282686,18.9803106 284.060946,18.5582035 285.874688,18.4592722 L285.874688,17.5556991 Z" id="Fill-15" fill="#FFFFFF" mask="url(#mask-2)"></path>
                    <path d="M301.763064,18.6887929 L301.763064,34.6167414 C301.763064,37.1691704 301.505842,37.4989416 298.557688,37.6902089 L298.557688,38.593782 L307.85064,38.593782 L307.85064,37.6902089 C304.770577,37.4989416 304.513356,37.1691704 304.513356,34.6167414 L304.513356,18.6887929 L306.815158,18.6887929 C309.242274,18.6887929 309.789695,18.9196327 310.310733,19.6912973 C310.699863,20.2123358 310.990062,21.0169775 311.346215,22.5734975 L312.282765,22.4745662 C312.117879,20.6014658 311.959589,18.2337087 311.959589,16.7497383 L311.28026,16.7497383 C310.759222,17.3631127 310.502,17.55438 309.631404,17.55438 L296.842878,17.55438 C295.939305,17.55438 295.517197,17.4950212 295.062113,16.7497383 L294.415762,16.7497383 C294.349807,18.5305027 294.191517,20.6344429 294.026632,22.5734975 L294.963182,22.5734975 C295.352312,21.148886 295.609533,20.2453129 295.998663,19.6912973 C296.420771,18.9460144 297.067122,18.6887929 299.758055,18.6887929 L301.763064,18.6887929 Z" id="Fill-16" fill="#FFFFFF" mask="url(#mask-2)"></path>
                    <path d="M327.816967,21.2781563 L327.882921,21.2781563 L330.732144,29.5290315 L324.776476,29.5290315 C325.746003,26.8776711 326.781485,24.0614251 327.816967,21.2781563 L327.816967,21.2781563 Z M324.868812,37.6875707 C322.441696,37.4633263 322.151497,37.1401506 322.863803,35.1021646 C323.28591,33.7435073 323.773972,32.3782546 324.288415,30.9272613 L331.180633,30.9272613 C331.892938,32.8992931 332.545885,34.6470804 332.961397,35.9068063 C333.383504,37.1731277 333.093306,37.4303492 331.05532,37.6875707 L331.05532,38.5977392 L338.983019,38.5977392 L338.983019,37.6875707 C336.879079,37.4963035 336.456972,37.2061048 335.42149,34.422836 C333.350527,28.790344 331.180633,22.6368136 329.175624,17.0702759 L328.173119,17.3604746 L321.472169,34.3568817 C320.337756,37.2061048 319.889267,37.3973721 317.844686,37.6875707 L317.844686,38.5977392 L324.868812,38.5977392 L324.868812,37.6875707 Z" id="Fill-17" fill="#FFFFFF" mask="url(#mask-2)"></path>
                    <path d="M360.407594,36.4918204 C359.662311,37.3360347 358.560875,37.4943248 356.780111,37.4943248 C355.421453,37.4943248 354.320018,37.4283706 353.673666,37.0722177 C353.093269,36.7490419 352.928383,36.1026904 352.928383,34.3549031 L352.928383,21.5729717 C352.928383,18.8160846 353.225177,18.6577944 355.777606,18.4599317 L355.777606,17.5563586 L347.328868,17.5563586 L347.328868,18.4599317 C349.953847,18.6577944 350.178091,18.8160846 350.178091,21.5729717 L350.178091,34.5197887 C350.178091,37.2700804 349.92087,37.4943248 347.203555,37.6921875 L347.203555,38.5957606 L361.865182,38.5957606 C362.155381,37.5932562 362.83471,34.5197887 363.032572,33.5106888 L362.05645,33.3194216 C361.574984,34.8099873 360.955014,35.8454689 360.407594,36.4918204" id="Fill-18" fill="#FFFFFF" mask="url(#mask-2)"></path>
                    <path d="M206.077315,45.7940062 C206.994079,45.8599604 207.271086,46.0182506 207.350232,46.5260982 C207.402995,46.9350145 207.442567,47.4890301 207.442567,48.6959926 L207.442567,49.6919016 C207.442567,51.8552006 206.848979,53.4315069 204.962688,53.4315069 C203.333618,53.4315069 202.496,52.2245444 202.496,50.1140087 L202.496,47.1196863 C202.496,45.9391055 202.601526,45.8599604 203.637008,45.7940062 L203.637008,45.4246624 L200.240365,45.4246624 L200.240365,45.7940062 C201.275846,45.8863421 201.381373,45.9391055 201.381373,47.1196863 L201.381373,50.397612 C201.381373,51.9343457 201.744121,52.9170639 202.535572,53.5238429 C203.109374,53.9657363 203.874443,54.1504081 204.632917,54.1504081 C205.503513,54.1504081 206.380704,53.8799957 206.980888,53.2468351 C207.745957,52.4487888 207.983392,51.3341622 207.983392,49.7842376 L207.983392,48.6959926 C207.983392,47.4890301 208.003178,46.9218236 208.042751,46.5656707 C208.108705,46.0314414 208.412095,45.8467695 209.203546,45.7940062 L209.203546,45.4246624 L206.077315,45.4246624 L206.077315,45.7940062 Z" id="Fill-19" fill="#FFFFFF" mask="url(#mask-2)"></path>
                    <path d="M215.485687,49.7954498 L214.859122,49.7954498 L214.859122,46.5702875 C214.859122,46.2141346 214.905289,46.0558445 214.997625,45.9898902 C215.103152,45.9107452 215.327397,45.8579818 215.709931,45.8579818 C216.70584,45.8579818 217.635795,46.3856157 217.635795,47.8036318 C217.635795,48.5093421 217.424741,49.036976 216.916894,49.426106 C216.587123,49.689923 216.151825,49.7954498 215.485687,49.7954498 M218.361292,51.7410998 C217.965566,51.1475117 217.411551,50.2703203 217.193902,49.8350223 C218.163429,49.4129152 218.855948,48.7203957 218.855948,47.5925782 C218.855948,46.8011274 218.519582,46.2141346 217.991948,45.8711726 C217.490696,45.5414014 216.85094,45.4226838 215.894603,45.4226838 L212.636464,45.4226838 L212.636464,45.7920275 C213.658754,45.8843635 213.764281,45.923936 213.764281,47.0385626 L213.764281,52.3149017 C213.764281,53.4295283 213.645564,53.5086734 212.570509,53.5878185 L212.570509,53.9571622 L216.026512,53.9571622 L216.026512,53.5878185 C214.971244,53.5086734 214.859122,53.4295283 214.859122,52.3149017 L214.859122,50.2307477 L215.274633,50.2307477 C215.960557,50.2307477 216.178206,50.3890379 216.402451,50.7517862 C216.798176,51.3981378 217.273047,52.2093749 217.728131,52.8557264 C218.321719,53.7065361 218.869139,53.9967347 219.858453,54.0494981 C220.010148,54.062689 220.155247,54.062689 220.313537,54.062689 L220.3663,53.7197269 C220.076102,53.6405819 219.779308,53.4954825 219.423155,53.0997571 C219.106574,52.7633905 218.829567,52.4204285 218.361292,51.7410998" id="Fill-20" fill="#FFFFFF" mask="url(#mask-2)"></path>
                    <path d="M226.730225,53.5099925 C225.892606,53.5099925 225.64198,53.2593664 225.64198,52.3162208 L225.64198,49.6384787 L226.242163,49.6384787 C227.844851,49.6384787 228.761615,50.2320668 228.761615,51.5841287 C228.761615,52.942786 227.805279,53.4968016 226.730225,53.5099925 L226.730225,53.5099925 Z M225.64198,46.6309654 C225.64198,46.2022629 225.694743,46.0571636 225.813461,45.9780185 C225.945369,45.8988734 226.228973,45.84611 226.558744,45.84611 C227.805279,45.84611 228.306531,46.6309654 228.306531,47.5279431 C228.306531,48.6293788 227.699752,49.2031807 226.255354,49.2031807 L225.64198,49.2031807 L225.64198,46.6309654 Z M227.739325,49.3614709 L227.739325,49.3218983 C228.478012,49.1240356 229.513494,48.616188 229.513494,47.3696529 C229.513494,46.7628739 229.249677,46.189072 228.774806,45.8724917 C228.372485,45.582293 227.792088,45.4240029 226.80937,45.4240029 L223.439108,45.4240029 L223.439108,45.7933466 C224.487781,45.8724917 224.540544,45.9516368 224.540544,47.0398817 L224.540544,52.3294116 C224.540544,53.4308474 224.461399,53.5099925 223.333582,53.5891376 L223.333582,53.9584813 L226.228973,53.9584813 C227.27105,53.9584813 228.13505,53.8001911 228.801188,53.4308474 C229.579448,52.9955494 230.060914,52.3294116 230.060914,51.4522202 C230.060914,50.1397309 229.038623,49.5593336 227.739325,49.3614709 L227.739325,49.3614709 Z" id="Fill-21" fill="#FFFFFF" mask="url(#mask-2)"></path>
                    <path d="M235.955904,50.2815325 C236.351629,49.2064784 236.767141,48.0654701 237.189248,46.9376526 L237.21563,46.9376526 L238.369829,50.2815325 L235.955904,50.2815325 Z M240.275906,52.2667551 C239.431692,49.978143 238.554501,47.4850728 237.743264,45.2294379 L237.334347,45.3481555 L234.617033,52.2403734 C234.155353,53.3945726 233.977277,53.4671222 233.146253,53.5858398 L233.146253,53.9551836 L235.995476,53.9551836 L235.995476,53.5858398 C235.012758,53.5000993 234.89404,53.3681909 235.184239,52.5371675 C235.35572,51.9897473 235.546987,51.4357317 235.758041,50.848739 L238.554501,50.848739 C238.844699,51.6467852 239.101921,52.3524956 239.273402,52.8669386 C239.444883,53.3813817 239.326165,53.4803131 238.501737,53.5858398 L238.501737,53.9551836 L241.713709,53.9551836 L241.713709,53.5858398 C240.862899,53.5132902 240.691418,53.3945726 240.275906,52.2667551 L240.275906,52.2667551 Z" id="Fill-22" fill="#FFFFFF" mask="url(#mask-2)"></path>
                    <path d="M250.914984,45.7940062 C251.818557,45.8467695 252.135138,46.0182506 252.201092,46.6052433 C252.240665,46.974587 252.293428,47.581366 252.293428,48.7883286 L252.293428,52.0134908 L252.253855,52.0134908 L246.779654,45.4246624 L244.840599,45.4246624 L244.840599,45.7940062 C245.453973,45.8467695 245.744172,45.9522963 246.007989,46.2820675 C246.245424,46.5920524 246.271806,46.6448158 246.271806,47.6011523 L246.271806,50.4899479 C246.271806,51.6969105 246.232233,52.3300711 246.192661,52.732392 C246.126707,53.3787435 245.796936,53.5502246 245.038462,53.5897971 L245.038462,53.9525454 L248.144906,53.9525454 L248.144906,53.5897971 C247.254524,53.5370337 246.951135,53.3787435 246.88518,52.7060103 C246.845608,52.3300711 246.806035,51.6969105 246.806035,50.4899479 L246.806035,47.1988314 L246.832417,47.1988314 L252.425336,54.071263 L252.834253,54.071263 L252.834253,48.7883286 C252.834253,47.5681752 252.854039,46.974587 252.906802,46.5788616 C252.959566,46.0050597 253.276146,45.8335787 254.014834,45.7940062 L254.014834,45.4246624 L250.914984,45.4246624 L250.914984,45.7940062 Z" id="Fill-23" fill="#FFFFFF" mask="url(#mask-2)"></path>
                    <path d="M266.739385,53.4829512 C265.783048,53.4829512 265.34775,53.2323251 265.34775,52.2364161 L265.34775,46.7754052 C265.34775,46.2675576 265.387323,46.1224583 265.519231,46.0301223 C265.65114,45.9377864 265.994102,45.8718322 266.541522,45.8718322 C267.418713,45.8718322 268.183783,46.0301223 268.770775,46.4126569 C269.826043,47.0260313 270.3207,48.1934213 270.3207,49.5454832 C270.3207,51.6494234 269.192882,53.4829512 266.739385,53.4829512 M266.792148,45.4233433 L263.105306,45.4233433 L263.105306,45.8058779 C264.114406,45.885023 264.219933,45.9377864 264.219933,47.0656039 L264.219933,52.3287521 C264.219933,53.4433787 264.114406,53.5225238 262.986589,53.6016689 L262.986589,53.9578217 L266.093033,53.9578217 C267.708912,53.9578217 269.008211,53.6280506 269.990929,52.8695768 C271.006624,52.1045077 271.606808,50.9371176 271.606808,49.3608113 C271.606808,48.1274671 271.151723,47.1711306 270.505372,46.5445654 C269.694135,45.7663054 268.46079,45.4233433 266.792148,45.4233433" id="Fill-24" fill="#FFFFFF" mask="url(#mask-2)"></path>
                    <path d="M280.832486,53.0634823 C280.542288,53.4064443 280.172944,53.5119711 279.177035,53.5119711 C278.524088,53.5119711 278.062408,53.4987802 277.811782,53.3404901 C277.580942,53.1690091 277.501797,52.8920013 277.501797,52.2786268 L277.501797,49.7987475 L278.748332,49.7987475 C279.889341,49.7987475 279.981677,49.8778926 280.153158,50.8210382 L280.529097,50.8210382 L280.529097,48.3015863 L280.153158,48.3015863 C279.981677,49.1787777 279.915722,49.2843044 278.735142,49.2843044 L277.501797,49.2843044 L277.501797,46.3031729 C277.501797,45.9140429 277.528179,45.8876612 277.9305,45.8876612 L278.933004,45.8876612 C279.87615,45.8876612 280.232303,45.9799971 280.410379,46.2504095 C280.58186,46.5406081 280.713769,46.8308068 280.832486,47.3848224 L281.215021,47.3188681 C281.175448,46.6461349 281.109494,45.7557527 281.109494,45.4259815 L275.252758,45.4259815 L275.252758,45.7953252 C276.281644,45.8876612 276.387171,45.9272337 276.387171,47.1078146 L276.387171,52.3313902 C276.387171,53.3932535 276.281644,53.4987802 275.087872,53.5911162 L275.087872,53.9538645 L281.412884,53.9538645 C281.525006,53.5515436 281.788823,52.3181994 281.867968,51.8829014 L281.472242,51.830138 C281.307357,52.3577719 281.056731,52.7996653 280.832486,53.0634823" id="Fill-25" fill="#FFFFFF" mask="url(#mask-2)"></path>
                    <path d="M290.686709,45.7940062 C291.748572,45.9259146 291.827717,46.0314414 291.577091,46.7767243 C291.16158,48.0892136 290.159075,50.6482381 289.506128,52.2904986 L289.479747,52.2904986 C288.602555,50.0348637 287.639623,47.5022209 287.303257,46.5656707 C287.092203,45.9918689 287.144966,45.8995329 288.074921,45.7940062 L288.074921,45.4246624 L284.86295,45.4246624 L284.86295,45.807197 C285.634614,45.8731512 285.845668,45.978678 286.228203,46.9613962 C286.986676,48.8608782 288.06173,51.6837196 288.938922,54.0844539 L289.347838,54.0844539 C290.330556,51.3803301 291.722191,48.0496411 292.078343,47.1988314 C292.573,46.0182506 292.744481,45.8995329 293.641459,45.7940062 L293.641459,45.4246624 L290.686709,45.4246624 L290.686709,45.7940062 Z" id="Fill-26" fill="#FFFFFF" mask="url(#mask-2)"></path>
                    <path d="M302.602002,53.0634823 C302.311803,53.4064443 301.942459,53.5119711 300.94655,53.5119711 C300.293603,53.5119711 299.831924,53.4987802 299.581298,53.3404901 C299.350458,53.1690091 299.271313,52.8920013 299.271313,52.2786268 L299.271313,49.7987475 L300.517848,49.7987475 C301.658856,49.7987475 301.751192,49.8778926 301.922673,50.8210382 L302.298612,50.8210382 L302.298612,48.3015863 L301.922673,48.3015863 C301.751192,49.1787777 301.685238,49.2843044 300.504657,49.2843044 L299.271313,49.2843044 L299.271313,46.3031729 C299.271313,45.9140429 299.297694,45.8876612 299.700015,45.8876612 L300.70252,45.8876612 C301.645665,45.8876612 302.001818,45.9799971 302.179895,46.2504095 C302.351376,46.5406081 302.483284,46.8308068 302.602002,47.3848224 L302.984536,47.3188681 C302.944964,46.6461349 302.87901,45.7557527 302.87901,45.4259815 L297.022273,45.4259815 L297.022273,45.7953252 C298.051159,45.8876612 298.156686,45.9272337 298.156686,47.1078146 L298.156686,52.3313902 C298.156686,53.3932535 298.051159,53.4987802 296.857388,53.5911162 L296.857388,53.9538645 L303.182399,53.9538645 C303.294521,53.5515436 303.558338,52.3181994 303.637483,51.8829014 L303.241758,51.830138 C303.076872,52.3577719 302.826246,52.7996653 302.602002,53.0634823" id="Fill-27" fill="#FFFFFF" mask="url(#mask-2)"></path>
                    <path d="M312.377739,53.1030548 C312.074349,53.4460169 311.632456,53.5119711 310.906959,53.5119711 C310.359539,53.5119711 309.91105,53.4855894 309.647233,53.3404901 C309.409798,53.2085816 309.343844,52.9447646 309.343844,52.2390543 L309.343844,47.0550512 C309.343844,45.9404246 309.462562,45.8744703 310.498043,45.7953252 L310.498043,45.4259815 L307.075018,45.4259815 L307.075018,45.7953252 C308.136881,45.8744703 308.229217,45.9404246 308.229217,47.0550512 L308.229217,52.3050085 C308.229217,53.4196352 308.123691,53.5119711 307.022255,53.5911162 L307.022255,53.9538645 L312.971327,53.9538645 C313.083449,53.5515436 313.360457,52.3050085 313.439602,51.8960923 L313.043877,51.8169472 C312.852609,52.4237262 312.601983,52.8392379 312.377739,53.1030548" id="Fill-28" fill="#FFFFFF" mask="url(#mask-2)"></path>
                    <path d="M321.247924,53.6808139 C319.39461,53.6808139 318.049144,51.8802632 318.049144,49.4135747 C318.049144,46.9600771 319.381419,45.7003511 320.852199,45.7003511 C322.573605,45.7003511 324.018002,47.1711306 324.018002,49.9412086 C324.018002,52.4606605 322.705513,53.6808139 321.247924,53.6808139 M321.116016,45.232076 C318.359129,45.232076 316.710273,47.4217567 316.710273,49.7829185 C316.710273,52.3023704 318.596564,54.1556845 320.970917,54.1556845 C323.371651,54.1556845 325.356873,52.421088 325.356873,49.5850558 C325.356873,46.9600771 323.345269,45.232076 321.116016,45.232076" id="Fill-29" fill="#FFFFFF" mask="url(#mask-2)"></path>
                    <path d="M332.17852,49.9933125 C331.743222,49.9933125 331.393665,49.9009766 331.222184,49.8350223 L331.222184,46.6230509 C331.222184,46.2537072 331.261756,46.095417 331.367283,46.0030811 C331.459619,45.9107452 331.730031,45.8447909 332.099375,45.8447909 C333.174429,45.8447909 334.078002,46.4515699 334.078002,47.869586 C334.078002,49.5316328 333.02933,49.9933125 332.17852,49.9933125 M334.486919,45.9766994 C333.96588,45.580974 333.214002,45.4292792 332.284047,45.4292792 L329.039099,45.4292792 L329.039099,45.7920275 C330.015221,45.8579818 330.120748,45.9107452 330.120748,47.0649443 L330.120748,52.3149017 C330.120748,53.4031466 330.015221,53.5086734 328.966549,53.5878185 L328.966549,53.9571622 L332.521482,53.9571622 L332.521482,53.5878185 C331.340901,53.5086734 331.222184,53.4427191 331.222184,52.3280925 L331.222184,50.2703203 L332.191711,50.5209464 C332.33681,50.5341372 332.587437,50.5341372 332.778704,50.5209464 C334.058216,50.3494654 335.337728,49.518442 335.337728,47.8300135 C335.337728,46.9594175 335.001362,46.359234 334.486919,45.9766994" id="Fill-30" fill="#FFFFFF" mask="url(#mask-2)"></path>
                    <path d="M348.527916,52.0266817 L348.396008,47.2779765 C348.356435,45.9259146 348.448771,45.8995329 349.60297,45.7940062 L349.60297,45.4246624 L347.373717,45.4246624 L344.339822,51.9871091 L341.352095,45.4246624 L339.195392,45.4246624 L339.195392,45.7940062 C340.389163,45.9127238 340.455118,45.9654872 340.3364,47.6671065 L340.158324,50.397612 C340.052797,51.7628647 339.973652,52.343262 339.907697,52.7983462 C339.815362,53.3523618 339.551545,53.4974612 338.793071,53.5897971 L338.793071,53.9525454 L341.846752,53.9525454 L341.846752,53.5897971 C340.982752,53.4974612 340.666171,53.4051252 340.639789,52.7719645 C340.626599,52.2509261 340.626599,51.6705288 340.679362,50.5954747 L340.877225,46.8558694 L340.903606,46.8558694 L343.845165,53.8668049 L344.108982,53.8668049 L347.307763,46.6711975 L347.360526,46.6711975 L347.400099,52.0266817 C347.41329,53.4183161 347.360526,53.4842703 346.298663,53.5897971 L346.298663,53.9525454 L349.74807,53.9525454 L349.74807,53.5897971 C348.607061,53.4842703 348.567489,53.4183161 348.527916,52.0266817" id="Fill-31" fill="#FFFFFF" mask="url(#mask-2)"></path>
                    <path d="M358.894604,53.0634823 C358.604405,53.4064443 358.235061,53.5119711 357.239152,53.5119711 C356.586205,53.5119711 356.124526,53.4987802 355.873899,53.3404901 C355.64306,53.1690091 355.563914,52.8920013 355.563914,52.2786268 L355.563914,49.7987475 L356.81045,49.7987475 C357.951458,49.7987475 358.043794,49.8778926 358.215275,50.8210382 L358.591214,50.8210382 L358.591214,48.3015863 L358.215275,48.3015863 C358.043794,49.1787777 357.97784,49.2843044 356.797259,49.2843044 L355.563914,49.2843044 L355.563914,46.3031729 C355.563914,45.9140429 355.590296,45.8876612 355.992617,45.8876612 L356.995121,45.8876612 C357.938267,45.8876612 358.29442,45.9799971 358.472496,46.2504095 C358.643977,46.5406081 358.775886,46.8308068 358.894604,47.3848224 L359.277138,47.3188681 C359.237566,46.6461349 359.171611,45.7557527 359.171611,45.4259815 L353.314875,45.4259815 L353.314875,45.7953252 C354.343761,45.8876612 354.449288,45.9272337 354.449288,47.1078146 L354.449288,52.3313902 C354.449288,53.3932535 354.343761,53.4987802 353.149989,53.5911162 L353.149989,53.9538645 L359.475001,53.9538645 C359.587123,53.5515436 359.85094,52.3181994 359.930085,51.8829014 L359.53436,51.830138 C359.369474,52.3577719 359.118848,52.7996653 358.894604,53.0634823" id="Fill-32" fill="#FFFFFF" mask="url(#mask-2)"></path>
                    <path d="M369.182146,45.7940062 C370.085719,45.8467695 370.402299,46.0182506 370.468253,46.6052433 C370.507826,46.974587 370.560589,47.581366 370.560589,48.7883286 L370.560589,52.0134908 L370.521017,52.0134908 L365.046815,45.4246624 L363.10776,45.4246624 L363.10776,45.7940062 C363.721135,45.8467695 364.011333,45.9522963 364.27515,46.2820675 C364.512586,46.5920524 364.538967,46.6448158 364.538967,47.6011523 L364.538967,50.4899479 C364.538967,51.6969105 364.499395,52.3300711 364.459822,52.732392 C364.393868,53.3787435 364.064097,53.5502246 363.305623,53.5897971 L363.305623,53.9525454 L366.412068,53.9525454 L366.412068,53.5897971 C365.521685,53.5370337 365.218296,53.3787435 365.152342,52.7060103 C365.112769,52.3300711 365.073197,51.6969105 365.073197,50.4899479 L365.073197,47.1988314 L365.099578,47.1988314 L370.692498,54.071263 L371.101414,54.071263 L371.101414,48.7883286 C371.101414,47.5681752 371.1212,46.974587 371.173964,46.5788616 C371.226727,46.0050597 371.543307,45.8335787 372.281995,45.7940062 L372.281995,45.4246624 L369.182146,45.4246624 L369.182146,45.7940062 Z" id="Fill-33" fill="#FFFFFF" mask="url(#mask-2)"></path>
                    <path d="M382.57943,45.0988485 C382.368376,45.3494746 382.26285,45.4286197 381.913292,45.4286197 L376.729289,45.4286197 C376.359945,45.4286197 376.188464,45.402238 376.003792,45.0988485 L375.739975,45.0988485 C375.713594,45.8177497 375.64764,46.6751548 375.588281,47.4600102 L375.96422,47.4600102 C376.12251,46.8862083 376.228037,46.5168646 376.386327,46.2926202 C376.557808,45.9892307 376.821625,45.8837039 377.90987,45.8837039 L378.721107,45.8837039 L378.721107,52.3406238 C378.721107,53.3761054 378.61558,53.5080138 377.421809,53.5871589 L377.421809,53.9565027 L381.187796,53.9565027 L381.187796,53.5871589 C379.94126,53.5080138 379.835734,53.3761054 379.835734,52.3406238 L379.835734,45.8837039 L380.765688,45.8837039 C381.755002,45.8837039 381.979246,45.9760398 382.183705,46.2926202 C382.341995,46.5036738 382.460712,46.8334449 382.605812,47.4600102 L382.988346,47.4204377 C382.922392,46.6619639 382.856438,45.699032 382.856438,45.0988485 L382.57943,45.0988485 Z" id="Fill-34" fill="#FFFFFF" mask="url(#mask-2)"></path>
                    <path d="M382.986368,32.5569906 C382.986368,29.0943931 380.150335,27.6170181 377.41983,26.2781471 C374.801447,25.0118257 373.317476,23.9367716 373.317476,21.7273047 C373.317476,20.005899 374.451889,18.3108751 376.859219,18.3108751 C379.569938,18.3108751 380.559252,20.5862963 381.113267,22.604496 L382.082795,22.433015 C381.805787,20.3686474 381.654092,19.0825397 381.522184,17.9613177 C380.321816,17.5787831 378.884014,17.2094394 377.353876,17.2094394 C373.165782,17.2094394 370.626543,19.8146318 370.626543,22.9474581 C370.626543,26.4100556 373.700011,27.9797664 375.93586,29.0943931 C378.389357,30.3870961 380.104167,31.4621502 380.104167,33.7375714 C380.104167,35.9932064 378.732319,37.4376042 376.390944,37.4376042 C373.099827,37.4376042 371.530116,34.1464877 370.995887,32.1480743 L370.02636,32.4250821 C370.224223,33.9552204 370.692498,36.8110389 370.910147,37.4376042 C371.233322,37.5827035 371.681811,37.8465205 372.499644,38.103742 C373.317476,38.3807498 374.39253,38.618185 375.724806,38.618185 C380.104167,38.618185 382.986368,35.9272521 382.986368,32.5569906" id="Fill-35" fill="#FFFFFF" mask="url(#mask-2)"></path>
                    <path d="M165.530628,45.4365342 L165.530628,45.8256642 C166.546323,45.8916184 166.658445,45.9641681 166.658445,47.098581 L166.658445,52.1242939 C166.658445,53.2718977 166.546323,53.3576382 165.497651,53.4367833 L165.497651,53.806127 L169.197683,53.806127 L169.197683,53.4367833 C167.997316,53.3510428 167.878599,53.2718977 167.878599,52.1242939 L167.878599,49.8818498 L169.197683,49.8818498 C170.404646,49.8818498 170.477196,50.0203537 170.635486,50.9173314 L171.031211,50.9173314 L171.031211,48.3846886 L170.642081,48.3846886 C170.477196,49.2223074 170.404646,49.3410251 169.197683,49.3410251 L167.878599,49.3410251 L167.878599,46.3335118 C167.878599,45.9443818 167.918171,45.9114047 168.327087,45.9114047 L169.290019,45.9114047 C170.266142,45.9114047 170.549745,46.0235269 170.77399,46.3862752 C170.971852,46.6434967 171.057593,46.9205045 171.169715,47.4349476 L171.565441,47.3755888 C171.506082,46.7292372 171.446723,45.9114047 171.426937,45.4365342 L165.530628,45.4365342 Z" id="Fill-36" fill="#FFFFFF" mask="url(#mask-2)"></path>
                    <path d="M179.158752,53.5238429 C177.265865,53.5238429 175.867635,51.736483 175.867635,49.3687259 C175.867635,46.9350145 177.272461,45.7280519 178.756431,45.7280519 L178.763027,45.7280519 C180.497623,45.7280519 181.994784,47.1526635 181.994784,49.8567872 C181.994784,52.343262 180.636127,53.5238429 179.158752,53.5238429 M179.04663,45.2399906 L179.033439,45.2399906 C176.17762,45.2399906 174.423238,47.3703124 174.423238,49.7050925 C174.423238,52.1849718 176.395269,54.0053088 178.868553,54.0053088 C181.368219,54.0053088 183.452373,52.2904986 183.452373,49.5072298 C183.452373,46.9350145 181.355028,45.2399906 179.04663,45.2399906" id="Fill-37" fill="#FFFFFF" mask="url(#mask-2)"></path>
                    <path d="M190.639406,49.3614709 C190.30304,49.6252878 189.861146,49.7308146 189.201604,49.7308146 L188.614611,49.7308146 L188.614611,46.5650112 C188.614611,46.2286446 188.667374,46.0769498 188.75971,46.0109956 C188.852046,45.9384459 189.0631,45.8856825 189.458825,45.8856825 C190.434948,45.8856825 191.345117,46.3935302 191.345117,47.7785692 C191.345117,48.4710887 191.140658,48.9723409 190.639406,49.3614709 M192.162949,51.6171058 C191.767224,51.0235177 191.226399,50.1793034 191.002154,49.7571963 C191.938705,49.3614709 192.664201,48.6953331 192.664201,47.574111 C192.664201,46.7892556 192.327835,46.2220492 191.793605,45.8856825 C191.292353,45.5493159 190.646002,45.4371937 189.656688,45.4371937 L186.279831,45.4371937 L186.279831,45.8263237 C187.302122,45.892278 187.420839,45.9648276 187.420839,47.0662634 L187.420839,52.1711214 C187.420839,53.2527709 187.295526,53.3451069 186.227068,53.4374428 L186.227068,53.8067865 L189.795192,53.8067865 L189.795192,53.4374428 C188.739924,53.3451069 188.614611,53.2527709 188.614611,52.1711214 L188.614611,50.1595172 L188.983955,50.1595172 C189.663283,50.1595172 189.894123,50.3178073 190.131559,50.6871511 C190.527284,51.3071209 190.955987,52.0919763 191.404475,52.7119462 C192.011254,53.5561604 192.558675,53.8397637 193.620538,53.892527 C193.778828,53.9123133 193.930523,53.9189087 194.088813,53.9189087 L194.148172,53.5561604 C193.851378,53.4902062 193.561179,53.3451069 193.224812,52.9691677 C192.921423,52.6525874 192.63782,52.2898391 192.162949,51.6171058" id="Fill-38" fill="#FFFFFF" mask="url(#mask-2)"></path>
                </g>
            </g>
        </g>
    </g>
</svg>