{
  "success": true,
  "data": [
    {
      "id": "36",
      "seo_h1": "",
      "name": "iPhone 11 Pro Max",
      "manufacturer": "Apple",
      "sku": "",
      "model": "iPhone 11 Pro Max",
      "image": "http://194.5.207.136/image/cache/catalog/Apple/8-500x500.png",
      "images": [
        "http://194.5.207.136/image/cache/catalog/demo/ipod_nano_3-500x500.jpg",
        "http://194.5.207.136/image/cache/catalog/demo/ipod_nano_2-500x500.jpg",
        "http://194.5.207.136/image/cache/catalog/demo/ipod_nano_4-500x500.jpg",
        "http://194.5.207.136/image/cache/catalog/demo/ipod_nano_5-500x500.jpg"
      ],
      "price": "122.00",
      "price_formated": "$122.00",
      "rating": 0,
      "description": "<div>\r\n\t<p><span style=\"font-family: AvenirNextLTPro-Regular, Calibri, Arial, sans-serif; font-size: 16px; letter-spacing: -0.2px;\">Shoot amazing videos and photos with the Ultra Wide, Wide and Telephoto cameras. Capture your best low-light photos with Night mode. Watch HDR movies and shows on the 6.5-inch Super Retina XDR display — the brightest iPhone display yet.&nbsp;Experience unprecedented performance with A13 Bionic for gaming, augmented reality and photography. And get all-day battery life&nbsp;and a new level of water resistance.&nbsp;All in the first iPhone powerful enough to be called Pro.</span><br></p>\r\n</div>\r\n",
      "attribute_groups": [],
      "special": "",
      "special_formated": "",
      "special_start_date": "",
      "special_end_date": "",
      "discounts": [],
      "options": [],
      "minimum": "1",
      "meta_title": "iPhone 11 Pro Max",
      "meta_description": "",
      "meta_keyword": "",
      "tag": "",
      "upc": "",
      "ean": "",
      "jan": "",
      "isbn": "",
      "mpn": "",
      "location": "",
      "stock_status": "2-3 Days",
      "manufacturer_id": "8",
      "tax_class_id": "9",
      "date_available": "2009-02-03",
      "weight": "5.00000000",
      "weight_class_id": "1",
      "length": "0.00000000",
      "width": "0.00000000",
      "height": "0.00000000",
      "length_class_id": "2",
      "subtract": "1",
      "sort_order": "0",
      "status": "1",
      "date_added": "2009-02-03 18:09:19",
      "date_modified": "2020-08-18 19:22:16",
      "viewed": "0",
      "weight_class": "kg",
      "length_class": "mm",
      "reward": null,
      "points": "100",
      "category": [
        {
          "name": "Apple Shop",
          "id": "59"
        }
      ],
      "quantity": "994",
      "reviews": {
        "review_total": "0"
      }
    },
    {
      "id": "40",
      "seo_h1": "",
      "name": "iPhone XR",
      "manufacturer": "Apple",
      "sku": "",
      "model": "iPhone XR",
      "image": "http://194.5.207.136/image/cache/catalog/Apple/6-500x500.png",
      "images": [
        "http://194.5.207.136/image/cache/catalog/demo/iphone_4-500x500.jpg",
        "http://194.5.207.136/image/cache/catalog/demo/iphone_3-500x500.jpg",
        "http://194.5.207.136/image/cache/catalog/demo/iphone_5-500x500.jpg",
        "http://194.5.207.136/image/cache/catalog/demo/iphone_2-500x500.jpg",
        "http://194.5.207.136/image/cache/catalog/demo/iphone_6-500x500.jpg"
      ],
      "price": "123.20",
      "price_formated": "$123.20",
      "rating": 0,
      "description": "<p class=\"intro\"><span style=\"font-family: AvenirNextLTPro-Regular, Calibri, Arial, sans-serif; font-size: 16px; letter-spacing: -0.2px;\">iPhone XR features a 6.1-inch Liquid Retina display. Advanced Face ID lets you securely unlock your iPhone and log in to apps with just a glance. The A12 Bionic chip uses real-time machine learning to transform the way you experience photos, gaming, augmented reality and more. A 12-megapixel camera system with Portrait mode, Portrait Lighting, enhanced bokeh and Depth Control for studio-quality portraits. And a water-resistant design.</span><br></p>\r\n",
      "attribute_groups": [],
      "special": "",
      "special_formated": "",
      "special_start_date": "",
      "special_end_date": "",
      "discounts": [],
      "options": [],
      "minimum": "1",
      "meta_title": "iPhone XR",
      "meta_description": "",
      "meta_keyword": "",
      "tag": "",
      "upc": "",
      "ean": "",
      "jan": "",
      "isbn": "",
      "mpn": "",
      "location": "",
      "stock_status": "Out Of Stock",
      "manufacturer_id": "8",
      "tax_class_id": "9",
      "date_available": "2009-02-03",
      "weight": "10.00000000",
      "weight_class_id": "1",
      "length": "0.00000000",
      "width": "0.00000000",
      "height": "0.00000000",
      "length_class_id": "1",
      "subtract": "1",
      "sort_order": "0",
      "status": "1",
      "date_added": "2009-02-03 21:07:12",
      "date_modified": "2020-08-18 19:18:29",
      "viewed": "2",
      "weight_class": "kg",
      "length_class": "cm",
      "reward": null,
      "points": "0",
      "category": [
        {
          "name": "Apple Shop",
          "id": "59"
        }
      ],
      "quantity": "970",
      "reviews": {
        "review_total": "0"
      }
    }
  ]
}