................
----------------------------------------------------------------------
Ran 16 tests in 0.567s

OK
Name             Stmts   Miss Branch BrPart  Cover   Missing
------------------------------------------------------------
Collatz.py          73      0     34      0   100%
TestCollatz.py      74      0      0      0   100%
------------------------------------------------------------
TOTAL              147      0     34      0   100%
