<?xml version="1.0" encoding="UTF-8"?>
<!DOCTYPE svg PUBLIC "-//W3C//DTD SVG 1.1//EN" "http://www.w3.org/Graphics/SVG/1.1/DTD/svg11.dtd">
<svg xmlns="http://www.w3.org/2000/svg" xmlns:xlink="http://www.w3.org/1999/xlink" version="1.1" width="1061px"
    height="322px" viewBox="-0.5 -0.5 1061 322" style="background-color: rgb(255, 255, 255);">
    <defs />
    <g>
        <rect x="0" y="160" width="150" height="60" rx="9" ry="9" fill="rgb(255, 255, 255)" stroke="rgb(0, 0, 0)"
            pointer-events="all" />
        <g transform="translate(-0.5 -0.5)">
            <switch>
                <foreignObject pointer-events="none" width="100%" height="100%"
                    requiredFeatures="http://www.w3.org/TR/SVG11/feature#Extensibility"
                    style="overflow: visible; text-align: left;">
                    <div xmlns="http://www.w3.org/1999/xhtml"
                        style="display: flex; align-items: unsafe center; justify-content: unsafe center; width: 148px; height: 1px; padding-top: 190px; margin-left: 1px;">
                        <div data-drawio-colors="color: rgb(0, 0, 0); "
                            style="box-sizing: border-box; font-size: 0px; text-align: center;">
                            <div
                                style="display: inline-block; font-size: 12px; font-family: Helvetica; color: rgb(0, 0, 0); line-height: 1.2; pointer-events: all; white-space: normal; overflow-wrap: normal;">
                                Perform registry based<br style="border-color: var(--border-color);" /><span
                                    style=""> cleanups (manual run)</span></div>
                        </div>
                    </div>
                </foreignObject><text x="75" y="194" fill="rgb(0, 0, 0)" font-family="Helvetica" font-size="12px"
                    text-anchor="middle">Perform registry based...</text>
            </switch>
        </g>
        <rect x="15" y="240" width="120" height="60" rx="9" ry="9" fill="rgb(255, 255, 255)" stroke="rgb(0, 0, 0)"
            pointer-events="all" />
        <g transform="translate(-0.5 -0.5)">
            <switch>
                <foreignObject pointer-events="none" width="100%" height="100%"
                    requiredFeatures="http://www.w3.org/TR/SVG11/feature#Extensibility"
                    style="overflow: visible; text-align: left;">
                    <div xmlns="http://www.w3.org/1999/xhtml"
                        style="display: flex; align-items: unsafe center; justify-content: unsafe center; width: 118px; height: 1px; padding-top: 270px; margin-left: 16px;">
                        <div data-drawio-colors="color: rgb(0, 0, 0); "
                            style="box-sizing: border-box; font-size: 0px; text-align: center;">
                            <div
                                style="display: inline-block; font-size: 12px; font-family: Helvetica; color: rgb(0, 0, 0); line-height: 1.2; pointer-events: all; white-space: normal; overflow-wrap: normal;">
                                Update external repos</div>
                        </div>
                    </div>
                </foreignObject><text x="75" y="274" fill="rgb(0, 0, 0)" font-family="Helvetica" font-size="12px"
                    text-anchor="middle">Update external repos</text>
            </switch>
        </g>
        <rect x="940" y="80" width="120" height="60" rx="9" ry="9" fill="rgb(255, 255, 255)" stroke="rgb(0, 0, 0)"
            pointer-events="all" />
        <g transform="translate(-0.5 -0.5)">
            <switch>
                <foreignObject pointer-events="none" width="100%" height="100%"
                    requiredFeatures="http://www.w3.org/TR/SVG11/feature#Extensibility"
                    style="overflow: visible; text-align: left;">
                    <div xmlns="http://www.w3.org/1999/xhtml"
                        style="display: flex; align-items: unsafe center; justify-content: unsafe center; width: 118px; height: 1px; padding-top: 110px; margin-left: 941px;">
                        <div data-drawio-colors="color: rgb(0, 0, 0); "
                            style="box-sizing: border-box; font-size: 0px; text-align: center;">
                            <div
                                style="display: inline-block; font-size: 12px; font-family: Helvetica; color: rgb(0, 0, 0); line-height: 1.2; pointer-events: all; white-space: normal; overflow-wrap: normal;">
                                Prune cache</div>
                        </div>
                    </div>
                </foreignObject><text x="1000" y="114" fill="rgb(0, 0, 0)" font-family="Helvetica" font-size="12px"
                    text-anchor="middle">Prune cache</text>
            </switch>
        </g>
        <rect x="410" y="0" width="100" height="30" fill="none" stroke="none" pointer-events="all" />
        <g transform="translate(-0.5 -0.5)">
            <switch>
                <foreignObject pointer-events="none" width="100%" height="100%"
                    requiredFeatures="http://www.w3.org/TR/SVG11/feature#Extensibility"
                    style="overflow: visible; text-align: left;">
                    <div xmlns="http://www.w3.org/1999/xhtml"
                        style="display: flex; align-items: unsafe center; justify-content: unsafe center; width: 1px; height: 1px; padding-top: 15px; margin-left: 460px;">
                        <div data-drawio-colors="color: rgb(0, 0, 0); "
                            style="box-sizing: border-box; font-size: 0px; text-align: center;">
                            <div
                                style="display: inline-block; font-size: 12px; font-family: Helvetica; color: rgb(0, 0, 0); line-height: 1.2; pointer-events: all; white-space: nowrap;">
                                <b>Child pipeline</b></div>
                        </div>
                    </div>
                </foreignObject><text x="460" y="19" fill="rgb(0, 0, 0)" font-family="Helvetica" font-size="12px"
                    text-anchor="middle">Child pipeline</text>
            </switch>
        </g>
        <path d="M 345 190 L 403.63 190" fill="none" stroke="rgb(0, 0, 0)" stroke-miterlimit="10"
            pointer-events="stroke" />
        <path d="M 408.88 190 L 401.88 193.5 L 403.63 190 L 401.88 186.5 Z" fill="rgb(0, 0, 0)" stroke="rgb(0, 0, 0)"
            stroke-miterlimit="10" pointer-events="all" />
        <path d="M 160 320 L 160 30" fill="none" stroke="rgb(0, 0, 0)" stroke-miterlimit="10" stroke-dasharray="3 3"
            pointer-events="stroke" />
        <path d="M 370 320 L 370 30" fill="none" stroke="rgb(0, 0, 0)" stroke-miterlimit="10" stroke-dasharray="3 3"
            pointer-events="stroke" />
        <rect x="215" y="80" width="100" height="60" rx="9" ry="9" fill="rgb(255, 255, 255)" stroke="rgb(0, 0, 0)"
            pointer-events="all" />
        <g transform="translate(-0.5 -0.5)">
            <switch>
                <foreignObject pointer-events="none" width="100%" height="100%"
                    requiredFeatures="http://www.w3.org/TR/SVG11/feature#Extensibility"
                    style="overflow: visible; text-align: left;">
                    <div xmlns="http://www.w3.org/1999/xhtml"
                        style="display: flex; align-items: unsafe center; justify-content: unsafe center; width: 98px; height: 1px; padding-top: 110px; margin-left: 216px;">
                        <div data-drawio-colors="color: rgb(0, 0, 0); "
                            style="box-sizing: border-box; font-size: 0px; text-align: center;">
                            <div
                                style="display: inline-block; font-size: 12px; font-family: Helvetica; color: rgb(0, 0, 0); line-height: 1.2; pointer-events: all; white-space: normal; overflow-wrap: normal;">
                                Install FVP</div>
                        </div>
                    </div>
                </foreignObject><text x="265" y="114" fill="rgb(0, 0, 0)" font-family="Helvetica" font-size="12px"
                    text-anchor="middle">Install FVP</text>
            </switch>
        </g>
        <path d="M 135 110 L 208.63 110" fill="none" stroke="rgb(0, 0, 0)" stroke-miterlimit="10"
            pointer-events="stroke" />
        <path d="M 213.88 110 L 206.88 113.5 L 208.63 110 L 206.88 106.5 Z" fill="rgb(0, 0, 0)" stroke="rgb(0, 0, 0)"
            stroke-miterlimit="10" pointer-events="all" />
        <rect x="5" y="80" width="130" height="60" rx="9" ry="9" fill="rgb(255, 255, 255)" stroke="rgb(0, 0, 0)"
            pointer-events="all" />
        <g transform="translate(-0.5 -0.5)">
            <switch>
                <foreignObject pointer-events="none" width="100%" height="100%"
                    requiredFeatures="http://www.w3.org/TR/SVG11/feature#Extensibility"
                    style="overflow: visible; text-align: left;">
                    <div xmlns="http://www.w3.org/1999/xhtml"
                        style="display: flex; align-items: unsafe center; justify-content: unsafe center; width: 128px; height: 1px; padding-top: 110px; margin-left: 6px;">
                        <div data-drawio-colors="color: rgb(0, 0, 0); "
                            style="box-sizing: border-box; font-size: 0px; text-align: center;">
                            <div
                                style="display: inline-block; font-size: 12px; font-family: Helvetica; color: rgb(0, 0, 0); line-height: 1.2; pointer-events: all; white-space: normal; overflow-wrap: normal;">
                                Fetch FVP version</div>
                        </div>
                    </div>
                </foreignObject><text x="70" y="114" fill="rgb(0, 0, 0)" font-family="Helvetica" font-size="12px"
                    text-anchor="middle">Fetch FVP version</text>
            </switch>
        </g>
        <rect x="205" y="240" width="120" height="60" rx="9" ry="9" fill="rgb(255, 255, 255)" stroke="rgb(0, 0, 0)"
            pointer-events="all" />
        <g transform="translate(-0.5 -0.5)">
            <switch>
                <foreignObject pointer-events="none" width="100%" height="100%"
                    requiredFeatures="http://www.w3.org/TR/SVG11/feature#Extensibility"
                    style="overflow: visible; text-align: left;">
                    <div xmlns="http://www.w3.org/1999/xhtml"
                        style="display: flex; align-items: unsafe center; justify-content: unsafe center; width: 118px; height: 1px; padding-top: 270px; margin-left: 206px;">
                        <div data-drawio-colors="color: rgb(0, 0, 0); "
                            style="box-sizing: border-box; font-size: 0px; text-align: center;">
                            <div
                                style="display: inline-block; font-size: 12px; font-family: Helvetica; color: rgb(0, 0, 0); line-height: 1.2; pointer-events: all; white-space: normal; overflow-wrap: normal;">
                                Check yocto layers</div>
                        </div>
                    </div>
                </foreignObject><text x="265" y="274" fill="rgb(0, 0, 0)" font-family="Helvetica" font-size="12px"
                    text-anchor="middle">Check yocto layers</text>
            </switch>
        </g>
        <rect x="185" y="160" width="160" height="60" rx="9" ry="9" fill="rgb(255, 255, 255)" stroke="rgb(0, 0, 0)"
            pointer-events="all" />
        <g transform="translate(-0.5 -0.5)">
            <switch>
                <foreignObject pointer-events="none" width="100%" height="100%"
                    requiredFeatures="http://www.w3.org/TR/SVG11/feature#Extensibility"
                    style="overflow: visible; text-align: left;">
                    <div xmlns="http://www.w3.org/1999/xhtml"
                        style="display: flex; align-items: unsafe center; justify-content: unsafe center; width: 158px; height: 1px; padding-top: 190px; margin-left: 186px;">
                        <div data-drawio-colors="color: rgb(0, 0, 0); "
                            style="box-sizing: border-box; font-size: 0px; text-align: center;">
                            <div
                                style="display: inline-block; font-size: 12px; font-family: Helvetica; color: rgb(0, 0, 0); line-height: 1.2; pointer-events: all; white-space: normal; overflow-wrap: normal;">
                                Build Cassini images<br style="border-color: var(--border-color);" /><span
                                    style="">(base + modifier + platform)</span></div>
                        </div>
                    </div>
                </foreignObject><text x="265" y="194" fill="rgb(0, 0, 0)" font-family="Helvetica" font-size="12px"
                    text-anchor="middle">Build Cassini images...</text>
            </switch>
        </g>
        <rect x="45" y="40" width="60" height="30" fill="none" stroke="none" pointer-events="all" />
        <g transform="translate(-0.5 -0.5)">
            <switch>
                <foreignObject pointer-events="none" width="100%" height="100%"
                    requiredFeatures="http://www.w3.org/TR/SVG11/feature#Extensibility"
                    style="overflow: visible; text-align: left;">
                    <div xmlns="http://www.w3.org/1999/xhtml"
                        style="display: flex; align-items: unsafe center; justify-content: unsafe center; width: 1px; height: 1px; padding-top: 55px; margin-left: 75px;">
                        <div data-drawio-colors="color: rgb(0, 0, 0); "
                            style="box-sizing: border-box; font-size: 0px; text-align: center;">
                            <div
                                style="display: inline-block; font-size: 12px; font-family: Helvetica; color: rgb(0, 0, 0); line-height: 1.2; pointer-events: all; white-space: nowrap;">
                                <b>Setup</b></div>
                        </div>
                    </div>
                </foreignObject><text x="75" y="59" fill="rgb(0, 0, 0)" font-family="Helvetica" font-size="12px"
                    text-anchor="middle">Setup</text>
            </switch>
        </g>
        <rect x="760" y="160" width="120" height="60" rx="9" ry="9" fill="rgb(255, 255, 255)" stroke="rgb(0, 0, 0)"
            pointer-events="all" />
        <g transform="translate(-0.5 -0.5)">
            <switch>
                <foreignObject pointer-events="none" width="100%" height="100%"
                    requiredFeatures="http://www.w3.org/TR/SVG11/feature#Extensibility"
                    style="overflow: visible; text-align: left;">
                    <div xmlns="http://www.w3.org/1999/xhtml"
                        style="display: flex; align-items: unsafe center; justify-content: unsafe center; width: 118px; height: 1px; padding-top: 190px; margin-left: 761px;">
                        <div data-drawio-colors="color: rgb(0, 0, 0); "
                            style="box-sizing: border-box; font-size: 0px; text-align: center;">
                            <div
                                style="display: inline-block; font-size: 12px; font-family: Helvetica; color: rgb(0, 0, 0); line-height: 1.2; pointer-events: all; white-space: normal; overflow-wrap: normal;">
                                Gather results from LAVA</div>
                        </div>
                    </div>
                </foreignObject><text x="820" y="194" fill="rgb(0, 0, 0)" font-family="Helvetica" font-size="12px"
                    text-anchor="middle">Gather results from...</text>
            </switch>
        </g>
        <path d="M 710 190 L 753.63 190" fill="none" stroke="rgb(0, 0, 0)" stroke-miterlimit="10"
            pointer-events="stroke" />
        <path d="M 758.88 190 L 751.88 193.5 L 753.63 190 L 751.88 186.5 Z" fill="rgb(0, 0, 0)" stroke="rgb(0, 0, 0)"
            stroke-miterlimit="10" pointer-events="all" />
        <rect x="590" y="160" width="120" height="60" rx="9" ry="9" fill="rgb(255, 255, 255)" stroke="rgb(0, 0, 0)"
            pointer-events="all" />
        <g transform="translate(-0.5 -0.5)">
            <switch>
                <foreignObject pointer-events="none" width="100%" height="100%"
                    requiredFeatures="http://www.w3.org/TR/SVG11/feature#Extensibility"
                    style="overflow: visible; text-align: left;">
                    <div xmlns="http://www.w3.org/1999/xhtml"
                        style="display: flex; align-items: unsafe center; justify-content: unsafe center; width: 118px; height: 1px; padding-top: 190px; margin-left: 591px;">
                        <div data-drawio-colors="color: rgb(0, 0, 0); "
                            style="box-sizing: border-box; font-size: 0px; text-align: center;">
                            <div
                                style="display: inline-block; font-size: 12px; font-family: Helvetica; color: rgb(0, 0, 0); line-height: 1.2; pointer-events: all; white-space: normal; overflow-wrap: normal;">
                                Submit tests to LAVA</div>
                        </div>
                    </div>
                </foreignObject><text x="650" y="194" fill="rgb(0, 0, 0)" font-family="Helvetica" font-size="12px"
                    text-anchor="middle">Submit tests to LAVA</text>
            </switch>
        </g>
        <path d="M 475 177 L 475 197 L 477.5 197 L 477.5 213.63" fill="none" stroke="rgb(0, 0, 0)"
            stroke-miterlimit="10" pointer-events="stroke" />
        <path d="M 477.5 218.88 L 474 211.88 L 477.5 213.63 L 481 211.88 Z" fill="rgb(0, 0, 0)" stroke="rgb(0, 0, 0)"
            stroke-miterlimit="10" pointer-events="all" />
        <path d="M 545 190 L 583.63 190" fill="none" stroke="rgb(0, 0, 0)" stroke-miterlimit="10"
            pointer-events="stroke" />
        <path d="M 588.88 190 L 581.88 193.5 L 583.63 190 L 581.88 186.5 Z" fill="rgb(0, 0, 0)" stroke="rgb(0, 0, 0)"
            stroke-miterlimit="10" pointer-events="all" />
        <rect x="410" y="160" width="135" height="60" rx="9" ry="9" fill="rgb(255, 255, 255)" stroke="rgb(0, 0, 0)"
            pointer-events="all" />
        <g transform="translate(-0.5 -0.5)">
            <switch>
                <foreignObject pointer-events="none" width="100%" height="100%"
                    requiredFeatures="http://www.w3.org/TR/SVG11/feature#Extensibility"
                    style="overflow: visible; text-align: left;">
                    <div xmlns="http://www.w3.org/1999/xhtml"
                        style="display: flex; align-items: unsafe center; justify-content: unsafe center; width: 133px; height: 1px; padding-top: 190px; margin-left: 411px;">
                        <div data-drawio-colors="color: rgb(0, 0, 0); "
                            style="box-sizing: border-box; font-size: 0px; text-align: center;">
                            <div
                                style="display: inline-block; font-size: 12px; font-family: Helvetica; color: rgb(0, 0, 0); line-height: 1.2; pointer-events: all; white-space: normal; overflow-wrap: normal;">
                                Prepare for LAVA<br style="border-color: var(--border-color);" /><span style="">test
                                    framework</span></div>
                        </div>
                    </div>
                </foreignObject><text x="478" y="194" fill="rgb(0, 0, 0)" font-family="Helvetica" font-size="12px"
                    text-anchor="middle">Prepare for LAVA...</text>
            </switch>
        </g>
        <rect x="240" y="40" width="50" height="30" fill="none" stroke="none" pointer-events="all" />
        <g transform="translate(-0.5 -0.5)">
            <switch>
                <foreignObject pointer-events="none" width="100%" height="100%"
                    requiredFeatures="http://www.w3.org/TR/SVG11/feature#Extensibility"
                    style="overflow: visible; text-align: left;">
                    <div xmlns="http://www.w3.org/1999/xhtml"
                        style="display: flex; align-items: unsafe center; justify-content: unsafe center; width: 1px; height: 1px; padding-top: 55px; margin-left: 265px;">
                        <div data-drawio-colors="color: rgb(0, 0, 0); "
                            style="box-sizing: border-box; font-size: 0px; text-align: center;">
                            <div
                                style="display: inline-block; font-size: 12px; font-family: Helvetica; color: rgb(0, 0, 0); line-height: 1.2; pointer-events: all; white-space: nowrap;">
                                <b>Build</b></div>
                        </div>
                    </div>
                </foreignObject><text x="265" y="59" fill="rgb(0, 0, 0)" font-family="Helvetica" font-size="12px"
                    text-anchor="middle">Build</text>
            </switch>
        </g>
        <rect x="625" y="40" width="50" height="30" fill="none" stroke="none" pointer-events="all" />
        <g transform="translate(-0.5 -0.5)">
            <switch>
                <foreignObject pointer-events="none" width="100%" height="100%"
                    requiredFeatures="http://www.w3.org/TR/SVG11/feature#Extensibility"
                    style="overflow: visible; text-align: left;">
                    <div xmlns="http://www.w3.org/1999/xhtml"
                        style="display: flex; align-items: unsafe center; justify-content: unsafe center; width: 1px; height: 1px; padding-top: 55px; margin-left: 650px;">
                        <div data-drawio-colors="color: rgb(0, 0, 0); "
                            style="box-sizing: border-box; font-size: 0px; text-align: center;">
                            <div
                                style="display: inline-block; font-size: 12px; font-family: Helvetica; color: rgb(0, 0, 0); line-height: 1.2; pointer-events: all; white-space: nowrap;">
                                <b>Test</b></div>
                        </div>
                    </div>
                </foreignObject><text x="650" y="59" fill="rgb(0, 0, 0)" font-family="Helvetica" font-size="12px"
                    text-anchor="middle">Test</text>
            </switch>
        </g>
        <path d="M 910 320 L 910 30" fill="none" stroke="rgb(0, 0, 0)" stroke-miterlimit="10" stroke-dasharray="3 3"
            pointer-events="stroke" />
        <rect x="965" y="40" width="70" height="30" fill="none" stroke="none" pointer-events="all" />
        <g transform="translate(-0.5 -0.5)">
            <switch>
                <foreignObject pointer-events="none" width="100%" height="100%"
                    requiredFeatures="http://www.w3.org/TR/SVG11/feature#Extensibility"
                    style="overflow: visible; text-align: left;">
                    <div xmlns="http://www.w3.org/1999/xhtml"
                        style="display: flex; align-items: unsafe center; justify-content: unsafe center; width: 1px; height: 1px; padding-top: 55px; margin-left: 1000px;">
                        <div data-drawio-colors="color: rgb(0, 0, 0); "
                            style="box-sizing: border-box; font-size: 0px; text-align: center;">
                            <div
                                style="display: inline-block; font-size: 12px; font-family: Helvetica; color: rgb(0, 0, 0); line-height: 1.2; pointer-events: all; white-space: nowrap;">
                                <b>Cleanup</b></div>
                        </div>
                    </div>
                </foreignObject><text x="1000" y="59" fill="rgb(0, 0, 0)" font-family="Helvetica" font-size="12px"
                    text-anchor="middle">Cleanup</text>
            </switch>
        </g>
    </g>
    <switch>
        <g requiredFeatures="http://www.w3.org/TR/SVG11/feature#Extensibility" /><a transform="translate(0,-5)"
            xlink:href="https://www.diagrams.net/doc/faq/svg-export-text-problems" target="_blank"><text
                text-anchor="middle" font-size="10px" x="50%" y="100%">Text is not SVG - cannot display</text></a>
    </switch>
</svg>
