{
  "configVersion": 2,
  "packages": [
    {
      "name": "archive",
      "rootUri": "file:///Users/emad/development/flutter/.pub-cache/hosted/pub.dartlang.org/archive-2.0.13",
      "packageUri": "lib/",
      "languageVersion": "2.0"
    },
    {
      "name": "args",
      "rootUri": "file:///Users/emad/development/flutter/.pub-cache/hosted/pub.dartlang.org/args-1.6.0",
      "packageUri": "lib/",
      "languageVersion": "2.3"
    },
    {
      "name": "async",
      "rootUri": "file:///Users/emad/development/flutter/.pub-cache/hosted/pub.dartlang.org/async-2.4.1",
      "packageUri": "lib/",
      "languageVersion": "2.2"
    },
    {
      "name": "awesome_dialog",
      "rootUri": "file:///Users/emad/development/flutter/.pub-cache/hosted/pub.dartlang.org/awesome_dialog-1.1.0",
      "packageUri": "lib/",
      "languageVersion": "2.3"
    },
    {
      "name": "badges",
      "rootUri": "file:///Users/emad/development/flutter/.pub-cache/hosted/pub.dartlang.org/badges-1.1.1",
      "packageUri": "lib/",
      "languageVersion": "2.2"
    },
    {
      "name": "bloc",
      "rootUri": "file:///Users/emad/development/flutter/.pub-cache/hosted/pub.dartlang.org/bloc-4.0.0",
      "packageUri": "lib/",
      "languageVersion": "2.6"
    },
    {
      "name": "boolean_selector",
      "rootUri": "file:///Users/emad/development/flutter/.pub-cache/hosted/pub.dartlang.org/boolean_selector-2.0.0",
      "packageUri": "lib/",
      "languageVersion": "2.4"
    },
    {
      "name": "bouncing_widget",
      "rootUri": "file:///Users/emad/development/flutter/.pub-cache/hosted/pub.dartlang.org/bouncing_widget-1.2.0",
      "packageUri": "lib/",
      "languageVersion": "2.1"
    },
    {
      "name": "bubble_tab_indicator",
      "rootUri": "file:///Users/emad/development/flutter/.pub-cache/hosted/pub.dartlang.org/bubble_tab_indicator-0.1.4",
      "packageUri": "lib/",
      "languageVersion": "1.23"
    },
    {
      "name": "cached_network_image",
      "rootUri": "file:///Users/emad/development/flutter/.pub-cache/hosted/pub.dartlang.org/cached_network_image-2.2.0+1",
      "packageUri": "lib/",
      "languageVersion": "2.1"
    },
    {
      "name": "charcode",
      "rootUri": "file:///Users/emad/development/flutter/.pub-cache/hosted/pub.dartlang.org/charcode-1.1.3",
      "packageUri": "lib/",
      "languageVersion": "2.0"
    },
    {
      "name": "clock",
      "rootUri": "file:///Users/emad/development/flutter/.pub-cache/hosted/pub.dartlang.org/clock-1.0.1",
      "packageUri": "lib/",
      "languageVersion": "2.0"
    },
    {
      "name": "collection",
      "rootUri": "file:///Users/emad/development/flutter/.pub-cache/hosted/pub.dartlang.org/collection-1.14.12",
      "packageUri": "lib/",
      "languageVersion": "2.0"
    },
    {
      "name": "convert",
      "rootUri": "file:///Users/emad/development/flutter/.pub-cache/hosted/pub.dartlang.org/convert-2.1.1",
      "packageUri": "lib/",
      "languageVersion": "1.17"
    },
    {
      "name": "crypto",
      "rootUri": "file:///Users/emad/development/flutter/.pub-cache/hosted/pub.dartlang.org/crypto-2.1.4",
      "packageUri": "lib/",
      "languageVersion": "2.1"
    },
    {
      "name": "cupertino_icons",
      "rootUri": "file:///Users/emad/development/flutter/.pub-cache/hosted/pub.dartlang.org/cupertino_icons-0.1.3",
      "packageUri": "lib/",
      "languageVersion": "2.0"
    },
    {
      "name": "dynamic_custom_theme",
      "rootUri": "file:///Users/emad/development/flutter/.pub-cache/hosted/pub.dartlang.org/dynamic_custom_theme-1.0.0+7",
      "packageUri": "lib/",
      "languageVersion": "2.1"
    },
    {
      "name": "dynamic_theme",
      "rootUri": "file:///Users/emad/development/flutter/.pub-cache/hosted/pub.dartlang.org/dynamic_theme-1.0.1",
      "packageUri": "lib/",
      "languageVersion": "1.20"
    },
    {
      "name": "fade",
      "rootUri": "file:///Users/emad/development/flutter/.pub-cache/hosted/pub.dartlang.org/fade-1.0.0",
      "packageUri": "lib/",
      "languageVersion": "2.0"
    },
    {
      "name": "file",
      "rootUri": "file:///Users/emad/development/flutter/.pub-cache/hosted/pub.dartlang.org/file-5.1.0",
      "packageUri": "lib/",
      "languageVersion": "2.2"
    },
    {
      "name": "flare_dart",
      "rootUri": "file:///Users/emad/development/flutter/.pub-cache/hosted/pub.dartlang.org/flare_dart-2.3.4",
      "packageUri": "lib/",
      "languageVersion": "2.1"
    },
    {
      "name": "flare_flutter",
      "rootUri": "file:///Users/emad/development/flutter/.pub-cache/hosted/pub.dartlang.org/flare_flutter-2.0.3",
      "packageUri": "lib/",
      "languageVersion": "2.2"
    },
    {
      "name": "flutter",
      "rootUri": "file:///Users/emad/development/flutter/packages/flutter",
      "packageUri": "lib/",
      "languageVersion": "2.2"
    },
    {
      "name": "flutter_bloc",
      "rootUri": "file:///Users/emad/development/flutter/.pub-cache/hosted/pub.dartlang.org/flutter_bloc-4.0.0",
      "packageUri": "lib/",
      "languageVersion": "2.6"
    },
    {
      "name": "flutter_cache_manager",
      "rootUri": "file:///Users/emad/development/flutter/.pub-cache/hosted/pub.dartlang.org/flutter_cache_manager-1.2.2",
      "packageUri": "lib/",
      "languageVersion": "2.6"
    },
    {
      "name": "flutter_slidable",
      "rootUri": "file:///Users/emad/development/flutter/.pub-cache/hosted/pub.dartlang.org/flutter_slidable-0.5.4",
      "packageUri": "lib/",
      "languageVersion": "1.19"
    },
    {
      "name": "flutter_staggered_animations",
      "rootUri": "file:///Users/emad/development/flutter/.pub-cache/hosted/pub.dartlang.org/flutter_staggered_animations-0.1.2",
      "packageUri": "lib/",
      "languageVersion": "2.1"
    },
    {
      "name": "flutter_test",
      "rootUri": "file:///Users/emad/development/flutter/packages/flutter_test",
      "packageUri": "lib/",
      "languageVersion": "2.2"
    },
    {
      "name": "flutter_web_plugins",
      "rootUri": "file:///Users/emad/development/flutter/packages/flutter_web_plugins",
      "packageUri": "lib/",
      "languageVersion": "2.0"
    },
    {
      "name": "get_it",
      "rootUri": "file:///Users/emad/development/flutter/.pub-cache/hosted/pub.dartlang.org/get_it-1.1.0",
      "packageUri": "lib/",
      "languageVersion": "2.0"
    },
    {
      "name": "http",
      "rootUri": "file:///Users/emad/development/flutter/.pub-cache/hosted/pub.dartlang.org/http-0.12.1",
      "packageUri": "lib/",
      "languageVersion": "2.4"
    },
    {
      "name": "http_parser",
      "rootUri": "file:///Users/emad/development/flutter/.pub-cache/hosted/pub.dartlang.org/http_parser-3.1.4",
      "packageUri": "lib/",
      "languageVersion": "2.3"
    },
    {
      "name": "image",
      "rootUri": "file:///Users/emad/development/flutter/.pub-cache/hosted/pub.dartlang.org/image-2.1.12",
      "packageUri": "lib/",
      "languageVersion": "2.0"
    },
    {
      "name": "intl",
      "rootUri": "file:///Users/emad/development/flutter/.pub-cache/hosted/pub.dartlang.org/intl-0.16.1",
      "packageUri": "lib/",
      "languageVersion": "2.5"
    },
    {
      "name": "matcher",
      "rootUri": "file:///Users/emad/development/flutter/.pub-cache/hosted/pub.dartlang.org/matcher-0.12.6",
      "packageUri": "lib/",
      "languageVersion": "2.2"
    },
    {
      "name": "meta",
      "rootUri": "file:///Users/emad/development/flutter/.pub-cache/hosted/pub.dartlang.org/meta-1.1.8",
      "packageUri": "lib/",
      "languageVersion": "1.12"
    },
    {
      "name": "nested",
      "rootUri": "file:///Users/emad/development/flutter/.pub-cache/hosted/pub.dartlang.org/nested-0.0.4",
      "packageUri": "lib/",
      "languageVersion": "2.2"
    },
    {
      "name": "page_transition",
      "rootUri": "file:///Users/emad/development/flutter/.pub-cache/hosted/pub.dartlang.org/page_transition-1.1.5",
      "packageUri": "lib/",
      "languageVersion": "2.0"
    },
    {
      "name": "path",
      "rootUri": "file:///Users/emad/development/flutter/.pub-cache/hosted/pub.dartlang.org/path-1.6.4",
      "packageUri": "lib/",
      "languageVersion": "2.0"
    },
    {
      "name": "path_provider",
      "rootUri": "file:///Users/emad/development/flutter/.pub-cache/hosted/pub.dartlang.org/path_provider-1.6.9",
      "packageUri": "lib/",
      "languageVersion": "2.1"
    },
    {
      "name": "path_provider_macos",
      "rootUri": "file:///Users/emad/development/flutter/.pub-cache/hosted/pub.dartlang.org/path_provider_macos-0.0.4+3",
      "packageUri": "lib/",
      "languageVersion": "2.1"
    },
    {
      "name": "path_provider_platform_interface",
      "rootUri": "file:///Users/emad/development/flutter/.pub-cache/hosted/pub.dartlang.org/path_provider_platform_interface-1.0.2",
      "packageUri": "lib/",
      "languageVersion": "2.1"
    },
    {
      "name": "pedantic",
      "rootUri": "file:///Users/emad/development/flutter/.pub-cache/hosted/pub.dartlang.org/pedantic-1.8.0+1",
      "packageUri": "lib/",
      "languageVersion": "2.1"
    },
    {
      "name": "petitparser",
      "rootUri": "file:///Users/emad/development/flutter/.pub-cache/hosted/pub.dartlang.org/petitparser-2.4.0",
      "packageUri": "lib/",
      "languageVersion": "2.4"
    },
    {
      "name": "platform",
      "rootUri": "file:///Users/emad/development/flutter/.pub-cache/hosted/pub.dartlang.org/platform-2.2.1",
      "packageUri": "lib/",
      "languageVersion": "1.24"
    },
    {
      "name": "plugin_platform_interface",
      "rootUri": "file:///Users/emad/development/flutter/.pub-cache/hosted/pub.dartlang.org/plugin_platform_interface-1.0.2",
      "packageUri": "lib/",
      "languageVersion": "2.1"
    },
    {
      "name": "progress_indicator_button",
      "rootUri": "file:///Users/emad/development/flutter/.pub-cache/hosted/pub.dartlang.org/progress_indicator_button-0.0.3",
      "packageUri": "lib/",
      "languageVersion": "2.0"
    },
    {
      "name": "provider",
      "rootUri": "file:///Users/emad/development/flutter/.pub-cache/hosted/pub.dartlang.org/provider-4.1.2",
      "packageUri": "lib/",
      "languageVersion": "2.7"
    },
    {
      "name": "quiver",
      "rootUri": "file:///Users/emad/development/flutter/.pub-cache/hosted/pub.dartlang.org/quiver-2.1.3",
      "packageUri": "lib/",
      "languageVersion": "2.0"
    },
    {
      "name": "rxdart",
      "rootUri": "file:///Users/emad/development/flutter/.pub-cache/hosted/pub.dartlang.org/rxdart-0.24.1",
      "packageUri": "lib/",
      "languageVersion": "2.6"
    },
    {
      "name": "sa_anicoto",
      "rootUri": "file:///Users/emad/development/flutter/.pub-cache/hosted/pub.dartlang.org/sa_anicoto-1.0.2",
      "packageUri": "lib/",
      "languageVersion": "2.7"
    },
    {
      "name": "sa_multi_tween",
      "rootUri": "file:///Users/emad/development/flutter/.pub-cache/hosted/pub.dartlang.org/sa_multi_tween-1.1.1",
      "packageUri": "lib/",
      "languageVersion": "2.7"
    },
    {
      "name": "sa_stateless_animation",
      "rootUri": "file:///Users/emad/development/flutter/.pub-cache/hosted/pub.dartlang.org/sa_stateless_animation-1.0.1",
      "packageUri": "lib/",
      "languageVersion": "2.7"
    },
    {
      "name": "sa_v1_migration",
      "rootUri": "file:///Users/emad/development/flutter/.pub-cache/hosted/pub.dartlang.org/sa_v1_migration-1.1.2",
      "packageUri": "lib/",
      "languageVersion": "2.3"
    },
    {
      "name": "shared_preferences",
      "rootUri": "file:///Users/emad/development/flutter/.pub-cache/hosted/pub.dartlang.org/shared_preferences-0.5.7+3",
      "packageUri": "lib/",
      "languageVersion": "2.1"
    },
    {
      "name": "shared_preferences_macos",
      "rootUri": "file:///Users/emad/development/flutter/.pub-cache/hosted/pub.dartlang.org/shared_preferences_macos-0.0.1+9",
      "packageUri": "lib/",
      "languageVersion": "2.1"
    },
    {
      "name": "shared_preferences_platform_interface",
      "rootUri": "file:///Users/emad/development/flutter/.pub-cache/hosted/pub.dartlang.org/shared_preferences_platform_interface-1.0.4",
      "packageUri": "lib/",
      "languageVersion": "2.1"
    },
    {
      "name": "shared_preferences_web",
      "rootUri": "file:///Users/emad/development/flutter/.pub-cache/hosted/pub.dartlang.org/shared_preferences_web-0.1.2+7",
      "packageUri": "lib/",
      "languageVersion": "2.1"
    },
    {
      "name": "simple_animations",
      "rootUri": "file:///Users/emad/development/flutter/.pub-cache/hosted/pub.dartlang.org/simple_animations-2.2.1",
      "packageUri": "lib/",
      "languageVersion": "2.7"
    },
    {
      "name": "sky_engine",
      "rootUri": "file:///Users/emad/development/flutter/bin/cache/pkg/sky_engine",
      "packageUri": "lib/",
      "languageVersion": "1.11"
    },
    {
      "name": "source_span",
      "rootUri": "file:///Users/emad/development/flutter/.pub-cache/hosted/pub.dartlang.org/source_span-1.7.0",
      "packageUri": "lib/",
      "languageVersion": "2.6"
    },
    {
      "name": "sqflite",
      "rootUri": "file:///Users/emad/development/flutter/.pub-cache/hosted/pub.dartlang.org/sqflite-1.3.0+1",
      "packageUri": "lib/",
      "languageVersion": "2.7"
    },
    {
      "name": "sqflite_common",
      "rootUri": "file:///Users/emad/development/flutter/.pub-cache/hosted/pub.dartlang.org/sqflite_common-1.0.1",
      "packageUri": "lib/",
      "languageVersion": "2.7"
    },
    {
      "name": "stack_trace",
      "rootUri": "file:///Users/emad/development/flutter/.pub-cache/hosted/pub.dartlang.org/stack_trace-1.9.3",
      "packageUri": "lib/",
      "languageVersion": "1.23"
    },
    {
      "name": "stream_channel",
      "rootUri": "file:///Users/emad/development/flutter/.pub-cache/hosted/pub.dartlang.org/stream_channel-2.0.0",
      "packageUri": "lib/",
      "languageVersion": "2.0"
    },
    {
      "name": "string_scanner",
      "rootUri": "file:///Users/emad/development/flutter/.pub-cache/hosted/pub.dartlang.org/string_scanner-1.0.5",
      "packageUri": "lib/",
      "languageVersion": "2.0"
    },
    {
      "name": "supercharged",
      "rootUri": "file:///Users/emad/development/flutter/.pub-cache/hosted/pub.dartlang.org/supercharged-1.6.0",
      "packageUri": "lib/",
      "languageVersion": "2.7"
    },
    {
      "name": "synchronized",
      "rootUri": "file:///Users/emad/development/flutter/.pub-cache/hosted/pub.dartlang.org/synchronized-2.2.0",
      "packageUri": "lib/",
      "languageVersion": "2.6"
    },
    {
      "name": "term_glyph",
      "rootUri": "file:///Users/emad/development/flutter/.pub-cache/hosted/pub.dartlang.org/term_glyph-1.1.0",
      "packageUri": "lib/",
      "languageVersion": "1.8"
    },
    {
      "name": "test_api",
      "rootUri": "file:///Users/emad/development/flutter/.pub-cache/hosted/pub.dartlang.org/test_api-0.2.15",
      "packageUri": "lib/",
      "languageVersion": "2.4"
    },
    {
      "name": "toast",
      "rootUri": "file:///Users/emad/development/flutter/.pub-cache/hosted/pub.dartlang.org/toast-0.1.5",
      "packageUri": "lib/",
      "languageVersion": "2.0"
    },
    {
      "name": "typed_data",
      "rootUri": "file:///Users/emad/development/flutter/.pub-cache/hosted/pub.dartlang.org/typed_data-1.1.6",
      "packageUri": "lib/",
      "languageVersion": "2.0"
    },
    {
      "name": "uuid",
      "rootUri": "file:///Users/emad/development/flutter/.pub-cache/hosted/pub.dartlang.org/uuid-2.0.4",
      "packageUri": "lib/",
      "languageVersion": "2.0"
    },
    {
      "name": "vector_math",
      "rootUri": "file:///Users/emad/development/flutter/.pub-cache/hosted/pub.dartlang.org/vector_math-2.0.8",
      "packageUri": "lib/",
      "languageVersion": "2.0"
    },
    {
      "name": "xml",
      "rootUri": "file:///Users/emad/development/flutter/.pub-cache/hosted/pub.dartlang.org/xml-3.6.1",
      "packageUri": "lib/",
      "languageVersion": "2.6"
    },
    {
      "name": "rialotestproject",
      "rootUri": "../",
      "packageUri": "lib/",
      "languageVersion": "2.1"
    }
  ],
  "generated": "2020-06-01T09:45:13.314854Z",
  "generator": "pub",
  "generatorVersion": "2.8.2"
}
