{
  "target": "CMIP6",
  "drs": "CMIP6Output",
  "source_id": [".*"],
  "variant_label": [".*"],
  "variable_id": [
    "hfds",
    "tas",
    "ts",
    "tos",
    "rsut",
    "rlut",
    "rsdt",
    "cLitter",
    "cProduct",
    "cSoil",
    "cSoilFast",
    "cSoilMedium",
    "cSoilSlow",
    "cVeg",
    "fAnthDisturb",
    "cLand",
    "cOther",
    "fFire",
    "fFireNat",
    "fFireAll",
    "fGrazing",
    "fHarvest",
    "fLuc",
    "rh",
    "fgco2",
    "cStem",
    "co2s",
    "nep",
    "npp",
    "fBNF",
    "fHarvestToAtmos",
    "fDeforestToAtmos",
    "cWood",
    "cMisc",
    "nSoil",
    "fco2fos",
    "fco2nat",
    "fco2antt",
    "netAtmosLandCO2Flux"
  ],
  "experiment_id": [".*"]
}
