{
  "crunch_dir": "${ROOT}/crunched",
  "stitch_dir": "${ROOT}/data/${TARGET}/ascii",
  "download_dir": "/data/cmip6/CMIP6",
  "convert_units": false,
  "download": {
    "extra_variables": "sftlf,sftof,areacella,areacello",
    "extra_experiments": "piControl,esm-piControl"
  },
  "regions": [
    "World",
    "World|Northern Hemisphere",
    "World|Southern Hemisphere",
    "World|Land",
    "World|Ocean",
    "World|Northern Hemisphere|Land",
    "World|Southern Hemisphere|Land",
    "World|Northern Hemisphere|Ocean",
    "World|Southern Hemisphere|Ocean",
    "World|El Nino N3.4",
    "World|North Atlantic Ocean"
  ],
  "variable_id": [
   "hfds",
    "tas",
    "tasmax",
    "tasmin",
    "ts",
    "tos",
    "pr",
    "rsut",
    "rlut",
    "rsdt",
    "cLitter",
    "cProduct",
    "cSoil",
    "cSoilFast",
    "cSoilMedium",
    "cSoilSlow",
    "cVeg",
    "fAnthDisturb",
    "cLand",
    "cOther",
    "fFire",
    "fFireNat",
    "fFireAll",
    "fGrazing",
    "fHarvest",
    "fLuc",
    "rh",
    "fgco2",
    "cStem",
    "co2s",
    "co2mass",
    "nbp",
    "nep",
    "npp",
    "fBNF",
    "fHarvestToAtmos",
    "fDeforestToAtmos",
    "cWood",
    "cMisc",
    "nSoil",
    "fco2fos",
    "fco2nat",
    "fco2antt",
    "netAtmosLandCO2Flux"
  ],
  "average_start_year_variables": [
    "tas",
    "ts"
  ],
  "point_start_year_variables": [
    "cLitter",
    "cProduct",
    "cSoil",
    "cSoilFast",
    "cSoilMedium",
    "cSoilSlow",
    "cVeg",
    "cVegGrass",
    "cVegShrub",
    "cVegTree",
    "cLitterSurf",
    "cLitterSubSurf",
    "cLitterCWD",
    "cLitterGrass",
    "cLitterShrub",
    "cLitterTree",
    "cLand",
    "cWood",
    "cMisc",
    "cOther",
    "cStem",
    "landCoverFrac",
    "co2s",
    "co2mass",
    "nLitter",
    "nProduct",
    "nLand",
    "nMineral",
    "nLeaf",
    "nStem",
    "nRoot",
    "nSoil",
    "nOther"
  ],
  "average_mid_year_variables": [
    "rlut",
    "rsut",
    "rsdt",
    "hfds",
    "tas",
    "tasmax",
    "tasmin",
    "pr",
    "tos",
    "ts",
    "rhLitter",
    "rhSoil",
    "rhShrub",
    "rhTree",
    "rhGrass",
    "rhLut",
    "fFire",
    "fGrazing",
    "fHarvest",
    "fLitterSoil",
    "fLuc",
    "fVegLitter",
    "fVegSoil",
    "fNLandToOcean",
    "fNgas",
    "fco2fos",
    "fco2nat",
    "fco2antt",
    "netAtmosLandCO2Flux",
    "nppGrass",
    "nppLut",
    "nppOther",
    "nppShrub",
    "nppTree",
    "gpp",
    "npp",
    "nbp",
    "nep",
    "ra",
    "rh",
    "fgco2",
    "fFireNat",
    "fProductDecom",
    "fAnthDisturb",
    "fDeforestToProduct",
    "fHarvestToProduct",
    "fNloss",
    "fNfert",
    "fNdep",
    "fBNF",
    "fNup",
    "fNnetmin",
    "fNVegLitter",
    "fNLandToOcean",
    "fNLitterSoil",
    "fNVegSoil",
    "fNProduct",
    "fNAnthDisturb",
    "fFireAll",
    "fHarvestToAtmos",
    "fDeforestToAtmos",
    "fNLeach",
    "fNgasFire",
    "fNgasNonFire"
  ],
  "dedrift_variables": [
    "cLand",
    "cLitter",
    "cLitterGrass",
    "cLitterShrub",
    "cLitterSubSurf",
    "cLitterSurf",
    "cLitterTree",
    "cMisc",
    "cOther",
    "cProduct",
    "cSoil",
    "cSoilFast",
    "cSoilMedium",
    "cSoilSlow",
    "cStem",
    "cVeg",
    "cVegGrass",
    "cVegShrub",
    "cVegTree",
    "cWood",
    "fFire",
    "fFireAll",
    "fFireNat",
    "fLitterSoil",
    "fLuc",
    "fVegLitter",
    "fco2antt",
    "fco2nat",
    "fgco2",
    "gpp",
    "nbp",
    "nep",
    "npp",
    "nppGrass",
    "nppOther",
    "nppShrub",
    "nppTree",
    "ra",
    "rh",
    "rhGrass",
    "rhLitter",
    "rhShrub",
    "rhSoil",
    "rhTree",
    "rhplusfFire",
    "rlut",
    "rsdt",
    "rsut"
  ],
  "steps": {
    "download": false,
    "crunch": true,
    "wrangle": true,
    "stitch": true,
    "norm": true,
    "dedrift": true
  },
  "run_monthly": false
}
