{
  "target": "CMIP6",
  "drs": "CMIP6Output",
  "source_id": [".*"],
  "variant_label": [".*"],
  "experiment_id": [".*"],
  "average_mid_year_variables": [
"hfds",
    "tas",
    "tasmax",
    "tasmin",
    "ts",
    "tos",
    "pr",
    "rsut",
    "rlut",
    "rsdt",
    "cLitter",
    "cProduct",
    "cSoil",
    "cSoilFast",
    "cSoilMedium",
    "cSoilSlow",
    "cVeg",
    "fAnthDisturb",
    "cLand",
    "cOther",
    "fFire",
    "fFireNat",
    "fFireAll",
    "fGrazing",
    "fHarvest",
    "fLuc",
    "rh",
    "fgco2",
    "cStem",
    "co2s",
    "co2mass",
    "nbp",
    "nep",
    "npp",
    "fBNF",
    "fHarvestToAtmos",
    "fDeforestToAtmos",
    "cWood",
    "cMisc",
    "nSoil",
    "fco2fos",
    "fco2nat",
    "fco2antt",
    "netAtmosLandCO2Flux"
],
  "point_start_year_variables": [],
  "average_start_year_variables": [],
  "regions": [
    "World",
    "World|Northern Hemisphere",
    "World|Southern Hemisphere",
    "World|Land",
    "World|Ocean",
    "World|Northern Hemisphere|Land",
    "World|Southern Hemisphere|Land",
    "World|Northern Hemisphere|Ocean",
    "World|Southern Hemisphere|Ocean",
    "World|El Nino N3.4",
    "World|North Atlantic Ocean",
    "World|AR6|GIC",
    "World|AR6|NWN",
    "World|AR6|NEN",
    "World|AR6|WNA",
    "World|AR6|CNA",
    "World|AR6|ENA",
    "World|AR6|NCA",
    "World|AR6|SCA",
    "World|AR6|CAR",
    "World|AR6|NWS",
    "World|AR6|NSA",
    "World|AR6|NES",
    "World|AR6|SAM",
    "World|AR6|SWS",
    "World|AR6|SES",
    "World|AR6|SSA",
    "World|AR6|NEU",
    "World|AR6|WCE",
    "World|AR6|EEU",
    "World|AR6|MED",
    "World|AR6|SAH",
    "World|AR6|WAF",
    "World|AR6|CAF",
    "World|AR6|NEAF",
    "World|AR6|SEAF",
    "World|AR6|WSAF",
    "World|AR6|ESAF",
    "World|AR6|MDG",
    "World|AR6|RAR",
    "World|AR6|WSB",
    "World|AR6|ESB",
    "World|AR6|RFE",
    "World|AR6|WCA",
    "World|AR6|ECA",
    "World|AR6|TIB",
    "World|AR6|EAS",
    "World|AR6|ARP",
    "World|AR6|SAS",
    "World|AR6|SEA",
    "World|AR6|NAU",
    "World|AR6|CAU",
    "World|AR6|EAU",
    "World|AR6|SAU",
    "World|AR6|NZ",
    "World|AR6|EAN",
    "World|AR6|WAN",
    "World|AR6|ARO",
    "World|AR6|NPO",
    "World|AR6|EPO",
    "World|AR6|SPO",
    "World|AR6|NAO",
    "World|AR6|EAO",
    "World|AR6|SAO",
    "World|AR6|ARS",
    "World|AR6|BOB",
    "World|AR6|EIO",
    "World|AR6|SIO",
    "World|AR6|SOO"
  ],
  "steps": {
    "download": false,
    "crunch": true,
    "wrangle": true,
    "stitch": true,
    "norm": true,
    "dedrift": true
  },
  "run_monthly": true
}
