{
  "swagger": "2.0",
  "info": {
    "version": "0.1.0",
    "title": "Marea API",
    "description": "Documentation for Marea devs."
  },
  "host": "localhost:3000",
  "basePath": "/",
  "tags": [
    {
      "name": "User",
      "description": "API for Users Endpoints"
    }
  ],
  "schemes": [
    "http"
  ],
  "consumes": [
    "application/json"
  ],
  "produces": [
    "application/json"
  ],
  "paths": {
    "/": {
      "get": {
        "tags": [],
        "description": "",
        "parameters": [],
        "responses": {}
      }
    },
    "/api/user/register": {
      "post": {
        "tags": [
          "User"
        ],
        "description": "",
        "parameters": [
          {
            "name": "obj",
            "in": "body",
            "description": "Add a user",
            "schema": {
              "$ref": "#/definitions/User"
            }
          }
        ],
        "responses": {
          "201": {
            "description": "Criado"
          },
          "400": {
            "description": "Solicitação Inválida"
          }
        }
      }
    },
    "/api/user/authenticate": {
      "post": {
        "tags": [
          "User"
        ],
        "description": "",
        "parameters": [
          {
            "name": "obj",
            "in": "body",
            "description": "Auth a user",
            "schema": {
              "type": "object",
              "properties": {
                "email": {
                  "type": "string",
                  "example": "example@mail.com"
                },
                "password": {
                  "type": "string",
                  "example": "password"
                }
              }
            }
          }
        ],
        "responses": {
          "200": {
            "description": "User successfully auth.",
            "schema": {
              "type": "object",
              "properties": {
                "token": {
                  "type": "string",
                  "example": "any_token"
                }
              },
              "xml": {
                "name": "main"
              }
            }
          },
          "400": {
            "description": "Solicitação Inválida"
          }
        }
      }
    },
    "/api/user/changePass": {
      "post": {
        "tags": [
          "User"
        ],
        "description": "Adicionar válidação no front-end para usuário confirmar nova senha",
        "parameters": [
          {
            "name": "obj",
            "in": "body",
            "description": "Change user pass",
            "schema": {
              "type": "object",
              "properties": {
                "email": {
                  "type": "string",
                  "example": "example@mail.com"
                },
                "password": {
                  "type": "string",
                  "example": "password"
                },
                "newPassword": {
                  "type": "string",
                  "example": "newPassword"
                }
              }
            }
          }
        ],
        "responses": {
          "202": {
            "description": "Aceito"
          },
          "400": {
            "description": "Solicitação Inválida"
          }
        }
      }
    }
  },
  "definitions": {
    "User": {
      "type": "object",
      "properties": {
        "active": {
          "type": "boolean",
          "example": true
        },
        "email": {
          "type": "string",
          "example": "example@mail.com"
        },
        "doc": {
          "type": "string",
          "example": "000.000.000-11"
        },
        "username": {
          "type": "string",
          "example": "jhon doe"
        },
        "password": {
          "type": "string",
          "example": "password"
        },
        "name": {
          "type": "string",
          "example": "Jhon"
        },
        "lastname": {
          "type": "string",
          "example": "Doe"
        },
        "birthday": {
          "type": "string",
          "example": "20/02/2002"
        },
        "permissions": {
          "type": "object",
          "properties": {
            "superuser": {
              "type": "boolean",
              "example": false
            },
            "admin": {
              "type": "boolean",
              "example": false
            }
          }
        },
        "streetLine1": {
          "type": "string",
          "example": "Rua imaginaria"
        },
        "streetLine2": {
          "type": "string",
          "example": "Casa"
        },
        "num": {
          "type": "string",
          "example": "258"
        },
        "city": {
          "type": "string",
          "example": "Pelotas"
        },
        "stateCode": {
          "type": "string",
          "example": "RS"
        },
        "zipCode": {
          "type": "string",
          "example": "00000000"
        }
      },
      "required": [
        "email",
        "doc",
        "username",
        "password"
      ]
    }
  }
}