<svg width="419" height="352" xmlns="http://www.w3.org/2000/svg">
 <!-- Created with Method Draw - http://github.com/duopixel/Method-Draw/ -->

 <g>
  <title>background</title>
  <rect fill="none" id="canvas_background" height="354" width="421" y="-1" x="-1"/>
  <g display="none" overflow="visible" y="0" x="0" height="100%" width="100%" id="canvasGrid">
   <rect fill="url(#gridpattern)" stroke-width="0" y="0" x="0" height="100%" width="100%"/>
  </g>
 </g>
 <g>
  <title>Layer 1</title>
  <metadata transform="matrix(0.14512472195960502,0,0,0.14512472195960502,0,0) ">Created by potrace 1.13, written by Peter Selinger 2001-2015</metadata>
  <g stroke="null" id="svg_6">
   <g id="svg_4" fill="#3A5BE2" transform="matrix(0.12503120012168584,0,0,-0.12535216134910937,-1917.1835032272609,-840.1448246296517) ">
    <path stroke="white" id="svg_5" d="m15538.223907,-6736.820728c-100,-33 -146,-58 -164,-89c-18,-31 -18,-40 -8,-140c7,-58 12,-140 13,-181c1,-41 4,-86 8,-100l7,-25l7,27c4,15 7,96 6,181c-1,97 3,162 10,175c18,35 45,36 80,3c47,-44 65,-47 106,-14c19,15 33,33 31,40c-4,9 2,10 22,3l27,-10l-30,25c-50,42 -18,28 98,-42c61,-37 132,-77 157,-90c36,-19 39,-23 16,-18c-26,5 -28,4 -17,-9c10,-11 10,-23 3,-44c-7,-20 -6,-57 4,-122c8,-51 12,-95 10,-97c-2,-2 -28,15 -57,39c-121,97 -146,113 -79,50c65,-61 65,-61 35,-62c-24,0 -31,-4 -31,-20c0,-11 5,-20 11,-20c31,-1 -34,-21 -130,-39c-60,-12 -121,-24 -133,-27c-17,-3 -23,-1 -20,8c3,7 11,14 19,14c31,3 33,5 19,14c-8,5 -20,24 -26,42l-11,33l-7,-40c-4,-22 -12,-46 -18,-52c-7,-9 -6,-23 1,-45c13,-38 117,-225 139,-250c8,-9 46,-30 85,-45l71,-28l-40,-11c-36,-10 -39,-13 -36,-44c2,-17 28,-101 57,-184c52,-150 54,-156 64,-317c6,-101 7,-181 1,-209c-12,-61 -12,-127 0,-135c6,-3 10,-16 10,-27c0,-23 134,-158 156,-158c7,0 56,-54 109,-120c54,-66 98,-120 100,-120c5,0 269,303 295,338c24,32 50,42 50,20c0,-12 27,-78 182,-451c22,-53 44,-99 47,-102c4,-2 24,10 45,27c28,23 40,28 49,19c8,-8 8,-14 0,-22c-6,-6 -9,-17 -7,-23c2,-6 -4,-21 -15,-33c-11,-11 -17,-24 -14,-27c4,-3 1,-6 -6,-6c-19,0 -5,-65 24,-116c41,-70 144,-95 231,-55c57,26 97,105 91,180c-3,29 -12,60 -21,70c-9,10 -16,23 -16,29c0,21 21,13 51,-19c16,-18 31,-30 33,-28c3,2 24,54 49,114c171,421 182,445 195,445c4,0 46,-44 92,-97c47,-53 118,-134 159,-179l74,-83l21,27c11,15 27,33 34,41c7,7 44,51 83,96c75,89 78,101 54,181c-8,27 -15,62 -15,78l0,29l19,-24c10,-14 21,-36 23,-49c3,-21 7,-16 20,25l17,50l0,-45c0,-25 -6,-63 -14,-85c-25,-70 -17,-68 53,13c37,44 68,78 70,77c2,-2 -4,-18 -14,-37c-14,-28 -15,-31 -1,-20c8,7 23,29 32,49c15,31 16,44 5,115c-9,56 -11,131 -6,242l7,161l60,178c58,170 66,216 35,204c-9,-4 -16,1 -18,11c-3,12 13,25 57,47c57,29 63,35 117,130c89,155 94,170 74,252c-14,61 -46,242 -46,268c0,6 -5,3 -11,-5c-8,-12 -10,-9 -6,12l4,27l-46,-37c-26,-20 -102,-84 -169,-141c-126,-108 -159,-128 -148,-88c4,12 9,59 13,105c5,72 4,84 -12,96c-17,12 -17,14 6,31l24,17l-30,-6c-29,-5 -29,-5 -5,6c14,6 84,47 156,90c142,84 187,105 144,68c-25,-21 -25,-22 -2,-17c18,4 22,1 22,-17c0,-25 28,-56 51,-56c24,1 49,26 51,54c1,14 6,26 11,26c23,0 77,-34 84,-53c4,-12 7,-96 5,-187c-2,-126 0,-162 9,-153c6,6 15,64 20,130c4,65 11,147 14,183c9,95 -8,117 -120,158c-48,18 -94,32 -102,32c-40,0 -397,-170 -608,-290c-119,-68 -121,-68 -170,-60c-27,5 -73,9 -102,9c-28,1 -54,5 -57,10c-3,4 -47,11 -98,15c-51,3 -120,10 -153,16c-33,5 -117,13 -186,16c-128,7 -175,3 -463,-37c-76,-11 -173,-23 -216,-26l-77,-6l-114,66c-208,119 -569,289 -609,286c-8,0 -26,-4 -40,-9zm685,-475c16,-51 16,-50 25,-35c7,10 10,-5 10,-46c0,-47 -4,-63 -15,-68c-9,-3 -18,1 -21,9c-7,17 -34,20 -34,4c0,-16 -56,-4 -180,37c-12,4 -12,7 -1,13c10,7 8,11 -9,16c-20,6 -21,9 -7,16c20,12 197,68 215,68c7,1 15,-6 17,-14zm1699,-17c55,-17 104,-34 108,-37c4,-3 -1,-16 -10,-28c-12,-16 -44,-29 -112,-47c-91,-23 -95,-23 -98,-5c-5,27 -19,23 -26,-6c-13,-51 -26,-24 -26,53c1,70 2,75 15,58c14,-19 15,-19 15,5c0,48 3,48 134,7zm-1618,-564c-8,-93 -18,-178 -22,-188c-7,-18 -8,-18 -16,3c-4,12 -12,19 -18,16c-18,-11 -69,28 -120,91c-48,59 -68,102 -36,75c10,-9 16,-9 21,-1c4,6 4,14 1,17c-3,3 -1,12 5,19c6,8 9,21 5,29c-4,11 9,22 50,40c31,14 58,25 60,25c2,0 4,-10 4,-22c0,-19 2,-20 10,-8c16,26 63,80 67,77c1,-2 -4,-80 -11,-173zm1442,124c14,-13 22,-18 18,-11c-14,25 14,21 75,-9c35,-17 67,-36 71,-42c4,-6 6,-28 4,-48c-3,-32 -1,-36 10,-27c29,24 12,-7 -41,-72c-51,-63 -95,-92 -112,-75c-4,3 -14,-1 -23,-9c-16,-15 -18,-12 -23,32c-12,94 -20,283 -12,283c5,0 20,-10 33,-22zm-1170,-530c105,-10 118,-14 148,-41c46,-39 56,-82 52,-217l-3,-114l-40,-26c-22,-15 -62,-32 -90,-38c-43,-9 -56,-8 -90,8c-22,10 -53,21 -70,25c-31,6 -175,139 -175,161c0,6 -8,18 -18,27c-13,12 -18,33 -19,75c-2,54 1,62 30,90c68,66 89,69 275,50zm1029,-36c69,-36 83,-62 83,-156c0,-82 0,-82 -37,-117c-47,-44 -118,-99 -129,-99c-4,0 -15,-7 -25,-16c-22,-20 -74,-22 -158,-6c-75,13 -105,31 -127,73c-21,42 -31,172 -14,203c7,13 10,30 8,38c-7,19 18,65 45,80c26,15 153,27 247,23c43,-1 79,-9 107,-23z" stroke-width="11"/>
   </g>
  </g>
 </g>
</svg>
