mn	label	M	H	S	h	p	o	h+	p+	s	t	b	r	_	,
1	M1/HS1b/MH1	1	1	1	0	0	0	0	0	0	0	1	0	0	0
2	M1/H1(S1/M1), M2p/MS1	1	1	1	0	1	0	1	1	0	0	0	0	0	1
3	M1/HS1b/MH1	1	1	1	0	0	0	0	0	0	0	1	0	0	0
4	M1/MH1/M1, MH3p/S1	1	1	1	0	1	0	1	1	0	0	0	0	0	1
5	M1/MHS1(S1/M1)	1	1	1	0	0	0	0	0	0	0	0	0	0	0
6	M1/MHS1(S1/M1)	1	1	1	0	0	0	0	0	0	0	0	0	0	0
7	2p[M1/M1]	1	0	0	0	1	0	1	1	0	0	0	0	0	0
8	2p[M1/M1], M2p/M1	1	0	0	0	1	0	1	1	0	0	0	0	0	1
9	M1/HS1(S1/M1)	1	1	1	0	0	0	0	0	0	0	0	0	0	0
10	M1/HS1(S1/M1)	1	1	1	0	0	0	0	0	0	0	0	0	0	0
11	M1/HS1(S1/M1)	1	1	1	0	0	0	0	0	0	0	0	0	0	0
12	M1/MHS1(S1/M1)	1	1	1	0	0	0	0	0	0	0	0	0	0	0
13	3_[M1/H2h], M1/H2h	1	1	0	1	0	0	1	0	0	0	0	0	1	1
14	1[M1_/M1_]	1	0	0	0	0	0	0	0	0	0	0	0	1	0
15	1[M1_/M1_]	1	0	0	0	0	0	0	0	0	0	0	0	1	0
16	M1, 2[M1r/HS1b(S1/M1)/M1_]	1	1	1	0	0	0	0	0	0	0	1	1	1	1
17	3[M1/HS1(S1/M1)/M1_]	1	1	1	0	0	0	0	0	0	0	0	0	1	0
18	M1/HS1(M1/S1), 2[M1r/HS1b/M1_]	1	1	1	0	0	0	0	0	0	0	1	1	1	1
19	M1/HS1b/M1, M1s/M1r	1	1	1	0	0	0	0	0	1	0	1	1	0	1
20	M1s/M1, M1/S2pb	1	0	1	0	1	0	1	1	1	0	1	0	0	1
21	M1/S2pb, M1/S1t/M1	1	0	1	0	1	0	1	1	0	1	1	0	0	1
22	M1/H2h	1	1	0	1	0	0	1	0	0	0	0	0	0	0
23	1[M1s/H2h_]	1	1	0	1	0	0	1	0	1	0	0	0	1	0
24	M1/HS1b/MH1	1	1	1	0	0	0	0	0	0	0	1	0	0	0
25	M1/H1(S1/M1), M2p/MS1	1	1	1	0	1	0	1	1	0	0	0	0	0	1
26	M1/HS1b/MH1	1	1	1	0	0	0	0	0	0	0	1	0	0	0
27	3[M1/MH1/MH1_]	1	1	0	0	0	0	0	0	0	0	0	0	1	0
28	M1/MHS1(S1/M1)	1	1	1	0	0	0	0	0	0	0	0	0	0	0
29	M1/MHS1(S1/M1)	1	1	1	0	0	0	0	0	0	0	0	0	0	0
30	2p[M1/M1]	1	0	0	0	1	0	1	1	0	0	0	0	0	0
31	2p[M1/M1], M2p/M1s	1	0	0	0	1	0	1	1	1	0	0	0	0	1
32	M1/HS1(S1/M1)	1	1	1	0	0	0	0	0	0	0	0	0	0	0
33	M1/HS1(S1/M1)	1	1	1	0	0	0	0	0	0	0	0	0	0	0
34	M1/HS1(S1/M1)	1	1	1	0	0	0	0	0	0	0	0	0	0	0
35	M1/HS1(S1/M1)	1	1	1	0	0	0	0	0	0	0	0	0	0	0
36	M1/H2h	1	1	0	1	0	0	1	0	0	0	0	0	0	0
37	1[M1_/S1], 2ps[MS1s/MS1s]	1	0	1	0	1	0	1	1	1	0	0	0	1	1
38	M1/HS1b/M1	1	1	1	0	0	0	0	0	0	0	1	0	0	0
39	M1/M1/MH1/M1, MH3p/S1	1	1	1	0	1	0	1	1	0	0	0	0	0	1
