mn	label	M	H	S	h	p	o	h+	p+	s	t	b	r	_	,
1	HS4h	0	1	1	1	0	0	1	0	0	0	0	0	0	0
2	HS3(H2h/S1), M1	1	1	1	1	0	0	1	0	0	0	0	0	0	1
3	M1/HS3hr	1	1	1	1	0	0	1	0	0	0	0	1	0	0
4	3[M1_/HS3hr]	1	1	1	1	0	0	1	0	0	0	0	1	1	0
5	M1/HS3hr	1	1	1	1	0	0	1	0	0	0	0	1	0	0
6	M1/HS3hr	1	1	1	1	0	0	1	0	0	0	0	1	0	0
7	1[M1/H3h_]	1	1	0	1	0	0	1	0	0	0	0	0	1	0
8	M1/HS1(S1/M1)	1	1	1	0	0	0	0	0	0	0	0	0	0	0
9	2[H2p/M1]	1	1	0	0	1	0	1	1	0	0	0	0	0	0
10	1[M1/H3h_]	1	1	0	1	0	0	1	0	0	0	0	0	1	0
11	M1/HS1(S1/M1)	1	1	1	0	0	0	0	0	0	0	0	0	0	0
12	2[H2p/M1]	1	1	0	0	1	0	1	1	0	0	0	0	0	0
13	MH1/M2o	1	1	0	0	0	1	1	1	0	0	0	0	0	0
14	2[MH1/M2o_]	1	1	0	0	0	1	1	1	0	0	0	0	1	0
15	MH1/M2o	1	1	0	0	0	1	1	1	0	0	0	0	0	0
16	2[MH1/M2o_]	1	1	0	0	0	1	1	1	0	0	0	0	1	0
17	2[MH1/M2o_]	1	1	0	0	0	1	1	1	0	0	0	0	1	0
18	MH1/M2o	1	1	0	0	0	1	1	1	0	0	0	0	0	0
19	MH1/M2o	1	1	0	0	0	1	1	1	0	0	0	0	0	0
20	MH1/M2o	1	1	0	0	0	1	1	1	0	0	0	0	0	0
21	MH1/M2o	1	1	0	0	0	1	1	1	0	0	0	0	0	0
22	MH1/M2o	1	1	0	0	0	1	1	1	0	0	0	0	0	0
23	2[MHS1s/M2o_]	1	1	1	0	0	1	1	1	1	0	0	0	1	0
24	MHS1s	1	1	1	0	0	0	0	0	1	0	0	0	0	0
25	2[MHS1s/M2o_]	1	1	1	0	0	1	1	1	1	0	0	0	1	0
26	MH3(M2p/S1t), _	1	1	0	0	1	0	1	1	0	1	0	0	1	1
27	MH2o	1	1	0	0	0	1	1	1	0	0	0	0	0	0
28	M1s	1	0	0	0	0	0	0	0	1	0	0	0	0	0
29	M2ps	1	0	0	0	1	0	1	1	1	0	0	0	0	0
30	M1/MH1(M1/S1)	1	1	0	0	0	0	0	0	0	0	0	0	0	0
31	MH2o	1	1	0	0	0	1	1	1	0	0	0	0	0	0
32	M1s	1	0	0	0	0	0	0	0	1	0	0	0	0	0
33	M2ps	1	0	0	0	1	0	1	1	1	0	0	0	0	0
34	M1/MH1	1	1	0	0	0	0	0	0	0	0	0	0	0	0
35	1[M1/M2o_]	1	0	0	0	0	1	1	1	0	0	0	0	1	0
36	1[M1/M2o_]	1	0	0	0	0	1	1	1	0	0	0	0	1	0
37	1[M1/M2o_]	1	0	0	0	0	1	1	1	0	0	0	0	1	0
38	1[M1/M2o_]	1	0	0	0	0	1	1	1	0	0	0	0	1	0
39	1[M1/M2o_]	1	0	0	0	0	1	1	1	0	0	0	0	1	0
40	2[M1/M1s/M2o_]	1	0	0	0	0	1	1	1	1	0	0	0	1	0
41	2[M1/M1s]	1	0	0	0	0	0	0	0	1	0	0	0	0	0
42	M1/M1/M1	1	0	0	0	0	0	0	0	0	0	0	0	0	0
43	1[M1/H1]	1	1	0	0	0	0	0	0	0	0	0	0	0	0
44	1[M1/H1]	1	1	0	0	0	0	0	0	0	0	0	0	0	0
45	1[M1/H1]	1	1	0	0	0	0	0	0	0	0	0	0	0	0
46	M1/HS2hr	1	1	1	1	0	0	1	0	0	0	0	1	0	0
47	3[M1/H3h]	1	1	0	1	0	0	1	0	0	0	0	0	0	0
48	1[M1/H1]	1	1	0	0	0	0	0	0	0	0	0	0	0	0
49	1[M1/H1]	1	1	0	0	0	0	0	0	0	0	0	0	0	0
50	1[M1/H1]	1	1	0	0	0	0	0	0	0	0	0	0	0	0
51	H1	0	1	0	0	0	0	0	0	0	0	0	0	0	0
52	H1	0	1	0	0	0	0	0	0	0	0	0	0	0	0
53	M1/MH2	1	1	0	0	0	0	0	0	0	0	0	0	0	0
54	M1/HS1(S1/M1)	1	1	1	0	0	0	0	0	0	0	0	0	0	0
55	M1/HS1(S1/M1)	1	1	1	0	0	0	0	0	0	0	0	0	0	0
56	MHS5h, _	1	1	1	1	0	0	1	0	0	0	0	0	1	1
57	1[H2h_/MHS1s]	1	1	1	1	0	0	1	0	1	0	0	0	1	0
58	1[H2p/M1_]	1	1	0	0	1	0	1	1	0	0	0	0	1	0
59	1[H2p_/MHS1]	1	1	1	0	1	0	1	1	0	0	0	0	1	0
60	1[H2p/M1_]	1	1	0	0	1	0	1	1	0	0	0	0	1	0
61	M1t/M1	1	0	0	0	0	0	0	0	0	1	0	0	0	0
62	M1/M1t	1	0	0	0	0	0	0	0	0	1	0	0	0	0
63	M1t/M1/H2p	1	1	0	0	1	0	1	1	0	1	0	0	0	0
64	M1/M1/H2h	1	1	0	1	0	0	1	0	0	0	0	0	0	0
65	M1t/M1/H2p	1	1	0	0	1	0	1	1	0	1	0	0	0	0
66	M1/M1/H2ht, _	1	1	0	1	0	0	1	0	0	1	0	0	1	1
67	MHS2o	1	1	1	0	0	1	1	1	0	0	0	0	0	0
68	M1s	1	0	0	0	0	0	0	0	1	0	0	0	0	0
69	H4h_/MH2o	1	1	0	1	0	1	1	1	0	0	0	0	1	0
70	M1s	1	0	0	0	0	0	0	0	1	0	0	0	0	0
71	H4h_/MH2o	1	1	0	1	0	1	1	1	0	0	0	0	1	0
72	M1s	1	0	0	0	0	0	0	0	1	0	0	0	0	0
73	H4h_/MH2o	1	1	0	1	0	1	1	1	0	0	0	0	1	0
74	M1s	1	0	0	0	0	0	0	0	1	0	0	0	0	0
75	H6h(H4h/MH2o), H2p	0	1	0	1	1	1	1	1	0	0	0	0	0	1
76	H6h(H4h/MH2o), H2p	0	1	0	1	1	1	1	1	0	0	0	0	0	1
77	H6h(H4h/MH2o), H2p	0	1	0	1	1	1	1	1	0	0	0	0	0	1
78	M1/S2ot	1	0	1	0	0	1	1	1	0	1	0	0	0	0
79	M1/S2ot	1	0	1	0	0	1	1	1	0	1	0	0	0	0
80	2[M1/H3h_]	1	1	0	1	0	0	1	0	0	0	0	0	1	0
81	2[M1/H3h_]	1	1	0	1	0	0	1	0	0	0	0	0	1	0
82	2[M1/H3h_]	1	1	0	1	0	0	1	0	0	0	0	0	1	0
83	HS4h	0	1	1	1	0	0	1	0	0	0	0	0	0	0
84	HS3(H2h/S1), M1	1	1	1	1	0	0	1	0	0	0	0	0	0	1
85	M1/HS3hr	1	1	1	1	0	0	1	0	0	0	0	1	0	0
86	3[M1_/HS3hr]	1	1	1	1	0	0	1	0	0	0	0	1	1	0
87	M1/HS3hr	1	1	1	1	0	0	1	0	0	0	0	1	0	0
88	M1/HS3hr	1	1	1	1	0	0	1	0	0	0	0	1	0	0
89	1[M1/H3h_]	1	1	0	1	0	0	1	0	0	0	0	0	1	0
90	M1/HS1(S1/M1)	1	1	1	0	0	0	0	0	0	0	0	0	0	0
91	2[H2p/M1]	1	1	0	0	1	0	1	1	0	0	0	0	0	0
92	1[M1/H3h_]	1	1	0	1	0	0	1	0	0	0	0	0	1	0
93	M1/HS1(S1/M1)	1	1	1	0	0	0	0	0	0	0	0	0	0	0
94	2[H2p/M1]	1	1	0	0	1	0	1	1	0	0	0	0	0	0
95	MH1/M2o	1	1	0	0	0	1	1	1	0	0	0	0	0	0
96	2[MH1/M2o_]	1	1	0	0	0	1	1	1	0	0	0	0	1	0
97	MH1/M2o	1	1	0	0	0	1	1	1	0	0	0	0	0	0
98	2[MH1/M2o_]	1	1	0	0	0	1	1	1	0	0	0	0	1	0
99	2[MH1/M2o_]	1	1	0	0	0	1	1	1	0	0	0	0	1	0
100	MH1/M2o	1	1	0	0	0	1	1	1	0	0	0	0	0	0
101	MH1/M2o	1	1	0	0	0	1	1	1	0	0	0	0	0	0
102	MH1/M2o	1	1	0	0	0	1	1	1	0	0	0	0	0	0
103	MH1/M1	1	1	0	0	0	0	0	0	0	0	0	0	0	0
104	MH1/M2o	1	1	0	0	0	1	1	1	0	0	0	0	0	0
105	2[MHS1s/M2o_]	1	1	1	0	0	1	1	1	1	0	0	0	1	0
106	MHS1s	1	1	1	0	0	0	0	0	1	0	0	0	0	0
107	2[MHS1s/M2o_]	1	1	1	0	0	1	1	1	1	0	0	0	1	0
108	MH3(M2p/S1t), _	1	1	0	0	1	0	1	1	0	1	0	0	1	1
109	MH2o	1	1	0	0	0	1	1	1	0	0	0	0	0	0
110	M1s	1	0	0	0	0	0	0	0	1	0	0	0	0	0
111	M2ps	1	0	0	0	1	0	1	1	1	0	0	0	0	0
112	M1/MH1(M1/S1)	1	1	0	0	0	0	0	0	0	0	0	0	0	0
113	MH2o	1	1	0	0	0	1	1	1	0	0	0	0	0	0
114	M1s	1	0	0	0	0	0	0	0	1	0	0	0	0	0
115	M2ps	1	0	0	0	1	0	1	1	1	0	0	0	0	0
116	M1/MH1	1	1	0	0	0	0	0	0	0	0	0	0	0	0
117	M1s/M2o	1	0	0	0	0	1	1	1	1	0	0	0	0	0
118	M2o/M1s	1	0	0	0	0	1	1	1	1	0	0	0	0	0
119	M1s/M2o	1	0	0	0	0	1	1	1	1	0	0	0	0	0
120	M2o/M1s	1	0	0	0	0	1	1	1	1	0	0	0	0	0
121	M2ps/M2o_	1	0	0	0	1	1	1	1	1	0	0	0	1	0
122	M2ps	1	0	0	0	1	0	1	1	1	0	0	0	0	0
123	1[M1/M2o_]	1	0	0	0	0	1	1	1	0	0	0	0	1	0
124	1[M1/M2o_]	1	0	0	0	0	1	1	1	0	0	0	0	1	0
125	1[M1/M2o_]	1	0	0	0	0	1	1	1	0	0	0	0	1	0
126	1[M1/M2o_]	1	0	0	0	0	1	1	1	0	0	0	0	1	0
127	1[M1/M2o_]	1	0	0	0	0	1	1	1	0	0	0	0	1	0
128	2[M1/M1s/M2o_]	1	0	0	0	0	1	1	1	1	0	0	0	1	0
129	2[M1/M1s]	1	0	0	0	0	0	0	0	1	0	0	0	0	0
130	M1/M1/M1	1	0	0	0	0	0	0	0	0	0	0	0	0	0
131	1[M1/H1]	1	1	0	0	0	0	0	0	0	0	0	0	0	0
132	1[M1/H1]	1	1	0	0	0	0	0	0	0	0	0	0	0	0
133	1[M1/H1]	1	1	0	0	0	0	0	0	0	0	0	0	0	0
134	M1/HS2hr	1	1	1	1	0	0	1	0	0	0	0	1	0	0
135	3[M1/H3h]	1	1	0	1	0	0	1	0	0	0	0	0	0	0
136	1[M1/H1]	1	1	0	0	0	0	0	0	0	0	0	0	0	0
137	1[M1/H1]	1	1	0	0	0	0	0	0	0	0	0	0	0	0
138	1[M1/H1]	1	1	0	0	0	0	0	0	0	0	0	0	0	0
139	H1	0	1	0	0	0	0	0	0	0	0	0	0	0	0
140	H1	0	1	0	0	0	0	0	0	0	0	0	0	0	0
141	M1, MH3h	1	1	0	1	0	0	1	0	0	0	0	0	0	1
142	M1/HS1(S1/M1)	1	1	1	0	0	0	0	0	0	0	0	0	0	0
143	M1/HS1(S1/M1)	1	1	1	0	0	0	0	0	0	0	0	0	0	0
144	MHS5h, _	1	1	1	1	0	0	1	0	0	0	0	0	1	1
