[
  {
    "date": 0.24,
    "onset": 0.0
  },
  {
    "date": 2.49,
    "onset": 2.0
  },
  {
    "date": 4.85,
    "onset": 4.0
  },
  {
    "date": 7.22,
    "onset": 6.0
  },
  {
    "date": 9.64,
    "onset": 8.0
  },
  {
    "date": 11.82,
    "onset": 10.0
  },
  {
    "date": 14.15,
    "onset": 12.0
  },
  {
    "date": 16.4,
    "onset": 14.0
  },
  {
    "date": 18.54,
    "onset": 16.0
  },
  {
    "date": 20.78,
    "onset": 18.0
  },
  {
    "date": 23.09,
    "onset": 20.0
  },
  {
    "date": 25.35,
    "onset": 22.0
  },
  {
    "date": 27.53,
    "onset": 24.0
  },
  {
    "date": 29.78,
    "onset": 26.0
  },
  {
    "date": 31.95,
    "onset": 28.0
  },
  {
    "date": 34.36,
    "onset": 30.0
  },
  {
    "date": 36.51,
    "onset": 32.0
  },
  {
    "date": 38.87,
    "onset": 34.0
  },
  {
    "date": 41.15,
    "onset": 36.0
  },
  {
    "date": 43.4,
    "onset": 38.0
  },
  {
    "date": 45.67,
    "onset": 40.0
  },
  {
    "date": 48.04,
    "onset": 42.0
  },
  {
    "date": 50.5,
    "onset": 44.0
  },
  {
    "date": 53.01,
    "onset": 46.0
  },
  {
    "date": 55.45,
    "onset": 48.0
  },
  {
    "date": 57.92,
    "onset": 50.0
  },
  {
    "date": 60.29,
    "onset": 52.0
  },
  {
    "date": 62.6,
    "onset": 54.0
  },
  {
    "date": 64.78,
    "onset": 56.0
  },
  {
    "date": 67.11,
    "onset": 58.0
  },
  {
    "date": 69.54,
    "onset": 60.0
  },
  {
    "date": 71.96,
    "onset": 62.0
  },
  {
    "date": 74.07,
    "onset": 64.0
  },
  {
    "date": 76.23,
    "onset": 66.0
  },
  {
    "date": 78.62,
    "onset": 68.0
  },
  {
    "date": 80.93,
    "onset": 70.0
  },
  {
    "date": 83.41,
    "onset": 72.0
  },
  {
    "date": 85.6,
    "onset": 74.0
  },
  {
    "date": 87.85,
    "onset": 76.0
  },
  {
    "date": 90.2,
    "onset": 78.0
  },
  {
    "date": 92.35,
    "onset": 80.0
  },
  {
    "date": 94.65,
    "onset": 82.0
  },
  {
    "date": 96.9,
    "onset": 84.0
  },
  {
    "date": 99.14,
    "onset": 86.0
  },
  {
    "date": 101.35,
    "onset": 88.0
  },
  {
    "date": 103.61,
    "onset": 90.0
  },
  {
    "date": 105.91,
    "onset": 92.0
  },
  {
    "date": 108.35,
    "onset": 94.0
  },
  {
    "date": 110.68,
    "onset": 96.0
  },
  {
    "date": 112.94,
    "onset": 98.0
  },
  {
    "date": 115.19,
    "onset": 100.0
  },
  {
    "date": 117.41,
    "onset": 102.0
  },
  {
    "date": 119.69,
    "onset": 104.0
  },
  {
    "date": 121.96,
    "onset": 106.0
  },
  {
    "date": 124.37,
    "onset": 108.0
  },
  {
    "date": 126.78,
    "onset": 110.0
  },
  {
    "date": 129.22,
    "onset": 112.0
  },
  {
    "date": 131.61,
    "onset": 114.0
  },
  {
    "date": 133.91,
    "onset": 116.0
  },
  {
    "date": 136.19,
    "onset": 118.0
  },
  {
    "date": 138.39,
    "onset": 120.0
  },
  {
    "date": 140.56,
    "onset": 122.0
  },
  {
    "date": 142.81,
    "onset": 124.0
  },
  {
    "date": 145.1,
    "onset": 126.0
  },
  {
    "date": 147.25,
    "onset": 128.0
  },
  {
    "date": 149.41,
    "onset": 130.0
  },
  {
    "date": 151.61,
    "onset": 132.0
  },
  {
    "date": 153.84,
    "onset": 134.0
  },
  {
    "date": 156.26,
    "onset": 136.0
  },
  {
    "date": 158.35,
    "onset": 138.0
  },
  {
    "date": 160.56,
    "onset": 140.0
  },
  {
    "date": 162.8,
    "onset": 142.0
  },
  {
    "date": 164.97,
    "onset": 144.0
  },
  {
    "date": 167.19,
    "onset": 146.0
  },
  {
    "date": 169.35,
    "onset": 148.0
  },
  {
    "date": 171.53,
    "onset": 150.0
  },
  {
    "date": 173.74,
    "onset": 152.0
  },
  {
    "date": 175.93,
    "onset": 154.0
  },
  {
    "date": 178.12,
    "onset": 156.0
  },
  {
    "date": 180.52,
    "onset": 158.0
  },
  {
    "date": 182.68,
    "onset": 160.0
  },
  {
    "date": 185.05,
    "onset": 162.0
  },
  {
    "date": 187.29,
    "onset": 164.0
  },
  {
    "date": 189.56,
    "onset": 166.0
  },
  {
    "date": 191.87,
    "onset": 168.0
  },
  {
    "date": 194.22,
    "onset": 170.0
  },
  {
    "date": 196.58,
    "onset": 172.0
  },
  {
    "date": 199.0,
    "onset": 174.0
  },
  {
    "date": 201.56,
    "onset": 176.0
  },
  {
    "date": 203.95,
    "onset": 178.0
  },
  {
    "date": 206.3,
    "onset": 180.0
  },
  {
    "date": 208.63,
    "onset": 182.0
  },
  {
    "date": 210.86,
    "onset": 184.0
  },
  {
    "date": 213.22,
    "onset": 186.0
  },
  {
    "date": 215.56,
    "onset": 188.0
  },
  {
    "date": 217.92,
    "onset": 190.0
  },
  {
    "date": 220.24,
    "onset": 192.0
  },
  {
    "date": 222.53,
    "onset": 194.0
  },
  {
    "date": 224.86,
    "onset": 196.0
  },
  {
    "date": 227.23,
    "onset": 198.0
  },
  {
    "date": 229.72,
    "onset": 200.0
  },
  {
    "date": 232.02,
    "onset": 202.0
  },
  {
    "date": 234.71,
    "onset": 204.0
  },
  {
    "date": 237.4,
    "onset": 206.0
  },
  {
    "date": 239.74,
    "onset": 208.0
  },
  {
    "date": 242.22,
    "onset": 210.0
  },
  {
    "date": 244.55,
    "onset": 212.0
  },
  {
    "date": 246.99,
    "onset": 214.0
  },
  {
    "date": 249.25,
    "onset": 216.0
  },
  {
    "date": 251.75,
    "onset": 218.0
  },
  {
    "date": 254.18,
    "onset": 220.0
  },
  {
    "date": 256.64,
    "onset": 222.0
  },
  {
    "date": 259.07,
    "onset": 224.0
  },
  {
    "date": 261.55,
    "onset": 226.0
  },
  {
    "date": 264.03,
    "onset": 228.0
  },
  {
    "date": 266.52,
    "onset": 230.0
  },
  {
    "date": 268.84,
    "onset": 232.0
  },
  {
    "date": 271.72,
    "onset": 234.0
  },
  {
    "date": 274.46,
    "onset": 236.0
  },
  {
    "date": 277.0,
    "onset": 238.0
  },
  {
    "date": 279.51,
    "onset": 240.0
  },
  {
    "date": 282.05,
    "onset": 242.0
  },
  {
    "date": 284.5,
    "onset": 244.0
  },
  {
    "date": 286.95,
    "onset": 246.0
  },
  {
    "date": 289.6,
    "onset": 248.0
  },
  {
    "date": 292.18,
    "onset": 250.0
  },
  {
    "date": 294.62,
    "onset": 252.0
  },
  {
    "date": 297.13,
    "onset": 254.0
  },
  {
    "date": 299.67,
    "onset": 256.0
  },
  {
    "date": 302.42,
    "onset": 258.0
  },
  {
    "date": 305.78,
    "onset": 260.0
  },
  {
    "date": 308.35,
    "onset": 262.0
  },
  {
    "date": 310.77,
    "onset": 264.0
  },
  {
    "date": 313.18,
    "onset": 266.0
  },
  {
    "date": 315.66,
    "onset": 268.0
  },
  {
    "date": 318.14,
    "onset": 270.0
  },
  {
    "date": 322.06,
    "onset": 272.0
  },
  {
    "date": 324.91,
    "onset": 273.0
  }
]