{
  "pages": [
    {
      "image": "sources/images/scan/image-0-jpg.jpg",
      "rows": [
        {
          "y": 1026,
          "height": 312,
          "onset-x": [
            {
              "onset": 0,
              "x": 790
            },
            {
              "onset": 3,
              "x": 1169
            },
            {
              "onset": 6,
              "x": 1393
            },
            {
              "onset": 9,
              "x": 1651
            },
            {
              "onset": 12,
              "x": 1903
            },
            {
              "onset": 15,
              "x": 2246
            },
            {
              "onset": 18,
              "x": 2577
            },
            {
              "onset": 21,
              "x": 2885
            }
          ],
          "start-x": 790,
          "end-x": 2885
        },
        {
          "y": 1552,
          "height": 573,
          "onset-x": [
            {
              "onset": 21,
              "x": 526
            },
            {
              "onset": 24,
              "x": 1016
            },
            {
              "onset": 27,
              "x": 1463
            },
            {
              "onset": 30,
              "x": 1931
            },
            {
              "onset": 33,
              "x": 2434
            },
            {
              "onset": 36,
              "x": 2882
            }
          ],
          "start-x": 526,
          "end-x": 2882
        },
        {
          "y": 2337,
          "height": 569,
          "onset-x": [
            {
              "onset": 36,
              "x": 528
            },
            {
              "onset": 39,
              "x": 1200
            },
            {
              "onset": 42,
              "x": 1747
            },
            {
              "onset": 45,
              "x": 2337
            },
            {
              "onset": 48,
              "x": 2879
            }
          ],
          "start-x": 529,
          "end-x": 2879
        },
        {
          "y": 3121,
          "height": 570,
          "onset-x": [
            {
              "onset": 48,
              "x": 526
            },
            {
              "onset": 51,
              "x": 1095
            },
            {
              "onset": 54,
              "x": 1533
            },
            {
              "onset": 57,
              "x": 2007
            },
            {
              "onset": 60,
              "x": 2443
            },
            {
              "onset": 63,
              "x": 2879
            }
          ],
          "start-x": 529,
          "end-x": 2879
        }
      ]
    },
    {
      "image": "sources/images/scan/image-1-jpg.jpg",
      "rows": [
        {
          "y": 676,
          "height": 603,
          "onset-x": [
            {
              "onset": 63,
              "x": 587
            },
            {
              "onset": 66,
              "x": 1188
            },
            {
              "onset": 69,
              "x": 1716
            },
            {
              "onset": 72,
              "x": 2200
            },
            {
              "onset": 75,
              "x": 2583
            },
            {
              "onset": 78,
              "x": 2954
            }
          ],
          "start-x": 587,
          "end-x": 2954
        },
        {
          "y": 1507,
          "height": 603,
          "onset-x": [
            {
              "onset": 78,
              "x": 583
            },
            {
              "onset": 81,
              "x": 1051
            },
            {
              "onset": 84,
              "x": 1348
            },
            {
              "onset": 87,
              "x": 1674
            },
            {
              "onset": 90,
              "x": 1971
            },
            {
              "onset": 93,
              "x": 2288
            },
            {
              "onset": 96,
              "x": 2592
            },
            {
              "onset": 99,
              "x": 2941
            }
          ],
          "start-x": 582,
          "end-x": 2941
        },
        {
          "y": 2336,
          "height": 603,
          "onset-x": [
            {
              "onset": 99,
              "x": 572
            },
            {
              "onset": 102,
              "x": 1020
            },
            {
              "onset": 105,
              "x": 1329
            },
            {
              "onset": 108,
              "x": 1638
            },
            {
              "onset": 111,
              "x": 1994
            },
            {
              "onset": 114,
              "x": 2302
            },
            {
              "onset": 117,
              "x": 2627
            },
            {
              "onset": 120,
              "x": 2931
            }
          ],
          "start-x": 576,
          "end-x": 2931
        },
        {
          "y": 3168,
          "height": 601,
          "onset-x": [
            {
              "onset": 120,
              "x": 570
            },
            {
              "onset": 123,
              "x": 1135
            },
            {
              "onset": 126,
              "x": 1570
            },
            {
              "onset": 129,
              "x": 2042
            },
            {
              "onset": 132,
              "x": 2481
            },
            {
              "onset": 135,
              "x": 2925
            }
          ],
          "start-x": 571,
          "end-x": 2925
        }
      ]
    },
    {
      "image": "sources/images/scan/image-2-jpg.jpg",
      "rows": [
        {
          "y": 594,
          "height": 599,
          "onset-x": [
            {
              "onset": 135,
              "x": 584
            },
            {
              "onset": 138,
              "x": 1161
            },
            {
              "onset": 141,
              "x": 1625
            },
            {
              "onset": 144,
              "x": 2072
            },
            {
              "onset": 147,
              "x": 2509
            },
            {
              "onset": 150,
              "x": 2942
            }
          ],
          "start-x": 582,
          "end-x": 2942
        },
        {
          "y": 1420,
          "height": 597,
          "onset-x": [
            {
              "onset": 150,
              "x": 575
            },
            {
              "onset": 153,
              "x": 1150
            },
            {
              "onset": 156,
              "x": 1561
            },
            {
              "onset": 159,
              "x": 1989
            },
            {
              "onset": 162,
              "x": 2435
            },
            {
              "onset": 165,
              "x": 2940
            }
          ],
          "start-x": 583,
          "end-x": 2940
        },
        {
          "y": 2244,
          "height": 600,
          "onset-x": [
            {
              "onset": 165,
              "x": 580
            },
            {
              "onset": 168,
              "x": 1164
            },
            {
              "onset": 171,
              "x": 1557
            },
            {
              "onset": 174,
              "x": 1950
            },
            {
              "onset": 177,
              "x": 2246
            },
            {
              "onset": 180,
              "x": 2535
            },
            {
              "onset": 183,
              "x": 2935
            }
          ],
          "start-x": 576,
          "end-x": 2935
        },
        {
          "y": 3067,
          "height": 598,
          "onset-x": [
            {
              "onset": 183,
              "x": 580
            },
            {
              "onset": 186,
              "x": 1235
            },
            {
              "onset": 189,
              "x": 1819
            },
            {
              "onset": 192,
              "x": 2375
            },
            {
              "onset": 195,
              "x": 2936
            }
          ],
          "start-x": 579,
          "end-x": 2936
        }
      ]
    },
    {
      "image": "sources/images/scan/image-3-jpg.jpg",
      "rows": [
        {
          "y": 613,
          "height": 517,
          "onset-x": [
            {
              "onset": 195,
              "x": 592
            },
            {
              "onset": 198,
              "x": 1264
            },
            {
              "onset": 201,
              "x": 1855
            },
            {
              "onset": 204,
              "x": 2404
            },
            {
              "onset": 207,
              "x": 2951
            }
          ],
          "start-x": 587,
          "end-x": 2951
        },
        {
          "y": 1336,
          "height": 290,
          "onset-x": [
            {
              "onset": 207,
              "x": 581
            },
            {
              "onset": 210,
              "x": 1139
            },
            {
              "onset": 213,
              "x": 1624
            },
            {
              "onset": 216,
              "x": 2064
            },
            {
              "onset": 219,
              "x": 2503
            },
            {
              "onset": 222,
              "x": 2941
            }
          ],
          "start-x": 579,
          "end-x": 2941
        },
        {
          "y": 1815,
          "height": 512,
          "onset-x": [
            {
              "onset": 222,
              "x": 572
            },
            {
              "onset": 225,
              "x": 1145
            },
            {
              "onset": 228,
              "x": 1567
            },
            {
              "onset": 231,
              "x": 1888
            },
            {
              "onset": 234,
              "x": 2244
            },
            {
              "onset": 237,
              "x": 2573
            },
            {
              "onset": 240,
              "x": 2925
            }
          ],
          "start-x": 565,
          "end-x": 2925
        },
        {
          "y": 2515,
          "height": 508,
          "onset-x": [
            {
              "onset": 240,
              "x": 564
            },
            {
              "onset": 243,
              "x": 1083
            },
            {
              "onset": 246,
              "x": 1432
            },
            {
              "onset": 249,
              "x": 1771
            },
            {
              "onset": 252,
              "x": 2191
            },
            {
              "onset": 255,
              "x": 2532
            },
            {
              "onset": 258,
              "x": 2915
            }
          ],
          "start-x": 559,
          "end-x": 2915
        },
        {
          "y": 3207,
          "height": 506,
          "onset-x": [
            {
              "onset": 258,
              "x": 553
            },
            {
              "onset": 261,
              "x": 981
            },
            {
              "onset": 264,
              "x": 1374
            },
            {
              "onset": 267,
              "x": 1712
            },
            {
              "onset": 270,
              "x": 2008
            },
            {
              "onset": 273,
              "x": 2322
            },
            {
              "onset": 276,
              "x": 2611
            }
          ],
          "start-x": 547,
          "end-x": 2611
        }
      ]
    }
  ]
}