{
  "pages": [
    {
      "image": "Schubert_D911-01_000.png",
      "rows": [
        {
          "y": 197,
          "height": 131,
          "onset-x": [
            {
              "onset": 0,
              "x": 81
            },
            {
              "onset": 2,
              "x": 199
            },
            {
              "onset": 4,
              "x": 290
            },
            {
              "onset": 6,
              "x": 368
            },
            {
              "onset": 8,
              "x": 440
            },
            {
              "onset": 10,
              "x": 523
            },
            {
              "onset": 10,
              "x": 550
            },
            {
              "onset": 10,
              "x": 550
            },
            {
              "onset": 10,
              "x": 550
            },
            {
              "onset": 10,
              "x": 550
            },
            {
              "onset": 12,
              "x": 589
            }
          ],
          "start-x": 81,
          "end-x": 589
        },
        {
          "y": 364,
          "height": 144,
          "onset-x": [
            {
              "onset": 12,
              "x": 90
            },
            {
              "onset": 14,
              "x": 180
            },
            {
              "onset": 16,
              "x": 278
            },
            {
              "onset": 18,
              "x": 387
            },
            {
              "onset": 20,
              "x": 509
            }
          ],
          "start-x": 90,
          "end-x": 591
        },
        {
          "y": 546,
          "height": 143,
          "onset-x": [
            {
              "onset": 22,
              "x": 50
            },
            {
              "onset": 24,
              "x": 180
            },
            {
              "onset": 26,
              "x": 273
            },
            {
              "onset": 28,
              "x": 391
            },
            {
              "onset": 30,
              "x": 482
            }
          ],
          "start-x": 50,
          "end-x": 591
        },
        {
          "y": 721,
          "height": 138,
          "onset-x": [
            {
              "onset": 32,
              "x": 50
            },
            {
              "onset": 34,
              "x": 176
            },
            {
              "onset": 36,
              "x": 295
            },
            {
              "onset": 38,
              "x": 389
            },
            {
              "onset": 40,
              "x": 503
            }
          ],
          "start-x": 50,
          "end-x": 590
        }
      ]
    },
    {
      "image": "Schubert_D911-01_001.png",
      "rows": [
        {
          "y": 48,
          "height": 138,
          "onset-x": [
            {
              "onset": 42,
              "x": 61
            },
            {
              "onset": 44,
              "x": 198
            },
            {
              "onset": 46,
              "x": 267
            },
            {
              "onset": 48,
              "x": 345
            },
            {
              "onset": 50,
              "x": 419
            },
            {
              "onset": 52,
              "x": 510
            }
          ],
          "start-x": 61,
          "end-x": 600
        },
        {
          "y": 223,
          "height": 139,
          "onset-x": [
            {
              "onset": 54,
              "x": 63
            },
            {
              "onset": 56,
              "x": 216
            },
            {
              "onset": 58,
              "x": 298
            },
            {
              "onset": 60,
              "x": 404
            },
            {
              "onset": 62,
              "x": 500
            }
          ],
          "start-x": 63,
          "end-x": 601
        },
        {
          "y": 399,
          "height": 134,
          "onset-x": [
            {
              "onset": 64,
              "x": 64
            },
            {
              "onset": 66,
              "x": 171
            },
            {
              "onset": 68,
              "x": 272
            },
            {
              "onset": 70,
              "x": 360
            },
            {
              "onset": 72,
              "x": 436
            },
            {
              "onset": 74,
              "x": 523
            }
          ],
          "start-x": 64,
          "end-x": 598
        },
        {
          "y": 566,
          "height": 133,
          "onset-x": [
            {
              "onset": 76,
              "x": 64
            },
            {
              "onset": 78,
              "x": 170
            },
            {
              "onset": 80,
              "x": 252
            },
            {
              "onset": 82,
              "x": 343
            },
            {
              "onset": 84,
              "x": 461
            },
            {
              "onset": 86,
              "x": 531
            }
          ],
          "start-x": 64,
          "end-x": 604
        },
        {
          "y": 739,
          "height": 122,
          "onset-x": [
            {
              "onset": 88,
              "x": 65
            },
            {
              "onset": 90,
              "x": 193
            },
            {
              "onset": 92,
              "x": 316
            },
            {
              "onset": 94,
              "x": 406
            },
            {
              "onset": 96,
              "x": 506
            }
          ],
          "start-x": 65,
          "end-x": 605
        }
      ]
    },
    {
      "image": "Schubert_D911-01_002.png",
      "rows": [
        {
          "y": 54,
          "height": 130,
          "onset-x": [
            {
              "onset": 98,
              "x": 57
            },
            {
              "onset": 100,
              "x": 182
            },
            {
              "onset": 102,
              "x": 253
            },
            {
              "onset": 104,
              "x": 342
            },
            {
              "onset": 106,
              "x": 427
            },
            {
              "onset": 108,
              "x": 527
            }
          ],
          "start-x": 57,
          "end-x": 593
        },
        {
          "y": 220,
          "height": 136,
          "onset-x": [
            {
              "onset": 110,
              "x": 55
            },
            {
              "onset": 112,
              "x": 165
            },
            {
              "onset": 114,
              "x": 246
            },
            {
              "onset": 116,
              "x": 338
            },
            {
              "onset": 118,
              "x": 425
            },
            {
              "onset": 120,
              "x": 518
            }
          ],
          "start-x": 55,
          "end-x": 592
        },
        {
          "y": 392,
          "height": 138,
          "onset-x": [
            {
              "onset": 122,
              "x": 54
            },
            {
              "onset": 124,
              "x": 176
            },
            {
              "onset": 126,
              "x": 264
            },
            {
              "onset": 128,
              "x": 356
            },
            {
              "onset": 130,
              "x": 424
            },
            {
              "onset": 132,
              "x": 510
            }
          ],
          "start-x": 54,
          "end-x": 592
        },
        {
          "y": 567,
          "height": 133,
          "onset-x": [
            {
              "onset": 134,
              "x": 53
            },
            {
              "onset": 136,
              "x": 157
            },
            {
              "onset": 138,
              "x": 239
            },
            {
              "onset": 140,
              "x": 316
            },
            {
              "onset": 142,
              "x": 409
            },
            {
              "onset": 144,
              "x": 509
            }
          ],
          "start-x": 53,
          "end-x": 592
        },
        {
          "y": 738,
          "height": 126,
          "onset-x": [
            {
              "onset": 146,
              "x": 52
            },
            {
              "onset": 148,
              "x": 204
            },
            {
              "onset": 150,
              "x": 286
            },
            {
              "onset": 152,
              "x": 390
            },
            {
              "onset": 154,
              "x": 489
            }
          ],
          "start-x": 52,
          "end-x": 592
        }
      ]
    },
    {
      "image": "Schubert_D911-01_003.png",
      "rows": [
        {
          "y": 50,
          "height": 132,
          "onset-x": [
            {
              "onset": 156,
              "x": 61
            },
            {
              "onset": 158,
              "x": 186
            },
            {
              "onset": 160,
              "x": 295
            },
            {
              "onset": 162,
              "x": 384
            },
            {
              "onset": 164,
              "x": 505
            }
          ],
          "start-x": 61,
          "end-x": 598
        },
        {
          "y": 214,
          "height": 138,
          "onset-x": [
            {
              "onset": 166,
              "x": 63
            },
            {
              "onset": 168,
              "x": 216
            },
            {
              "onset": 170,
              "x": 313
            },
            {
              "onset": 172,
              "x": 432
            },
            {
              "onset": 174,
              "x": 509
            }
          ],
          "start-x": 63,
          "end-x": 598
        },
        {
          "y": 385,
          "height": 138,
          "onset-x": [
            {
              "onset": 176,
              "x": 65
            },
            {
              "onset": 178,
              "x": 202
            },
            {
              "onset": 180,
              "x": 305
            },
            {
              "onset": 182,
              "x": 399
            },
            {
              "onset": 184,
              "x": 517
            }
          ],
          "start-x": 65,
          "end-x": 599
        },
        {
          "y": 559,
          "height": 133,
          "onset-x": [
            {
              "onset": 186,
              "x": 66
            },
            {
              "onset": 188,
              "x": 207
            },
            {
              "onset": 190,
              "x": 301
            },
            {
              "onset": 192,
              "x": 400
            },
            {
              "onset": 194,
              "x": 483
            }
          ],
          "start-x": 66,
          "end-x": 573
        },
        {
          "y": 729,
          "height": 131,
          "onset-x": [
            {
              "onset": 196,
              "x": 67
            },
            {
              "onset": 198,
              "x": 176
            },
            {
              "onset": 200,
              "x": 248
            },
            {
              "onset": 202,
              "x": 329
            },
            {
              "onset": 204,
              "x": 400
            },
            {
              "onset": 206,
              "x": 477
            },
            {
              "onset": 208,
              "x": 545
            }
          ],
          "start-x": 67,
          "end-x": 596
        }
      ]
    }
  ]
}