<?xml version="1.0" encoding="UTF-8" standalone="no"?>
<!DOCTYPE svg PUBLIC "-//W3C//DTD SVG 1.1//EN"
 "http://www.w3.org/Graphics/SVG/1.1/DTD/svg11.dtd">
<!-- Generated by graphviz version 2.43.0 (0)
 -->
<!-- Title: dependency&#45;cruiser output Pages: 1 -->
<svg width="761pt" height="782pt"
 viewBox="0.00 0.00 761.00 782.00" xmlns="http://www.w3.org/2000/svg" xmlns:xlink="http://www.w3.org/1999/xlink">
<g id="graph0" class="graph" transform="scale(1 1) rotate(0) translate(4 778)">
<title>dependency&#45;cruiser output</title>
<polygon fill="white" stroke="transparent" points="-4,4 -4,-778 757,-778 757,4 -4,4"/>
<g id="clust1" class="cluster">
<title>cluster_src</title>
<path fill="#ffffff" stroke="black" stroke-width="2" d="M20,-8C20,-8 733,-8 733,-8 739,-8 745,-14 745,-20 745,-20 745,-754 745,-754 745,-760 739,-766 733,-766 733,-766 20,-766 20,-766 14,-766 8,-760 8,-754 8,-754 8,-20 8,-20 8,-14 14,-8 20,-8"/>
<text text-anchor="middle" x="376.5" y="-754.8" font-family="Helvetica,sans-Serif" font-weight="bold" font-size="9.00">src</text>
</g>
<g id="clust2" class="cluster">
<title>cluster_src/components</title>
<path fill="#ffffff" stroke="black" stroke-width="2" d="M28,-16C28,-16 725,-16 725,-16 731,-16 737,-22 737,-28 737,-28 737,-728 737,-728 737,-734 731,-740 725,-740 725,-740 28,-740 28,-740 22,-740 16,-734 16,-728 16,-728 16,-28 16,-28 16,-22 22,-16 28,-16"/>
<text text-anchor="middle" x="376.5" y="-728.8" font-family="Helvetica,sans-Serif" font-weight="bold" font-size="9.00">components</text>
</g>
<g id="clust3" class="cluster">
<title>cluster_src/components/behaviors</title>
<path fill="#ffffff" stroke="black" stroke-width="2" d="M36,-24C36,-24 717,-24 717,-24 723,-24 729,-30 729,-36 729,-36 729,-702 729,-702 729,-708 723,-714 717,-714 717,-714 36,-714 36,-714 30,-714 24,-708 24,-702 24,-702 24,-36 24,-36 24,-30 30,-24 36,-24"/>
<text text-anchor="middle" x="376.5" y="-702.8" font-family="Helvetica,sans-Serif" font-weight="bold" font-size="9.00">behaviors</text>
</g>
<g id="clust4" class="cluster">
<title>cluster_src/components/behaviors/analysis</title>
<path fill="#ffffff" stroke="black" stroke-width="2" d="M44,-590C44,-590 442.5,-590 442.5,-590 448.5,-590 454.5,-596 454.5,-602 454.5,-602 454.5,-674 454.5,-674 454.5,-680 448.5,-686 442.5,-686 442.5,-686 44,-686 44,-686 38,-686 32,-680 32,-674 32,-674 32,-602 32,-602 32,-596 38,-590 44,-590"/>
<text text-anchor="middle" x="243.25" y="-674.8" font-family="Helvetica,sans-Serif" font-weight="bold" font-size="9.00">analysis</text>
</g>
<g id="clust5" class="cluster">
<title>cluster_src/components/behaviors/player</title>
<path fill="#ffffff" stroke="black" stroke-width="2" d="M198.5,-440C198.5,-440 465,-440 465,-440 471,-440 477,-446 477,-452 477,-452 477,-570 477,-570 477,-576 471,-582 465,-582 465,-582 198.5,-582 198.5,-582 192.5,-582 186.5,-576 186.5,-570 186.5,-570 186.5,-452 186.5,-452 186.5,-446 192.5,-440 198.5,-440"/>
<text text-anchor="middle" x="331.75" y="-570.8" font-family="Helvetica,sans-Serif" font-weight="bold" font-size="9.00">player</text>
</g>
<g id="clust6" class="cluster">
<title>cluster_src/components/behaviors/scroll</title>
<path fill="#ffffff" stroke="black" stroke-width="2" d="M363,-230C363,-230 476,-230 476,-230 482,-230 488,-236 488,-242 488,-242 488,-420 488,-420 488,-426 482,-432 476,-432 476,-432 363,-432 363,-432 357,-432 351,-426 351,-420 351,-420 351,-242 351,-242 351,-236 357,-230 363,-230"/>
<text text-anchor="middle" x="419.5" y="-420.8" font-family="Helvetica,sans-Serif" font-weight="bold" font-size="9.00">scroll</text>
</g>
<g id="clust7" class="cluster">
<title>cluster_src/components/behaviors/shared</title>
<path fill="#ffffff" stroke="black" stroke-width="2" d="M191,-152C191,-152 323,-152 323,-152 329,-152 335,-158 335,-164 335,-164 335,-312 335,-312 335,-318 329,-324 323,-324 323,-324 191,-324 191,-324 185,-324 179,-318 179,-312 179,-312 179,-164 179,-164 179,-158 185,-152 191,-152"/>
<text text-anchor="middle" x="257" y="-312.8" font-family="Helvetica,sans-Serif" font-weight="bold" font-size="9.00">shared</text>
</g>
<g id="clust8" class="cluster">
<title>cluster_src/components/behaviors/synchronization</title>
<path fill="#ffffff" stroke="black" stroke-width="2" d="M192.5,-32C192.5,-32 321.5,-32 321.5,-32 327.5,-32 333.5,-38 333.5,-44 333.5,-44 333.5,-132 333.5,-132 333.5,-138 327.5,-144 321.5,-144 321.5,-144 192.5,-144 192.5,-144 186.5,-144 180.5,-138 180.5,-132 180.5,-132 180.5,-44 180.5,-44 180.5,-38 186.5,-32 192.5,-32"/>
<text text-anchor="middle" x="257" y="-132.8" font-family="Helvetica,sans-Serif" font-weight="bold" font-size="9.00">synchronization</text>
</g>
<g id="clust9" class="cluster">
<title>cluster_src/components/behaviors/zoom</title>
<path fill="#ffffff" stroke="black" stroke-width="2" d="M355,-32C355,-32 484,-32 484,-32 490,-32 496,-38 496,-44 496,-44 496,-102 496,-102 496,-108 490,-114 484,-114 484,-114 355,-114 355,-114 349,-114 343,-108 343,-102 343,-102 343,-44 343,-44 343,-38 349,-32 355,-32"/>
<text text-anchor="middle" x="419.5" y="-102.8" font-family="Helvetica,sans-Serif" font-weight="bold" font-size="9.00">zoom</text>
</g>
<!-- src/components/behaviors/LabelBehavior.vue -->
<g id="node1" class="node">
<title>src/components/behaviors/LabelBehavior.vue</title>
<g id="a_node1"><a xlink:href="../../src/components/behaviors/LabelBehavior.vue" xlink:title="LabelBehavior.vue">
<path fill="#41f083" stroke="black" d="M592,-301C592,-301 510,-301 510,-301 507,-301 504,-298 504,-295 504,-295 504,-289 504,-289 504,-286 507,-283 510,-283 510,-283 592,-283 592,-283 595,-283 598,-286 598,-289 598,-289 598,-295 598,-295 598,-298 595,-301 592,-301"/>
<text text-anchor="start" x="512" y="-289.8" font-family="Helvetica,sans-Serif" font-size="9.00">LabelBehavior.vue</text>
</a>
</g>
</g>
<!-- src/components/behaviors/ListenerAutoCleaner.ts -->
<g id="node2" class="node">
<title>src/components/behaviors/ListenerAutoCleaner.ts</title>
<g id="a_node2"><a xlink:href="../../src/components/behaviors/ListenerAutoCleaner.ts" xlink:title="ListenerAutoCleaner.ts">
<path fill="#ddfeff" stroke="black" d="M715,-301C715,-301 617,-301 617,-301 614,-301 611,-298 611,-295 611,-295 611,-289 611,-289 611,-286 614,-283 617,-283 617,-283 715,-283 715,-283 718,-283 721,-286 721,-289 721,-289 721,-295 721,-295 721,-298 718,-301 715,-301"/>
<text text-anchor="start" x="619" y="-289.8" font-family="Helvetica,sans-Serif" font-size="9.00">ListenerAutoCleaner.ts</text>
</a>
</g>
</g>
<!-- src/components/behaviors/LabelBehavior.vue&#45;&gt;src/components/behaviors/ListenerAutoCleaner.ts -->
<g id="edge1" class="edge">
<title>src/components/behaviors/LabelBehavior.vue&#45;&gt;src/components/behaviors/ListenerAutoCleaner.ts</title>
<path fill="none" stroke="#000000" stroke-width="2" stroke-opacity="0.200000" d="M598.11,-292C598.11,-292 604.9,-292 604.9,-292"/>
<polygon fill="#000000" fill-opacity="0.200000" stroke="#000000" stroke-width="2" stroke-opacity="0.200000" points="604.9,-294.1 610.9,-292 604.9,-289.9 604.9,-294.1"/>
</g>
<!-- src/components/behaviors/analysis/BCreateOnCanvasDrag.vue -->
<g id="node3" class="node">
<title>src/components/behaviors/analysis/BCreateOnCanvasDrag.vue</title>
<g id="a_node3"><a xlink:href="../../src/components/behaviors/analysis/BCreateOnCanvasDrag.vue" xlink:title="BCreateOnCanvasDrag.vue">
<path fill="#41f083" stroke="black" d="M165,-630C165,-630 46,-630 46,-630 43,-630 40,-627 40,-624 40,-624 40,-618 40,-618 40,-615 43,-612 46,-612 46,-612 165,-612 165,-612 168,-612 171,-615 171,-618 171,-618 171,-624 171,-624 171,-627 168,-630 165,-630"/>
<text text-anchor="start" x="48" y="-618.8" font-family="Helvetica,sans-Serif" font-size="9.00">BCreateOnCanvasDrag.vue</text>
</a>
</g>
</g>
<!-- src/components/behaviors/analysis/BCreateOnCanvasDrag.vue&#45;&gt;src/components/behaviors/LabelBehavior.vue -->
<g id="edge2" class="edge">
<title>src/components/behaviors/analysis/BCreateOnCanvasDrag.vue&#45;&gt;src/components/behaviors/LabelBehavior.vue</title>
<path fill="none" stroke="#000000" stroke-width="2" stroke-opacity="0.200000" d="M171.28,-620.8C300.49,-620.8 575,-620.8 575,-620.8 575,-620.8 575,-307.14 575,-307.14"/>
<polygon fill="#000000" fill-opacity="0.200000" stroke="#000000" stroke-width="2" stroke-opacity="0.200000" points="577.1,-307.14 575,-301.14 572.9,-307.14 577.1,-307.14"/>
</g>
<!-- src/components/behaviors/analysis/BResizeOnArrowDrag.vue -->
<g id="node4" class="node">
<title>src/components/behaviors/analysis/BResizeOnArrowDrag.vue</title>
<g id="a_node4"><a xlink:href="../../src/components/behaviors/analysis/BResizeOnArrowDrag.vue" xlink:title="BResizeOnArrowDrag.vue">
<path fill="#41f083" stroke="black" d="M313.5,-616C313.5,-616 200.5,-616 200.5,-616 197.5,-616 194.5,-613 194.5,-610 194.5,-610 194.5,-604 194.5,-604 194.5,-601 197.5,-598 200.5,-598 200.5,-598 313.5,-598 313.5,-598 316.5,-598 319.5,-601 319.5,-604 319.5,-604 319.5,-610 319.5,-610 319.5,-613 316.5,-616 313.5,-616"/>
<text text-anchor="start" x="202.5" y="-604.8" font-family="Helvetica,sans-Serif" font-size="9.00">BResizeOnArrowDrag.vue</text>
</a>
</g>
</g>
<!-- src/components/behaviors/analysis/BCreateOnCanvasDrag.vue&#45;&gt;src/components/behaviors/analysis/BResizeOnArrowDrag.vue -->
<g id="edge3" class="edge">
<title>src/components/behaviors/analysis/BCreateOnCanvasDrag.vue&#45;&gt;src/components/behaviors/analysis/BResizeOnArrowDrag.vue</title>
<path fill="none" stroke="#000000" stroke-width="2" stroke-opacity="0.200000" d="M171.2,-618.4C188.29,-618.4 202,-618.4 202,-618.4 202,-618.4 202,-618.18 202,-618.18"/>
<polygon fill="#000000" fill-opacity="0.200000" stroke="#000000" stroke-width="2" stroke-opacity="0.200000" points="204.1,-622.2 202,-616.2 199.9,-622.2 204.1,-622.2"/>
</g>
<!-- src/components/behaviors/analysis/utils.ts -->
<g id="node5" class="node">
<title>src/components/behaviors/analysis/utils.ts</title>
<g id="a_node5"><a xlink:href="../../src/components/behaviors/analysis/utils.ts" xlink:title="utils.ts">
<path fill="#ddfeff" stroke="black" d="M440.5,-646C440.5,-646 398.5,-646 398.5,-646 395.5,-646 392.5,-643 392.5,-640 392.5,-640 392.5,-634 392.5,-634 392.5,-631 395.5,-628 398.5,-628 398.5,-628 440.5,-628 440.5,-628 443.5,-628 446.5,-631 446.5,-634 446.5,-634 446.5,-640 446.5,-640 446.5,-643 443.5,-646 440.5,-646"/>
<text text-anchor="start" x="406.5" y="-634.8" font-family="Helvetica,sans-Serif" font-size="9.00">utils.ts</text>
</a>
</g>
</g>
<!-- src/components/behaviors/analysis/BCreateOnCanvasDrag.vue&#45;&gt;src/components/behaviors/analysis/utils.ts -->
<g id="edge4" class="edge">
<title>src/components/behaviors/analysis/BCreateOnCanvasDrag.vue&#45;&gt;src/components/behaviors/analysis/utils.ts</title>
<path fill="none" stroke="#000000" stroke-width="2" stroke-opacity="0.200000" d="M171.05,-625.6C263.22,-625.6 420,-625.6 420,-625.6 420,-625.6 420,-625.82 420,-625.82"/>
<polygon fill="#000000" fill-opacity="0.200000" stroke="#000000" stroke-width="2" stroke-opacity="0.200000" points="417.9,-621.8 420,-627.8 422.1,-621.8 417.9,-621.8"/>
</g>
<!-- src/components/behaviors/analysis/BResizeOnArrowDrag.vue&#45;&gt;src/components/behaviors/LabelBehavior.vue -->
<g id="edge9" class="edge">
<title>src/components/behaviors/analysis/BResizeOnArrowDrag.vue&#45;&gt;src/components/behaviors/LabelBehavior.vue</title>
<path fill="none" stroke="#000000" stroke-width="2" stroke-opacity="0.200000" d="M319.73,-610C410.32,-610 567,-610 567,-610 567,-610 567,-307.17 567,-307.17"/>
<polygon fill="#000000" fill-opacity="0.200000" stroke="#000000" stroke-width="2" stroke-opacity="0.200000" points="569.1,-307.17 567,-301.17 564.9,-307.17 569.1,-307.17"/>
</g>
<!-- src/components/behaviors/analysis/BResizeOnArrowDrag.vue&#45;&gt;src/components/behaviors/analysis/utils.ts -->
<g id="edge11" class="edge">
<title>src/components/behaviors/analysis/BResizeOnArrowDrag.vue&#45;&gt;src/components/behaviors/analysis/utils.ts</title>
<path fill="none" stroke="#000000" stroke-width="2" stroke-opacity="0.200000" d="M312,-616.16C312,-624.99 312,-637 312,-637 312,-637 386.37,-637 386.37,-637"/>
<polygon fill="#000000" fill-opacity="0.200000" stroke="#000000" stroke-width="2" stroke-opacity="0.200000" points="386.37,-639.1 392.37,-637 386.37,-634.9 386.37,-639.1"/>
</g>
<!-- src/components/behaviors/scroll/BScrollOnEdgeDrag.vue -->
<g id="node8" class="node">
<title>src/components/behaviors/scroll/BScrollOnEdgeDrag.vue</title>
<g id="a_node8"><a xlink:href="../../src/components/behaviors/scroll/BScrollOnEdgeDrag.vue" xlink:title="BScrollOnEdgeDrag.vue">
<path fill="#41f083" stroke="black" d="M472,-376C472,-376 367,-376 367,-376 364,-376 361,-373 361,-370 361,-370 361,-364 361,-364 361,-361 364,-358 367,-358 367,-358 472,-358 472,-358 475,-358 478,-361 478,-364 478,-364 478,-370 478,-370 478,-373 475,-376 472,-376"/>
<text text-anchor="start" x="369" y="-364.8" font-family="Helvetica,sans-Serif" font-size="9.00">BScrollOnEdgeDrag.vue</text>
</a>
</g>
</g>
<!-- src/components/behaviors/analysis/BResizeOnArrowDrag.vue&#45;&gt;src/components/behaviors/scroll/BScrollOnEdgeDrag.vue -->
<g id="edge10" class="edge">
<title>src/components/behaviors/analysis/BResizeOnArrowDrag.vue&#45;&gt;src/components/behaviors/scroll/BScrollOnEdgeDrag.vue</title>
<path fill="none" stroke="#000000" stroke-width="2" stroke-opacity="0.200000" d="M319.82,-604C321.84,-604 323,-604 323,-604 323,-604 323,-367 323,-367 323,-367 354.86,-367 354.86,-367"/>
<polygon fill="#000000" fill-opacity="0.200000" stroke="#000000" stroke-width="2" stroke-opacity="0.200000" points="354.86,-369.1 360.86,-367 354.86,-364.9 354.86,-369.1"/>
</g>
<!-- src/components/behaviors/analysis/BCreateOnNumpad.vue -->
<g id="node6" class="node">
<title>src/components/behaviors/analysis/BCreateOnNumpad.vue</title>
<g id="a_node6"><a xlink:href="../../src/components/behaviors/analysis/BCreateOnNumpad.vue" xlink:title="BCreateOnNumpad.vue">
<path fill="#41f083" stroke="black" d="M157,-660C157,-660 54,-660 54,-660 51,-660 48,-657 48,-654 48,-654 48,-648 48,-648 48,-645 51,-642 54,-642 54,-642 157,-642 157,-642 160,-642 163,-645 163,-648 163,-648 163,-654 163,-654 163,-657 160,-660 157,-660"/>
<text text-anchor="start" x="56" y="-648.8" font-family="Helvetica,sans-Serif" font-size="9.00">BCreateOnNumpad.vue</text>
</a>
</g>
</g>
<!-- src/components/behaviors/analysis/BCreateOnNumpad.vue&#45;&gt;src/components/behaviors/LabelBehavior.vue -->
<g id="edge5" class="edge">
<title>src/components/behaviors/analysis/BCreateOnNumpad.vue&#45;&gt;src/components/behaviors/LabelBehavior.vue</title>
<path fill="none" stroke="#000000" stroke-width="2" stroke-opacity="0.200000" d="M163.1,-653C291.7,-653 591,-653 591,-653 591,-653 591,-307.29 591,-307.29"/>
<polygon fill="#000000" fill-opacity="0.200000" stroke="#000000" stroke-width="2" stroke-opacity="0.200000" points="593.1,-307.29 591,-301.29 588.9,-307.29 593.1,-307.29"/>
</g>
<!-- src/components/behaviors/analysis/BMoveOnDrag.vue -->
<g id="node7" class="node">
<title>src/components/behaviors/analysis/BMoveOnDrag.vue</title>
<g id="a_node7"><a xlink:href="../../src/components/behaviors/analysis/BMoveOnDrag.vue" xlink:title="BMoveOnDrag.vue">
<path fill="#41f083" stroke="black" d="M298.5,-646C298.5,-646 215.5,-646 215.5,-646 212.5,-646 209.5,-643 209.5,-640 209.5,-640 209.5,-634 209.5,-634 209.5,-631 212.5,-628 215.5,-628 215.5,-628 298.5,-628 298.5,-628 301.5,-628 304.5,-631 304.5,-634 304.5,-634 304.5,-640 304.5,-640 304.5,-643 301.5,-646 298.5,-646"/>
<text text-anchor="start" x="217.5" y="-634.8" font-family="Helvetica,sans-Serif" font-size="9.00">BMoveOnDrag.vue</text>
</a>
</g>
</g>
<!-- src/components/behaviors/analysis/BMoveOnDrag.vue&#45;&gt;src/components/behaviors/LabelBehavior.vue -->
<g id="edge6" class="edge">
<title>src/components/behaviors/analysis/BMoveOnDrag.vue&#45;&gt;src/components/behaviors/LabelBehavior.vue</title>
<path fill="none" stroke="#000000" stroke-width="2" stroke-opacity="0.200000" d="M257,-627.87C257,-625.31 257,-623.2 257,-623.2 257,-623.2 583,-623.2 583,-623.2 583,-623.2 583,-307.2 583,-307.2"/>
<polygon fill="#000000" fill-opacity="0.200000" stroke="#000000" stroke-width="2" stroke-opacity="0.200000" points="585.1,-307.2 583,-301.2 580.9,-307.2 585.1,-307.2"/>
</g>
<!-- src/components/behaviors/analysis/BMoveOnDrag.vue&#45;&gt;src/components/behaviors/analysis/utils.ts -->
<g id="edge8" class="edge">
<title>src/components/behaviors/analysis/BMoveOnDrag.vue&#45;&gt;src/components/behaviors/analysis/utils.ts</title>
<path fill="none" stroke="#000000" stroke-width="2" stroke-opacity="0.200000" d="M304.88,-641.5C304.88,-641.5 386.21,-641.5 386.21,-641.5"/>
<polygon fill="#000000" fill-opacity="0.200000" stroke="#000000" stroke-width="2" stroke-opacity="0.200000" points="386.21,-643.6 392.21,-641.5 386.21,-639.4 386.21,-643.6"/>
</g>
<!-- src/components/behaviors/analysis/BMoveOnDrag.vue&#45;&gt;src/components/behaviors/scroll/BScrollOnEdgeDrag.vue -->
<g id="edge7" class="edge">
<title>src/components/behaviors/analysis/BMoveOnDrag.vue&#45;&gt;src/components/behaviors/scroll/BScrollOnEdgeDrag.vue</title>
<path fill="none" stroke="#000000" stroke-width="2" stroke-opacity="0.200000" d="M304.62,-632.5C315.53,-632.5 324,-632.5 324,-632.5 324,-632.5 324,-371.5 324,-371.5 324,-371.5 354.92,-371.5 354.92,-371.5"/>
<polygon fill="#000000" fill-opacity="0.200000" stroke="#000000" stroke-width="2" stroke-opacity="0.200000" points="354.92,-373.6 360.92,-371.5 354.92,-369.4 354.92,-373.6"/>
</g>
<!-- src/components/behaviors/scroll/BScrollOnEdgeDrag.vue&#45;&gt;src/components/behaviors/LabelBehavior.vue -->
<g id="edge19" class="edge">
<title>src/components/behaviors/scroll/BScrollOnEdgeDrag.vue&#45;&gt;src/components/behaviors/LabelBehavior.vue</title>
<path fill="none" stroke="#000000" stroke-width="2" stroke-opacity="0.200000" d="M478.25,-367C500.24,-367 520,-367 520,-367 520,-367 520,-307.2 520,-307.2"/>
<polygon fill="#000000" fill-opacity="0.200000" stroke="#000000" stroke-width="2" stroke-opacity="0.200000" points="522.1,-307.2 520,-301.2 517.9,-307.2 522.1,-307.2"/>
</g>
<!-- src/components/behaviors/player/BCanvasCursor.vue -->
<g id="node9" class="node">
<title>src/components/behaviors/player/BCanvasCursor.vue</title>
<g id="a_node9"><a xlink:href="../../src/components/behaviors/player/BCanvasCursor.vue" xlink:title="BCanvasCursor.vue">
<path fill="#41f083" stroke="black" d="M463,-488C463,-488 376,-488 376,-488 373,-488 370,-485 370,-482 370,-482 370,-476 370,-476 370,-473 373,-470 376,-470 376,-470 463,-470 463,-470 466,-470 469,-473 469,-476 469,-476 469,-482 469,-482 469,-485 466,-488 463,-488"/>
<text text-anchor="start" x="378" y="-476.8" font-family="Helvetica,sans-Serif" font-size="9.00">BCanvasCursor.vue</text>
</a>
</g>
</g>
<!-- src/components/behaviors/player/BCanvasCursor.vue&#45;&gt;src/components/behaviors/LabelBehavior.vue -->
<g id="edge12" class="edge">
<title>src/components/behaviors/player/BCanvasCursor.vue&#45;&gt;src/components/behaviors/LabelBehavior.vue</title>
<path fill="none" stroke="#000000" stroke-width="2" stroke-opacity="0.200000" d="M469.06,-479C503.78,-479 544,-479 544,-479 544,-479 544,-307.02 544,-307.02"/>
<polygon fill="#000000" fill-opacity="0.200000" stroke="#000000" stroke-width="2" stroke-opacity="0.200000" points="546.1,-307.02 544,-301.02 541.9,-307.02 546.1,-307.02"/>
</g>
<!-- src/components/behaviors/player/BFollowOnPlay.vue -->
<g id="node10" class="node">
<title>src/components/behaviors/player/BFollowOnPlay.vue</title>
<g id="a_node10"><a xlink:href="../../src/components/behaviors/player/BFollowOnPlay.vue" xlink:title="BFollowOnPlay.vue">
<path fill="#41f083" stroke="black" d="M299.5,-496C299.5,-496 214.5,-496 214.5,-496 211.5,-496 208.5,-493 208.5,-490 208.5,-490 208.5,-484 208.5,-484 208.5,-481 211.5,-478 214.5,-478 214.5,-478 299.5,-478 299.5,-478 302.5,-478 305.5,-481 305.5,-484 305.5,-484 305.5,-490 305.5,-490 305.5,-493 302.5,-496 299.5,-496"/>
<text text-anchor="start" x="216.5" y="-484.8" font-family="Helvetica,sans-Serif" font-size="9.00">BFollowOnPlay.vue</text>
</a>
</g>
</g>
<!-- src/components/behaviors/player/BFollowOnPlay.vue&#45;&gt;src/components/behaviors/player/BCanvasCursor.vue -->
<g id="edge13" class="edge">
<title>src/components/behaviors/player/BFollowOnPlay.vue&#45;&gt;src/components/behaviors/player/BCanvasCursor.vue</title>
<path fill="none" stroke="#000000" stroke-width="2" stroke-opacity="0.200000" d="M305.76,-483C305.76,-483 363.94,-483 363.94,-483"/>
<polygon fill="#000000" fill-opacity="0.200000" stroke="#000000" stroke-width="2" stroke-opacity="0.200000" points="363.94,-485.1 369.94,-483 363.94,-480.9 363.94,-485.1"/>
</g>
<!-- src/components/behaviors/player/BLoopOnShiftDblClick.vue -->
<g id="node11" class="node">
<title>src/components/behaviors/player/BLoopOnShiftDblClick.vue</title>
<g id="a_node11"><a xlink:href="../../src/components/behaviors/player/BLoopOnShiftDblClick.vue" xlink:title="BLoopOnShiftDblClick.vue">
<path fill="#41f083" stroke="black" d="M313.5,-556C313.5,-556 200.5,-556 200.5,-556 197.5,-556 194.5,-553 194.5,-550 194.5,-550 194.5,-544 194.5,-544 194.5,-541 197.5,-538 200.5,-538 200.5,-538 313.5,-538 313.5,-538 316.5,-538 319.5,-541 319.5,-544 319.5,-544 319.5,-550 319.5,-550 319.5,-553 316.5,-556 313.5,-556"/>
<text text-anchor="start" x="202.5" y="-544.8" font-family="Helvetica,sans-Serif" font-size="9.00">BLoopOnShiftDblClick.vue</text>
</a>
</g>
</g>
<!-- src/components/behaviors/player/BLoopOnShiftDblClick.vue&#45;&gt;src/components/behaviors/LabelBehavior.vue -->
<g id="edge14" class="edge">
<title>src/components/behaviors/player/BLoopOnShiftDblClick.vue&#45;&gt;src/components/behaviors/LabelBehavior.vue</title>
<path fill="none" stroke="#000000" stroke-width="2" stroke-opacity="0.200000" d="M319.57,-547C408.03,-547 559,-547 559,-547 559,-547 559,-307.08 559,-307.08"/>
<polygon fill="#000000" fill-opacity="0.200000" stroke="#000000" stroke-width="2" stroke-opacity="0.200000" points="561.1,-307.08 559,-301.08 556.9,-307.08 561.1,-307.08"/>
</g>
<!-- src/components/behaviors/player/BPlayerControlOnKey.vue -->
<g id="node12" class="node">
<title>src/components/behaviors/player/BPlayerControlOnKey.vue</title>
<g id="a_node12"><a xlink:href="../../src/components/behaviors/player/BPlayerControlOnKey.vue" xlink:title="BPlayerControlOnKey.vue">
<path fill="#41f083" stroke="black" d="M313,-526C313,-526 201,-526 201,-526 198,-526 195,-523 195,-520 195,-520 195,-514 195,-514 195,-511 198,-508 201,-508 201,-508 313,-508 313,-508 316,-508 319,-511 319,-514 319,-514 319,-520 319,-520 319,-523 316,-526 313,-526"/>
<text text-anchor="start" x="203" y="-514.8" font-family="Helvetica,sans-Serif" font-size="9.00">BPlayerControlOnKey.vue</text>
</a>
</g>
</g>
<!-- src/components/behaviors/player/BPlayerControlOnKey.vue&#45;&gt;src/components/behaviors/LabelBehavior.vue -->
<g id="edge15" class="edge">
<title>src/components/behaviors/player/BPlayerControlOnKey.vue&#45;&gt;src/components/behaviors/LabelBehavior.vue</title>
<path fill="none" stroke="#000000" stroke-width="2" stroke-opacity="0.200000" d="M319.35,-517C405.65,-517 551,-517 551,-517 551,-517 551,-307.1 551,-307.1"/>
<polygon fill="#000000" fill-opacity="0.200000" stroke="#000000" stroke-width="2" stroke-opacity="0.200000" points="553.1,-307.1 551,-301.1 548.9,-307.1 553.1,-307.1"/>
</g>
<!-- src/components/behaviors/player/BSeekOnShiftClick.vue -->
<g id="node13" class="node">
<title>src/components/behaviors/player/BSeekOnShiftClick.vue</title>
<g id="a_node13"><a xlink:href="../../src/components/behaviors/player/BSeekOnShiftClick.vue" xlink:title="BSeekOnShiftClick.vue">
<path fill="#41f083" stroke="black" d="M306.5,-466C306.5,-466 207.5,-466 207.5,-466 204.5,-466 201.5,-463 201.5,-460 201.5,-460 201.5,-454 201.5,-454 201.5,-451 204.5,-448 207.5,-448 207.5,-448 306.5,-448 306.5,-448 309.5,-448 312.5,-451 312.5,-454 312.5,-454 312.5,-460 312.5,-460 312.5,-463 309.5,-466 306.5,-466"/>
<text text-anchor="start" x="209.5" y="-454.8" font-family="Helvetica,sans-Serif" font-size="9.00">BSeekOnShiftClick.vue</text>
</a>
</g>
</g>
<!-- src/components/behaviors/player/BSeekOnShiftClick.vue&#45;&gt;src/components/behaviors/LabelBehavior.vue -->
<g id="edge16" class="edge">
<title>src/components/behaviors/player/BSeekOnShiftClick.vue&#45;&gt;src/components/behaviors/LabelBehavior.vue</title>
<path fill="none" stroke="#000000" stroke-width="2" stroke-opacity="0.200000" d="M312.79,-457C394.21,-457 536,-457 536,-457 536,-457 536,-307.34 536,-307.34"/>
<polygon fill="#000000" fill-opacity="0.200000" stroke="#000000" stroke-width="2" stroke-opacity="0.200000" points="538.1,-307.34 536,-301.34 533.9,-307.34 538.1,-307.34"/>
</g>
<!-- src/components/behaviors/scroll/BMinimapClickScroll.vue -->
<g id="node14" class="node">
<title>src/components/behaviors/scroll/BMinimapClickScroll.vue</title>
<g id="a_node14"><a xlink:href="../../src/components/behaviors/scroll/BMinimapClickScroll.vue" xlink:title="BMinimapClickScroll.vue">
<path fill="#41f083" stroke="black" d="M473,-346C473,-346 366,-346 366,-346 363,-346 360,-343 360,-340 360,-340 360,-334 360,-334 360,-331 363,-328 366,-328 366,-328 473,-328 473,-328 476,-328 479,-331 479,-334 479,-334 479,-340 479,-340 479,-343 476,-346 473,-346"/>
<text text-anchor="start" x="368" y="-334.8" font-family="Helvetica,sans-Serif" font-size="9.00">BMinimapClickScroll.vue</text>
</a>
</g>
</g>
<!-- src/components/behaviors/scroll/BMinimapClickScroll.vue&#45;&gt;src/components/behaviors/LabelBehavior.vue -->
<g id="edge17" class="edge">
<title>src/components/behaviors/scroll/BMinimapClickScroll.vue&#45;&gt;src/components/behaviors/LabelBehavior.vue</title>
<path fill="none" stroke="#000000" stroke-width="2" stroke-opacity="0.200000" d="M475,-327.61C475,-315.64 475,-296.5 475,-296.5 475,-296.5 497.73,-296.5 497.73,-296.5"/>
<polygon fill="#000000" fill-opacity="0.200000" stroke="#000000" stroke-width="2" stroke-opacity="0.200000" points="497.73,-298.6 503.73,-296.5 497.73,-294.4 497.73,-298.6"/>
</g>
<!-- src/components/behaviors/scroll/BMinimapCursor.vue -->
<g id="node15" class="node">
<title>src/components/behaviors/scroll/BMinimapCursor.vue</title>
<g id="a_node15"><a xlink:href="../../src/components/behaviors/scroll/BMinimapCursor.vue" xlink:title="BMinimapCursor.vue">
<path fill="#41f083" stroke="black" d="M465,-316C465,-316 374,-316 374,-316 371,-316 368,-313 368,-310 368,-310 368,-304 368,-304 368,-301 371,-298 374,-298 374,-298 465,-298 465,-298 468,-298 471,-301 471,-304 471,-304 471,-310 471,-310 471,-313 468,-316 465,-316"/>
<text text-anchor="start" x="376" y="-304.8" font-family="Helvetica,sans-Serif" font-size="9.00">BMinimapCursor.vue</text>
</a>
</g>
</g>
<!-- src/components/behaviors/scroll/BMinimapCursor.vue&#45;&gt;src/components/behaviors/LabelBehavior.vue -->
<g id="edge18" class="edge">
<title>src/components/behaviors/scroll/BMinimapCursor.vue&#45;&gt;src/components/behaviors/LabelBehavior.vue</title>
<path fill="none" stroke="#000000" stroke-width="2" stroke-opacity="0.200000" d="M471.16,-308.5C492.35,-308.5 512,-308.5 512,-308.5 512,-308.5 512,-307.02 512,-307.02"/>
<polygon fill="#000000" fill-opacity="0.200000" stroke="#000000" stroke-width="2" stroke-opacity="0.200000" points="514.1,-307.02 512,-301.02 509.9,-307.02 514.1,-307.02"/>
</g>
<!-- src/components/behaviors/scroll/BScrollOnLoad.vue -->
<g id="node16" class="node">
<title>src/components/behaviors/scroll/BScrollOnLoad.vue</title>
<g id="a_node16"><a xlink:href="../../src/components/behaviors/scroll/BScrollOnLoad.vue" xlink:title="BScrollOnLoad.vue">
<path fill="#41f083" stroke="black" d="M461.5,-286C461.5,-286 377.5,-286 377.5,-286 374.5,-286 371.5,-283 371.5,-280 371.5,-280 371.5,-274 371.5,-274 371.5,-271 374.5,-268 377.5,-268 377.5,-268 461.5,-268 461.5,-268 464.5,-268 467.5,-271 467.5,-274 467.5,-274 467.5,-280 467.5,-280 467.5,-283 464.5,-286 461.5,-286"/>
<text text-anchor="start" x="379.5" y="-274.8" font-family="Helvetica,sans-Serif" font-size="9.00">BScrollOnLoad.vue</text>
</a>
</g>
</g>
<!-- src/components/behaviors/scroll/BScrollOnLoad.vue&#45;&gt;src/components/behaviors/LabelBehavior.vue -->
<g id="edge20" class="edge">
<title>src/components/behaviors/scroll/BScrollOnLoad.vue&#45;&gt;src/components/behaviors/LabelBehavior.vue</title>
<path fill="none" stroke="#000000" stroke-width="2" stroke-opacity="0.200000" d="M467.95,-275.5C517.42,-275.5 587,-275.5 587,-275.5 587,-275.5 587,-276.98 587,-276.98"/>
<polygon fill="#000000" fill-opacity="0.200000" stroke="#000000" stroke-width="2" stroke-opacity="0.200000" points="584.9,-276.98 587,-282.98 589.1,-276.98 584.9,-276.98"/>
</g>
<!-- src/components/behaviors/scroll/BScrollToLabel.vue -->
<g id="node17" class="node">
<title>src/components/behaviors/scroll/BScrollToLabel.vue</title>
<g id="a_node17"><a xlink:href="../../src/components/behaviors/scroll/BScrollToLabel.vue" xlink:title="BScrollToLabel.vue">
<path fill="#41f083" stroke="black" d="M461.5,-256C461.5,-256 377.5,-256 377.5,-256 374.5,-256 371.5,-253 371.5,-250 371.5,-250 371.5,-244 371.5,-244 371.5,-241 374.5,-238 377.5,-238 377.5,-238 461.5,-238 461.5,-238 464.5,-238 467.5,-241 467.5,-244 467.5,-244 467.5,-250 467.5,-250 467.5,-253 464.5,-256 461.5,-256"/>
<text text-anchor="start" x="379.5" y="-244.8" font-family="Helvetica,sans-Serif" font-size="9.00">BScrollToLabel.vue</text>
</a>
</g>
</g>
<!-- src/components/behaviors/scroll/BScrollToLabel.vue&#45;&gt;src/components/behaviors/LabelBehavior.vue -->
<g id="edge21" class="edge">
<title>src/components/behaviors/scroll/BScrollToLabel.vue&#45;&gt;src/components/behaviors/LabelBehavior.vue</title>
<path fill="none" stroke="#000000" stroke-width="2" stroke-opacity="0.200000" d="M467.72,-247C496.7,-247 528,-247 528,-247 528,-247 528,-276.89 528,-276.89"/>
<polygon fill="#000000" fill-opacity="0.200000" stroke="#000000" stroke-width="2" stroke-opacity="0.200000" points="525.9,-276.89 528,-282.89 530.1,-276.89 525.9,-276.89"/>
</g>
<!-- src/components/behaviors/scroll/BSendOnsetOnScroll.vue -->
<g id="node18" class="node">
<title>src/components/behaviors/scroll/BSendOnsetOnScroll.vue</title>
<g id="a_node18"><a xlink:href="../../src/components/behaviors/scroll/BSendOnsetOnScroll.vue" xlink:title="BSendOnsetOnScroll.vue">
<path fill="#41f083" stroke="black" d="M474,-406C474,-406 365,-406 365,-406 362,-406 359,-403 359,-400 359,-400 359,-394 359,-394 359,-391 362,-388 365,-388 365,-388 474,-388 474,-388 477,-388 480,-391 480,-394 480,-394 480,-400 480,-400 480,-403 477,-406 474,-406"/>
<text text-anchor="start" x="367" y="-394.8" font-family="Helvetica,sans-Serif" font-size="9.00">BSendOnsetOnScroll.vue</text>
</a>
</g>
</g>
<!-- src/components/behaviors/scroll/BSendOnsetOnScroll.vue&#45;&gt;src/components/behaviors/LabelBehavior.vue -->
<g id="edge22" class="edge">
<title>src/components/behaviors/scroll/BSendOnsetOnScroll.vue&#45;&gt;src/components/behaviors/LabelBehavior.vue</title>
<path fill="none" stroke="#000000" stroke-width="2" stroke-opacity="0.200000" d="M480.09,-397C504.95,-397 528,-397 528,-397 528,-397 528,-307.32 528,-307.32"/>
<polygon fill="#000000" fill-opacity="0.200000" stroke="#000000" stroke-width="2" stroke-opacity="0.200000" points="530.1,-307.32 528,-301.32 525.9,-307.32 530.1,-307.32"/>
</g>
<!-- src/components/behaviors/shared/BDeleteOnKey.vue -->
<g id="node19" class="node">
<title>src/components/behaviors/shared/BDeleteOnKey.vue</title>
<g id="a_node19"><a xlink:href="../../src/components/behaviors/shared/BDeleteOnKey.vue" xlink:title="BDeleteOnKey.vue">
<path fill="#41f083" stroke="black" d="M298.5,-268C298.5,-268 215.5,-268 215.5,-268 212.5,-268 209.5,-265 209.5,-262 209.5,-262 209.5,-256 209.5,-256 209.5,-253 212.5,-250 215.5,-250 215.5,-250 298.5,-250 298.5,-250 301.5,-250 304.5,-253 304.5,-256 304.5,-256 304.5,-262 304.5,-262 304.5,-265 301.5,-268 298.5,-268"/>
<text text-anchor="start" x="217.5" y="-256.8" font-family="Helvetica,sans-Serif" font-size="9.00">BDeleteOnKey.vue</text>
</a>
</g>
</g>
<!-- src/components/behaviors/shared/BDeleteOnKey.vue&#45;&gt;src/components/behaviors/LabelBehavior.vue -->
<g id="edge23" class="edge">
<title>src/components/behaviors/shared/BDeleteOnKey.vue&#45;&gt;src/components/behaviors/LabelBehavior.vue</title>
<path fill="none" stroke="#000000" stroke-width="2" stroke-opacity="0.200000" d="M304.5,-262C379.28,-262 516,-262 516,-262 516,-262 516,-276.84 516,-276.84"/>
<polygon fill="#000000" fill-opacity="0.200000" stroke="#000000" stroke-width="2" stroke-opacity="0.200000" points="513.9,-276.84 516,-282.84 518.1,-276.84 513.9,-276.84"/>
</g>
<!-- src/components/behaviors/shared/BDeleteOnKey.vue&#45;&gt;src/components/behaviors/scroll/BScrollToLabel.vue -->
<g id="edge24" class="edge">
<title>src/components/behaviors/shared/BDeleteOnKey.vue&#45;&gt;src/components/behaviors/scroll/BScrollToLabel.vue</title>
<path fill="none" stroke="#000000" stroke-width="2" stroke-opacity="0.200000" d="M257,-249.7C257,-245.74 257,-242 257,-242 257,-242 365.18,-242 365.18,-242"/>
<polygon fill="#000000" fill-opacity="0.200000" stroke="#000000" stroke-width="2" stroke-opacity="0.200000" points="365.18,-244.1 371.18,-242 365.18,-239.9 365.18,-244.1"/>
</g>
<!-- src/components/behaviors/shared/BPrevNextOnKey.vue -->
<g id="node20" class="node">
<title>src/components/behaviors/shared/BPrevNextOnKey.vue</title>
<g id="a_node20"><a xlink:href="../../src/components/behaviors/shared/BPrevNextOnKey.vue" xlink:title="BPrevNextOnKey.vue">
<path fill="#41f083" stroke="black" d="M303.5,-298C303.5,-298 210.5,-298 210.5,-298 207.5,-298 204.5,-295 204.5,-292 204.5,-292 204.5,-286 204.5,-286 204.5,-283 207.5,-280 210.5,-280 210.5,-280 303.5,-280 303.5,-280 306.5,-280 309.5,-283 309.5,-286 309.5,-286 309.5,-292 309.5,-292 309.5,-295 306.5,-298 303.5,-298"/>
<text text-anchor="start" x="212.5" y="-286.8" font-family="Helvetica,sans-Serif" font-size="9.00">BPrevNextOnKey.vue</text>
</a>
</g>
</g>
<!-- src/components/behaviors/shared/BPrevNextOnKey.vue&#45;&gt;src/components/behaviors/LabelBehavior.vue -->
<g id="edge25" class="edge">
<title>src/components/behaviors/shared/BPrevNextOnKey.vue&#45;&gt;src/components/behaviors/LabelBehavior.vue</title>
<path fill="none" stroke="#000000" stroke-width="2" stroke-opacity="0.200000" d="M309.56,-295C309.56,-295 497.75,-295 497.75,-295"/>
<polygon fill="#000000" fill-opacity="0.200000" stroke="#000000" stroke-width="2" stroke-opacity="0.200000" points="497.75,-297.1 503.75,-295 497.75,-292.9 497.75,-297.1"/>
</g>
<!-- src/components/behaviors/shared/BPrevNextOnKey.vue&#45;&gt;src/components/behaviors/scroll/BScrollToLabel.vue -->
<g id="edge26" class="edge">
<title>src/components/behaviors/shared/BPrevNextOnKey.vue&#45;&gt;src/components/behaviors/scroll/BScrollToLabel.vue</title>
<path fill="none" stroke="#000000" stroke-width="2" stroke-opacity="0.200000" d="M309.65,-293.5C319.09,-293.5 326,-293.5 326,-293.5 326,-293.5 326,-246 326,-246 326,-246 365.38,-246 365.38,-246"/>
<polygon fill="#000000" fill-opacity="0.200000" stroke="#000000" stroke-width="2" stroke-opacity="0.200000" points="365.38,-248.1 371.38,-246 365.38,-243.9 365.38,-248.1"/>
</g>
<!-- src/components/behaviors/shared/BSelectOnClick.vue -->
<g id="node21" class="node">
<title>src/components/behaviors/shared/BSelectOnClick.vue</title>
<g id="a_node21"><a xlink:href="../../src/components/behaviors/shared/BSelectOnClick.vue" xlink:title="BSelectOnClick.vue">
<path fill="#41f083" stroke="black" d="M300,-178C300,-178 214,-178 214,-178 211,-178 208,-175 208,-172 208,-172 208,-166 208,-166 208,-163 211,-160 214,-160 214,-160 300,-160 300,-160 303,-160 306,-163 306,-166 306,-166 306,-172 306,-172 306,-175 303,-178 300,-178"/>
<text text-anchor="start" x="216" y="-166.8" font-family="Helvetica,sans-Serif" font-size="9.00">BSelectOnClick.vue</text>
</a>
</g>
</g>
<!-- src/components/behaviors/shared/BSelectOnClick.vue&#45;&gt;src/components/behaviors/LabelBehavior.vue -->
<g id="edge27" class="edge">
<title>src/components/behaviors/shared/BSelectOnClick.vue&#45;&gt;src/components/behaviors/LabelBehavior.vue</title>
<path fill="none" stroke="#000000" stroke-width="2" stroke-opacity="0.200000" d="M306.21,-169C389.9,-169 551,-169 551,-169 551,-169 551,-276.76 551,-276.76"/>
<polygon fill="#000000" fill-opacity="0.200000" stroke="#000000" stroke-width="2" stroke-opacity="0.200000" points="548.9,-276.75 551,-282.76 553.1,-276.76 548.9,-276.75"/>
</g>
<!-- src/components/behaviors/shared/BSelectOnTabFocus.vue -->
<g id="node22" class="node">
<title>src/components/behaviors/shared/BSelectOnTabFocus.vue</title>
<g id="a_node22"><a xlink:href="../../src/components/behaviors/shared/BSelectOnTabFocus.vue" xlink:title="BSelectOnTabFocus.vue">
<path fill="#41f083" stroke="black" d="M309.5,-208C309.5,-208 204.5,-208 204.5,-208 201.5,-208 198.5,-205 198.5,-202 198.5,-202 198.5,-196 198.5,-196 198.5,-193 201.5,-190 204.5,-190 204.5,-190 309.5,-190 309.5,-190 312.5,-190 315.5,-193 315.5,-196 315.5,-196 315.5,-202 315.5,-202 315.5,-205 312.5,-208 309.5,-208"/>
<text text-anchor="start" x="206.5" y="-196.8" font-family="Helvetica,sans-Serif" font-size="9.00">BSelectOnTabFocus.vue</text>
</a>
</g>
</g>
<!-- src/components/behaviors/shared/BSelectOnTabFocus.vue&#45;&gt;src/components/behaviors/LabelBehavior.vue -->
<g id="edge28" class="edge">
<title>src/components/behaviors/shared/BSelectOnTabFocus.vue&#45;&gt;src/components/behaviors/LabelBehavior.vue</title>
<path fill="none" stroke="#000000" stroke-width="2" stroke-opacity="0.200000" d="M315.64,-199C398.53,-199 540,-199 540,-199 540,-199 540,-276.74 540,-276.74"/>
<polygon fill="#000000" fill-opacity="0.200000" stroke="#000000" stroke-width="2" stroke-opacity="0.200000" points="537.9,-276.74 540,-282.74 542.1,-276.74 537.9,-276.74"/>
</g>
<!-- src/components/behaviors/shared/BUnselectOnCanvasClick.vue -->
<g id="node23" class="node">
<title>src/components/behaviors/shared/BUnselectOnCanvasClick.vue</title>
<g id="a_node23"><a xlink:href="../../src/components/behaviors/shared/BUnselectOnCanvasClick.vue" xlink:title="BUnselectOnCanvasClick.vue">
<path fill="#41f083" stroke="black" d="M321,-238C321,-238 193,-238 193,-238 190,-238 187,-235 187,-232 187,-232 187,-226 187,-226 187,-223 190,-220 193,-220 193,-220 321,-220 321,-220 324,-220 327,-223 327,-226 327,-226 327,-232 327,-232 327,-235 324,-238 321,-238"/>
<text text-anchor="start" x="195" y="-226.8" font-family="Helvetica,sans-Serif" font-size="9.00">BUnselectOnCanvasClick.vue</text>
</a>
</g>
</g>
<!-- src/components/behaviors/shared/BUnselectOnCanvasClick.vue&#45;&gt;src/components/behaviors/LabelBehavior.vue -->
<g id="edge29" class="edge">
<title>src/components/behaviors/shared/BUnselectOnCanvasClick.vue&#45;&gt;src/components/behaviors/LabelBehavior.vue</title>
<path fill="none" stroke="#000000" stroke-width="2" stroke-opacity="0.200000" d="M321,-238.03C321,-255.45 321,-292 321,-292 321,-292 497.9,-292 497.9,-292"/>
<polygon fill="#000000" fill-opacity="0.200000" stroke="#000000" stroke-width="2" stroke-opacity="0.200000" points="497.9,-294.1 503.9,-292 497.9,-289.9 497.9,-294.1"/>
</g>
<!-- src/components/behaviors/synchronization/BCreateSyncOnDblClick.vue -->
<g id="node24" class="node">
<title>src/components/behaviors/synchronization/BCreateSyncOnDblClick.vue</title>
<g id="a_node24"><a xlink:href="../../src/components/behaviors/synchronization/BCreateSyncOnDblClick.vue" xlink:title="BCreateSyncOnDblClick.vue">
<path fill="#41f083" stroke="black" d="M318,-88C318,-88 196,-88 196,-88 193,-88 190,-85 190,-82 190,-82 190,-76 190,-76 190,-73 193,-70 196,-70 196,-70 318,-70 318,-70 321,-70 324,-73 324,-76 324,-76 324,-82 324,-82 324,-85 321,-88 318,-88"/>
<text text-anchor="start" x="198" y="-76.8" font-family="Helvetica,sans-Serif" font-size="9.00">BCreateSyncOnDblClick.vue</text>
</a>
</g>
</g>
<!-- src/components/behaviors/synchronization/BCreateSyncOnDblClick.vue&#45;&gt;src/components/behaviors/LabelBehavior.vue -->
<g id="edge30" class="edge">
<title>src/components/behaviors/synchronization/BCreateSyncOnDblClick.vue&#45;&gt;src/components/behaviors/LabelBehavior.vue</title>
<path fill="none" stroke="#000000" stroke-width="2" stroke-opacity="0.200000" d="M324.34,-79C333.04,-79 339,-79 339,-79 339,-79 339,-290.5 339,-290.5 339,-290.5 497.95,-290.5 497.95,-290.5"/>
<polygon fill="#000000" fill-opacity="0.200000" stroke="#000000" stroke-width="2" stroke-opacity="0.200000" points="497.95,-292.6 503.95,-290.5 497.95,-288.4 497.95,-292.6"/>
</g>
<!-- src/components/behaviors/synchronization/BEditSyncOnDrag.vue -->
<g id="node25" class="node">
<title>src/components/behaviors/synchronization/BEditSyncOnDrag.vue</title>
<g id="a_node25"><a xlink:href="../../src/components/behaviors/synchronization/BEditSyncOnDrag.vue" xlink:title="BEditSyncOnDrag.vue">
<path fill="#41f083" stroke="black" d="M305,-118C305,-118 209,-118 209,-118 206,-118 203,-115 203,-112 203,-112 203,-106 203,-106 203,-103 206,-100 209,-100 209,-100 305,-100 305,-100 308,-100 311,-103 311,-106 311,-106 311,-112 311,-112 311,-115 308,-118 305,-118"/>
<text text-anchor="start" x="211" y="-106.8" font-family="Helvetica,sans-Serif" font-size="9.00">BEditSyncOnDrag.vue</text>
</a>
</g>
</g>
<!-- src/components/behaviors/synchronization/BEditSyncOnDrag.vue&#45;&gt;src/components/behaviors/LabelBehavior.vue -->
<g id="edge31" class="edge">
<title>src/components/behaviors/synchronization/BEditSyncOnDrag.vue&#45;&gt;src/components/behaviors/LabelBehavior.vue</title>
<path fill="none" stroke="#000000" stroke-width="2" stroke-opacity="0.200000" d="M311,-106C398.85,-106 563,-106 563,-106 563,-106 563,-276.78 563,-276.78"/>
<polygon fill="#000000" fill-opacity="0.200000" stroke="#000000" stroke-width="2" stroke-opacity="0.200000" points="560.9,-276.78 563,-282.78 565.1,-276.78 560.9,-276.78"/>
</g>
<!-- src/components/behaviors/synchronization/BEditSyncOnDrag.vue&#45;&gt;src/components/behaviors/scroll/BScrollOnEdgeDrag.vue -->
<g id="edge32" class="edge">
<title>src/components/behaviors/synchronization/BEditSyncOnDrag.vue&#45;&gt;src/components/behaviors/scroll/BScrollOnEdgeDrag.vue</title>
<path fill="none" stroke="#000000" stroke-width="2" stroke-opacity="0.200000" d="M311.02,-112C323.4,-112 333,-112 333,-112 333,-112 333,-362.5 333,-362.5 333,-362.5 354.85,-362.5 354.85,-362.5"/>
<polygon fill="#000000" fill-opacity="0.200000" stroke="#000000" stroke-width="2" stroke-opacity="0.200000" points="354.85,-364.6 360.85,-362.5 354.85,-360.4 354.85,-364.6"/>
</g>
<!-- src/components/behaviors/synchronization/SynchronizationBehavior.vue -->
<g id="node26" class="node">
<title>src/components/behaviors/synchronization/SynchronizationBehavior.vue</title>
<g id="a_node26"><a xlink:href="../../src/components/behaviors/synchronization/SynchronizationBehavior.vue" xlink:title="SynchronizationBehavior.vue">
<path fill="#41f083" stroke="black" d="M319.5,-58C319.5,-58 194.5,-58 194.5,-58 191.5,-58 188.5,-55 188.5,-52 188.5,-52 188.5,-46 188.5,-46 188.5,-43 191.5,-40 194.5,-40 194.5,-40 319.5,-40 319.5,-40 322.5,-40 325.5,-43 325.5,-46 325.5,-46 325.5,-52 325.5,-52 325.5,-55 322.5,-58 319.5,-58"/>
<text text-anchor="start" x="196.5" y="-46.8" font-family="Helvetica,sans-Serif" font-size="9.00">SynchronizationBehavior.vue</text>
</a>
</g>
</g>
<!-- src/components/behaviors/synchronization/SynchronizationBehavior.vue&#45;&gt;src/components/behaviors/LabelBehavior.vue -->
<g id="edge33" class="edge">
<title>src/components/behaviors/synchronization/SynchronizationBehavior.vue&#45;&gt;src/components/behaviors/LabelBehavior.vue</title>
<path fill="none" stroke="#000000" stroke-width="2" stroke-opacity="0.200000" d="M325.91,-49C337.04,-49 345,-49 345,-49 345,-49 345,-289 345,-289 345,-289 498,-289 498,-289"/>
<polygon fill="#000000" fill-opacity="0.200000" stroke="#000000" stroke-width="2" stroke-opacity="0.200000" points="498,-291.1 504,-289 498,-286.9 498,-291.1"/>
</g>
<!-- src/components/behaviors/zoom/BZoomOnCtrlScroll.vue -->
<g id="node27" class="node">
<title>src/components/behaviors/zoom/BZoomOnCtrlScroll.vue</title>
<g id="a_node27"><a xlink:href="../../src/components/behaviors/zoom/BZoomOnCtrlScroll.vue" xlink:title="BZoomOnCtrlScroll.vue">
<path fill="#41f083" stroke="black" d="M470,-58C470,-58 369,-58 369,-58 366,-58 363,-55 363,-52 363,-52 363,-46 363,-46 363,-43 366,-40 369,-40 369,-40 470,-40 470,-40 473,-40 476,-43 476,-46 476,-46 476,-52 476,-52 476,-55 473,-58 470,-58"/>
<text text-anchor="start" x="371" y="-46.8" font-family="Helvetica,sans-Serif" font-size="9.00">BZoomOnCtrlScroll.vue</text>
</a>
</g>
</g>
<!-- src/components/behaviors/zoom/BZoomOnCtrlScroll.vue&#45;&gt;src/components/behaviors/LabelBehavior.vue -->
<g id="edge34" class="edge">
<title>src/components/behaviors/zoom/BZoomOnCtrlScroll.vue&#45;&gt;src/components/behaviors/LabelBehavior.vue</title>
<path fill="none" stroke="#000000" stroke-width="2" stroke-opacity="0.200000" d="M476.08,-49C520.54,-49 575,-49 575,-49 575,-49 575,-276.77 575,-276.77"/>
<polygon fill="#000000" fill-opacity="0.200000" stroke="#000000" stroke-width="2" stroke-opacity="0.200000" points="572.9,-276.77 575,-282.77 577.1,-276.77 572.9,-276.77"/>
</g>
<!-- src/components/behaviors/zoom/BZoomOnWindowResize.vue -->
<g id="node28" class="node">
<title>src/components/behaviors/zoom/BZoomOnWindowResize.vue</title>
<g id="a_node28"><a xlink:href="../../src/components/behaviors/zoom/BZoomOnWindowResize.vue" xlink:title="BZoomOnWindowResize.vue">
<path fill="#41f083" stroke="black" d="M482,-88C482,-88 357,-88 357,-88 354,-88 351,-85 351,-82 351,-82 351,-76 351,-76 351,-73 354,-70 357,-70 357,-70 482,-70 482,-70 485,-70 488,-73 488,-76 488,-76 488,-82 488,-82 488,-85 485,-88 482,-88"/>
<text text-anchor="start" x="359" y="-76.8" font-family="Helvetica,sans-Serif" font-size="9.00">BZoomOnWindowResize.vue</text>
</a>
</g>
</g>
<!-- src/components/behaviors/zoom/BZoomOnWindowResize.vue&#45;&gt;src/components/behaviors/LabelBehavior.vue -->
<g id="edge35" class="edge">
<title>src/components/behaviors/zoom/BZoomOnWindowResize.vue&#45;&gt;src/components/behaviors/LabelBehavior.vue</title>
<path fill="none" stroke="#000000" stroke-width="2" stroke-opacity="0.200000" d="M484,-88.23C484,-128.58 484,-287.5 484,-287.5 484,-287.5 497.74,-287.5 497.74,-287.5"/>
<polygon fill="#000000" fill-opacity="0.200000" stroke="#000000" stroke-width="2" stroke-opacity="0.200000" points="497.74,-289.6 503.74,-287.5 497.74,-285.4 497.74,-289.6"/>
</g>
</g>
</svg>
