{
  "staffs": [
    {
      "top": 27,
      "bottom": 117
    },
    {
      "top": 176,
      "bottom": 266
    },
    {
      "top": 293,
      "bottom": 383
    }
  ],
  "onset-x": [
    {
      "onset": 0,
      "x": 246
    },
    {
      "onset": 3,
      "x": 336
    },
    {
      "onset": 6,
      "x": 427
    },
    {
      "onset": 8,
      "x": 490
    },
    {
      "onset": 9,
      "x": 541
    },
    {
      "onset": 11,
      "x": 604
    },
    {
      "onset": 12,
      "x": 655
    },
    {
      "onset": 12.5,
      "x": 683
    },
    {
      "onset": 13,
      "x": 710
    },
    {
      "onset": 14,
      "x": 752
    },
    {
      "onset": 15,
      "x": 803
    },
    {
      "onset": 15.5,
      "x": 830
    },
    {
      "onset": 16,
      "x": 858
    },
    {
      "onset": 17,
      "x": 899
    },
    {
      "onset": 18,
      "x": 951
    },
    {
      "onset": 19,
      "x": 992
    },
    {
      "onset": 20,
      "x": 1034
    },
    {
      "onset": 21,
      "x": 1097
    },
    {
      "onset": 22,
      "x": 1139
    },
    {
      "onset": 23,
      "x": 1180
    },
    {
      "onset": 24,
      "x": 1232
    },
    {
      "onset": 25,
      "x": 1273
    },
    {
      "onset": 25.5,
      "x": 1307
    },
    {
      "onset": 26,
      "x": 1334
    },
    {
      "onset": 26.5,
      "x": 1362
    },
    {
      "onset": 27,
      "x": 1399
    },
    {
      "onset": 28,
      "x": 1440
    },
    {
      "onset": 28.5,
      "x": 1468
    },
    {
      "onset": 29,
      "x": 1511
    },
    {
      "onset": 29.5,
      "x": 1538
    },
    {
      "onset": 30,
      "x": 1576
    },
    {
      "onset": 30.5,
      "x": 1607
    },
    {
      "onset": 31,
      "x": 1635
    },
    {
      "onset": 31.5,
      "x": 1679
    },
    {
      "onset": 32,
      "x": 1719
    },
    {
      "onset": 32.5,
      "x": 1747
    },
    {
      "onset": 33,
      "x": 1784
    },
    {
      "onset": 34,
      "x": 1827
    },
    {
      "onset": 34.5,
      "x": 1857
    },
    {
      "onset": 35,
      "x": 1885
    },
    {
      "onset": 35.5,
      "x": 1914
    },
    {
      "onset": 36,
      "x": 1962
    },
    {
      "onset": 37,
      "x": 2003
    },
    {
      "onset": 37.5,
      "x": 2031
    },
    {
      "onset": 38,
      "x": 2074
    },
    {
      "onset": 38.5,
      "x": 2101
    },
    {
      "onset": 39,
      "x": 2139
    },
    {
      "onset": 40,
      "x": 2180
    },
    {
      "onset": 40.5,
      "x": 2216
    },
    {
      "onset": 41,
      "x": 2244
    },
    {
      "onset": 41.5,
      "x": 2271
    },
    {
      "onset": 42,
      "x": 2308
    },
    {
      "onset": 42.5,
      "x": 2336
    },
    {
      "onset": 43,
      "x": 2363
    },
    {
      "onset": 43.5,
      "x": 2397
    },
    {
      "onset": 44,
      "x": 2424
    },
    {
      "onset": 44.5,
      "x": 2452
    },
    {
      "onset": 45,
      "x": 2489
    },
    {
      "onset": 46,
      "x": 2531
    },
    {
      "onset": 46.5,
      "x": 2558
    },
    {
      "onset": 47,
      "x": 2592
    },
    {
      "onset": 47.5,
      "x": 2619
    },
    {
      "onset": 48,
      "x": 2656
    },
    {
      "onset": 49,
      "x": 2698
    },
    {
      "onset": 49.5,
      "x": 2725
    },
    {
      "onset": 50,
      "x": 2753
    },
    {
      "onset": 50.5,
      "x": 2780
    },
    {
      "onset": 51,
      "x": 2818
    },
    {
      "onset": 52,
      "x": 2859
    },
    {
      "onset": 52.5,
      "x": 2887
    },
    {
      "onset": 53,
      "x": 2914
    },
    {
      "onset": 53.5,
      "x": 2942
    },
    {
      "onset": 54,
      "x": 2979
    },
    {
      "onset": 54.5,
      "x": 3006
    },
    {
      "onset": 55,
      "x": 3034
    },
    {
      "onset": 55.5,
      "x": 3061
    },
    {
      "onset": 56,
      "x": 3089
    },
    {
      "onset": 56.5,
      "x": 3116
    },
    {
      "onset": 57,
      "x": 3154
    },
    {
      "onset": 58,
      "x": 3195
    },
    {
      "onset": 58.5,
      "x": 3223
    },
    {
      "onset": 59,
      "x": 3250
    },
    {
      "onset": 59.5,
      "x": 3278
    },
    {
      "onset": 60,
      "x": 3327
    },
    {
      "onset": 61,
      "x": 3368
    },
    {
      "onset": 61.5,
      "x": 3396
    },
    {
      "onset": 62,
      "x": 3423
    },
    {
      "onset": 62.5,
      "x": 3451
    },
    {
      "onset": 63,
      "x": 3498
    },
    {
      "onset": 64,
      "x": 3540
    },
    {
      "onset": 64.5,
      "x": 3567
    },
    {
      "onset": 65,
      "x": 3595
    },
    {
      "onset": 65.5,
      "x": 3622
    },
    {
      "onset": 66,
      "x": 3670
    },
    {
      "onset": 66.5,
      "x": 3697
    },
    {
      "onset": 67,
      "x": 3725
    },
    {
      "onset": 67.5,
      "x": 3752
    },
    {
      "onset": 68,
      "x": 3780
    },
    {
      "onset": 68.5,
      "x": 3807
    },
    {
      "onset": 69,
      "x": 3855
    },
    {
      "onset": 70,
      "x": 3896
    },
    {
      "onset": 70.5,
      "x": 3924
    },
    {
      "onset": 71,
      "x": 3951
    },
    {
      "onset": 71.5,
      "x": 3979
    },
    {
      "onset": 72,
      "x": 4016
    },
    {
      "onset": 73,
      "x": 4058
    },
    {
      "onset": 74,
      "x": 4099
    },
    {
      "onset": 75,
      "x": 4150
    },
    {
      "onset": 76,
      "x": 4192
    },
    {
      "onset": 77,
      "x": 4233
    },
    {
      "onset": 78,
      "x": 4285
    },
    {
      "onset": 79,
      "x": 4326
    },
    {
      "onset": 80,
      "x": 4368
    },
    {
      "onset": 80.5,
      "x": 4395
    },
    {
      "onset": 81,
      "x": 4441
    },
    {
      "onset": 82,
      "x": 4482
    },
    {
      "onset": 83,
      "x": 4524
    },
    {
      "onset": 84,
      "x": 4585
    },
    {
      "onset": 85,
      "x": 4627
    },
    {
      "onset": 85.5,
      "x": 4654
    },
    {
      "onset": 86,
      "x": 4682
    },
    {
      "onset": 87,
      "x": 4733
    },
    {
      "onset": 88,
      "x": 4774
    },
    {
      "onset": 89,
      "x": 4816
    },
    {
      "onset": 90,
      "x": 4878
    },
    {
      "onset": 91,
      "x": 4920
    },
    {
      "onset": 92,
      "x": 4961
    },
    {
      "onset": 93,
      "x": 5033
    },
    {
      "onset": 94,
      "x": 5074
    },
    {
      "onset": 95,
      "x": 5116
    },
    {
      "onset": 96,
      "x": 5178
    },
    {
      "onset": 97,
      "x": 5220
    },
    {
      "onset": 98,
      "x": 5261
    },
    {
      "onset": 98.5,
      "x": 5289
    },
    {
      "onset": 99,
      "x": 5337
    },
    {
      "onset": 100,
      "x": 5378
    },
    {
      "onset": 101,
      "x": 5420
    },
    {
      "onset": 102,
      "x": 5471
    },
    {
      "onset": 103,
      "x": 5512
    },
    {
      "onset": 104,
      "x": 5554
    },
    {
      "onset": 105,
      "x": 5613
    },
    {
      "onset": 106,
      "x": 5655
    },
    {
      "onset": 107,
      "x": 5696
    },
    {
      "onset": 108,
      "x": 5758
    },
    {
      "onset": 109,
      "x": 5799
    },
    {
      "onset": 109.5,
      "x": 5827
    },
    {
      "onset": 110,
      "x": 5854
    },
    {
      "onset": 111,
      "x": 5906
    },
    {
      "onset": 112,
      "x": 5947
    },
    {
      "onset": 113,
      "x": 5989
    },
    {
      "onset": 114,
      "x": 6051
    },
    {
      "onset": 115,
      "x": 6093
    },
    {
      "onset": 116,
      "x": 6134
    },
    {
      "onset": 117,
      "x": 6197
    },
    {
      "onset": 118,
      "x": 6238
    },
    {
      "onset": 119,
      "x": 6280
    },
    {
      "onset": 120,
      "x": 6331
    },
    {
      "onset": 121,
      "x": 6372
    },
    {
      "onset": 121.5,
      "x": 6400
    },
    {
      "onset": 122,
      "x": 6427
    },
    {
      "onset": 122.5,
      "x": 6455
    },
    {
      "onset": 123,
      "x": 6504
    },
    {
      "onset": 124,
      "x": 6546
    },
    {
      "onset": 124.5,
      "x": 6573
    },
    {
      "onset": 125,
      "x": 6601
    },
    {
      "onset": 125.5,
      "x": 6628
    },
    {
      "onset": 126,
      "x": 6674
    },
    {
      "onset": 126.5,
      "x": 6701
    },
    {
      "onset": 127,
      "x": 6729
    },
    {
      "onset": 127.5,
      "x": 6756
    },
    {
      "onset": 128,
      "x": 6784
    },
    {
      "onset": 128.5,
      "x": 6811
    },
    {
      "onset": 129,
      "x": 6860
    },
    {
      "onset": 130,
      "x": 6902
    },
    {
      "onset": 130.5,
      "x": 6929
    },
    {
      "onset": 131,
      "x": 6957
    },
    {
      "onset": 131.5,
      "x": 6984
    },
    {
      "onset": 132,
      "x": 7032
    },
    {
      "onset": 133,
      "x": 7073
    },
    {
      "onset": 133.5,
      "x": 7101
    },
    {
      "onset": 134,
      "x": 7128
    },
    {
      "onset": 134.5,
      "x": 7156
    },
    {
      "onset": 135,
      "x": 7193
    },
    {
      "onset": 136,
      "x": 7235
    },
    {
      "onset": 136.5,
      "x": 7267
    },
    {
      "onset": 137,
      "x": 7302
    },
    {
      "onset": 137.5,
      "x": 7330
    },
    {
      "onset": 138,
      "x": 7367
    },
    {
      "onset": 139,
      "x": 7434
    },
    {
      "onset": 139.5,
      "x": 7463
    },
    {
      "onset": 140,
      "x": 7493
    },
    {
      "onset": 140.5,
      "x": 7533
    },
    {
      "onset": 141,
      "x": 7571
    },
    {
      "onset": 142,
      "x": 7612
    },
    {
      "onset": 142.5,
      "x": 7640
    },
    {
      "onset": 143,
      "x": 7668
    },
    {
      "onset": 143.5,
      "x": 7696
    },
    {
      "onset": 144,
      "x": 7744
    },
    {
      "onset": 145,
      "x": 7786
    },
    {
      "onset": 145.5,
      "x": 7813
    },
    {
      "onset": 146,
      "x": 7841
    },
    {
      "onset": 146.5,
      "x": 7868
    },
    {
      "onset": 147,
      "x": 7917
    },
    {
      "onset": 148,
      "x": 7958
    },
    {
      "onset": 148.5,
      "x": 7986
    },
    {
      "onset": 149,
      "x": 8013
    },
    {
      "onset": 149.5,
      "x": 8041
    },
    {
      "onset": 150,
      "x": 8089
    },
    {
      "onset": 150.5,
      "x": 8117
    },
    {
      "onset": 151,
      "x": 8144
    },
    {
      "onset": 151.5,
      "x": 8172
    },
    {
      "onset": 152,
      "x": 8199
    },
    {
      "onset": 152.5,
      "x": 8227
    },
    {
      "onset": 153,
      "x": 8275
    },
    {
      "onset": 154,
      "x": 8317
    },
    {
      "onset": 154.5,
      "x": 8344
    },
    {
      "onset": 155,
      "x": 8372
    },
    {
      "onset": 155.5,
      "x": 8399
    },
    {
      "onset": 156,
      "x": 8447
    },
    {
      "onset": 157,
      "x": 8488
    },
    {
      "onset": 157.5,
      "x": 8516
    },
    {
      "onset": 158,
      "x": 8556
    },
    {
      "onset": 158.5,
      "x": 8586
    },
    {
      "onset": 159,
      "x": 8623
    },
    {
      "onset": 160,
      "x": 8665
    },
    {
      "onset": 160.5,
      "x": 8692
    },
    {
      "onset": 161,
      "x": 8736
    },
    {
      "onset": 161.5,
      "x": 8766
    },
    {
      "onset": 162,
      "x": 8804
    },
    {
      "onset": 162.5,
      "x": 8845
    },
    {
      "onset": 163,
      "x": 8872
    },
    {
      "onset": 163.5,
      "x": 8923
    },
    {
      "onset": 164,
      "x": 8953
    },
    {
      "onset": 164.5,
      "x": 8995
    },
    {
      "onset": 165,
      "x": 9037
    },
    {
      "onset": 166,
      "x": 9078
    },
    {
      "onset": 166.5,
      "x": 9108
    },
    {
      "onset": 167,
      "x": 9153
    },
    {
      "onset": 167.5,
      "x": 9186
    },
    {
      "onset": 168,
      "x": 9245
    },
    {
      "onset": 168.5,
      "x": 9272
    },
    {
      "onset": 169,
      "x": 9300
    },
    {
      "onset": 169.5,
      "x": 9327
    },
    {
      "onset": 170,
      "x": 9355
    },
    {
      "onset": 171,
      "x": 9406
    },
    {
      "onset": 172,
      "x": 9447
    },
    {
      "onset": 172.5,
      "x": 9475
    },
    {
      "onset": 173,
      "x": 9502
    },
    {
      "onset": 173.5,
      "x": 9530
    },
    {
      "onset": 174,
      "x": 9567
    },
    {
      "onset": 175,
      "x": 9609
    },
    {
      "onset": 176,
      "x": 9650
    },
    {
      "onset": 177,
      "x": 9714
    },
    {
      "onset": 178,
      "x": 9755
    },
    {
      "onset": 179,
      "x": 9797
    },
    {
      "onset": 180,
      "x": 9851
    },
    {
      "onset": 181,
      "x": 9892
    },
    {
      "onset": 181.5,
      "x": 9920
    },
    {
      "onset": 182,
      "x": 9947
    },
    {
      "onset": 182.5,
      "x": 9975
    },
    {
      "onset": 183,
      "x": 10012
    },
    {
      "onset": 184,
      "x": 10054
    },
    {
      "onset": 184.5,
      "x": 10081
    },
    {
      "onset": 185,
      "x": 10117
    },
    {
      "onset": 185.5,
      "x": 10157
    },
    {
      "onset": 186,
      "x": 10195
    },
    {
      "onset": 186.5,
      "x": 10222
    },
    {
      "onset": 187,
      "x": 10250
    },
    {
      "onset": 187.5,
      "x": 10277
    },
    {
      "onset": 188,
      "x": 10305
    },
    {
      "onset": 188.5,
      "x": 10340
    },
    {
      "onset": 189,
      "x": 10380
    },
    {
      "onset": 190,
      "x": 10421
    },
    {
      "onset": 190.5,
      "x": 10449
    },
    {
      "onset": 191,
      "x": 10495
    },
    {
      "onset": 191.5,
      "x": 10522
    },
    {
      "onset": 192,
      "x": 10570
    },
    {
      "onset": 193,
      "x": 10615
    },
    {
      "onset": 193.5,
      "x": 10644
    },
    {
      "onset": 194,
      "x": 10690
    },
    {
      "onset": 194.5,
      "x": 10718
    },
    {
      "onset": 195,
      "x": 10761
    },
    {
      "onset": 196,
      "x": 10802
    },
    {
      "onset": 196.5,
      "x": 10830
    },
    {
      "onset": 197,
      "x": 10869
    },
    {
      "onset": 197.5,
      "x": 10918
    },
    {
      "onset": 198,
      "x": 10956
    },
    {
      "onset": 198.5,
      "x": 10983
    },
    {
      "onset": 199,
      "x": 11011
    },
    {
      "onset": 199.5,
      "x": 11038
    },
    {
      "onset": 200,
      "x": 11078
    },
    {
      "onset": 200.5,
      "x": 11117
    },
    {
      "onset": 201,
      "x": 11155
    },
    {
      "onset": 202,
      "x": 11196
    },
    {
      "onset": 202.5,
      "x": 11224
    },
    {
      "onset": 203,
      "x": 11263
    },
    {
      "onset": 203.5,
      "x": 11300
    },
    {
      "onset": 204,
      "x": 11337
    },
    {
      "onset": 205,
      "x": 11378
    },
    {
      "onset": 205.5,
      "x": 11406
    },
    {
      "onset": 206,
      "x": 11433
    },
    {
      "onset": 206.5,
      "x": 11461
    },
    {
      "onset": 207,
      "x": 11498
    },
    {
      "onset": 208,
      "x": 11540
    },
    {
      "onset": 208.5,
      "x": 11567
    },
    {
      "onset": 209,
      "x": 11595
    },
    {
      "onset": 209.5,
      "x": 11622
    },
    {
      "onset": 210,
      "x": 11659
    },
    {
      "onset": 210.5,
      "x": 11687
    },
    {
      "onset": 211,
      "x": 11714
    },
    {
      "onset": 211.5,
      "x": 11742
    },
    {
      "onset": 212,
      "x": 11769
    },
    {
      "onset": 212.5,
      "x": 11797
    },
    {
      "onset": 213,
      "x": 11834
    },
    {
      "onset": 214,
      "x": 11876
    },
    {
      "onset": 214.5,
      "x": 11903
    },
    {
      "onset": 215,
      "x": 11931
    },
    {
      "onset": 215.5,
      "x": 11958
    },
    {
      "onset": 216,
      "x": 12007
    },
    {
      "onset": 217,
      "x": 12048
    },
    {
      "onset": 217.5,
      "x": 12076
    },
    {
      "onset": 218,
      "x": 12103
    },
    {
      "onset": 218.5,
      "x": 12131
    },
    {
      "onset": 219,
      "x": 12168
    },
    {
      "onset": 220,
      "x": 12210
    },
    {
      "onset": 220.5,
      "x": 12237
    },
    {
      "onset": 221,
      "x": 12265
    },
    {
      "onset": 221.5,
      "x": 12292
    },
    {
      "onset": 222,
      "x": 12335
    },
    {
      "onset": 222.5,
      "x": 12363
    },
    {
      "onset": 223,
      "x": 12390
    },
    {
      "onset": 223.5,
      "x": 12418
    },
    {
      "onset": 224,
      "x": 12445
    },
    {
      "onset": 224.5,
      "x": 12473
    },
    {
      "onset": 225,
      "x": 12510
    },
    {
      "onset": 226,
      "x": 12552
    },
    {
      "onset": 226.5,
      "x": 12579
    },
    {
      "onset": 227,
      "x": 12607
    },
    {
      "onset": 227.5,
      "x": 12634
    },
    {
      "onset": 228,
      "x": 12671
    },
    {
      "onset": 229,
      "x": 12713
    },
    {
      "onset": 230,
      "x": 12754
    },
    {
      "onset": 231,
      "x": 12806
    },
    {
      "onset": 232,
      "x": 12847
    },
    {
      "onset": 233,
      "x": 12889
    },
    {
      "onset": 233.5,
      "x": 12916
    },
    {
      "onset": 234,
      "x": 12953
    },
    {
      "onset": 235,
      "x": 12995
    },
    {
      "onset": 236,
      "x": 13036
    },
    {
      "onset": 237,
      "x": 13096
    },
    {
      "onset": 238,
      "x": 13137
    },
    {
      "onset": 239,
      "x": 13179
    },
    {
      "onset": 239.5,
      "x": 13206
    },
    {
      "onset": 240,
      "x": 13254
    },
    {
      "onset": 241,
      "x": 13296
    },
    {
      "onset": 241.5,
      "x": 13323
    },
    {
      "onset": 242,
      "x": 13351
    },
    {
      "onset": 243,
      "x": 13402
    },
    {
      "onset": 244,
      "x": 13443
    },
    {
      "onset": 245,
      "x": 13485
    },
    {
      "onset": 246,
      "x": 13547
    },
    {
      "onset": 247,
      "x": 13589
    },
    {
      "onset": 248,
      "x": 13630
    },
    {
      "onset": 249,
      "x": 13690
    },
    {
      "onset": 250,
      "x": 13731
    },
    {
      "onset": 251,
      "x": 13773
    },
    {
      "onset": 251.5,
      "x": 13800
    },
    {
      "onset": 252,
      "x": 13849
    },
    {
      "onset": 253,
      "x": 13890
    },
    {
      "onset": 254,
      "x": 13932
    },
    {
      "onset": 255,
      "x": 13983
    },
    {
      "onset": 256,
      "x": 14024
    },
    {
      "onset": 257,
      "x": 14066
    },
    {
      "onset": 257.5,
      "x": 14093
    },
    {
      "onset": 258,
      "x": 14131
    },
    {
      "onset": 259,
      "x": 14172
    },
    {
      "onset": 260,
      "x": 14214
    },
    {
      "onset": 261,
      "x": 14276
    },
    {
      "onset": 262,
      "x": 14317
    },
    {
      "onset": 262.5,
      "x": 14345
    },
    {
      "onset": 263,
      "x": 14372
    },
    {
      "onset": 263.5,
      "x": 14400
    },
    {
      "onset": 264,
      "x": 14450
    },
    {
      "onset": 265,
      "x": 14492
    },
    {
      "onset": 265.5,
      "x": 14519
    },
    {
      "onset": 266,
      "x": 14547
    },
    {
      "onset": 267,
      "x": 14598
    },
    {
      "onset": 268,
      "x": 14639
    },
    {
      "onset": 269,
      "x": 14681
    },
    {
      "onset": 270,
      "x": 14732
    },
    {
      "onset": 271,
      "x": 14774
    },
    {
      "onset": 272,
      "x": 14815
    },
    {
      "onset": 273,
      "x": 14878
    },
    {
      "onset": 274,
      "x": 14919
    },
    {
      "onset": 275,
      "x": 14961
    },
    {
      "onset": 276,
      "x": 15012
    },
    {
      "onset": 277,
      "x": 15053
    },
    {
      "onset": 278,
      "x": 15095
    },
    {
      "onset": 279,
      "x": 15146
    },
    {
      "onset": 279.5,
      "x": 15174
    },
    {
      "onset": 280,
      "x": 15201
    },
    {
      "onset": 281,
      "x": 15243
    },
    {
      "onset": 282,
      "x": 15294
    },
    {
      "onset": 282.5,
      "x": 15321
    },
    {
      "onset": 283,
      "x": 15349
    },
    {
      "onset": 283.5,
      "x": 15376
    },
    {
      "onset": 284,
      "x": 15404
    },
    {
      "onset": 284.5,
      "x": 15431
    },
    {
      "onset": 285,
      "x": 15481
    },
    {
      "onset": 286,
      "x": 15523
    },
    {
      "onset": 287,
      "x": 15564
    },
    {
      "onset": 288,
      "x": 15618
    },
    {
      "onset": 289,
      "x": 15660
    },
    {
      "onset": 289.5,
      "x": 15687
    },
    {
      "onset": 290,
      "x": 15715
    },
    {
      "onset": 290.5,
      "x": 15742
    },
    {
      "onset": 291,
      "x": 15779
    },
    {
      "onset": 292,
      "x": 15821
    },
    {
      "onset": 292.5,
      "x": 15860
    },
    {
      "onset": 293,
      "x": 15888
    },
    {
      "onset": 293.5,
      "x": 15915
    },
    {
      "onset": 294,
      "x": 15953
    },
    {
      "onset": 294.5,
      "x": 15982
    },
    {
      "onset": 295,
      "x": 16018
    },
    {
      "onset": 295.5,
      "x": 16070
    },
    {
      "onset": 296,
      "x": 16106
    },
    {
      "onset": 296.5,
      "x": 16143
    },
    {
      "onset": 297,
      "x": 16180
    },
    {
      "onset": 298,
      "x": 16221
    },
    {
      "onset": 298.5,
      "x": 16249
    },
    {
      "onset": 299,
      "x": 16285
    },
    {
      "onset": 299.5,
      "x": 16325
    },
    {
      "onset": 300,
      "x": 16373
    },
    {
      "onset": 301,
      "x": 16417
    },
    {
      "onset": 301.5,
      "x": 16451
    },
    {
      "onset": 302,
      "x": 16478
    },
    {
      "onset": 302.5,
      "x": 16506
    },
    {
      "onset": 303,
      "x": 16543
    },
    {
      "onset": 304,
      "x": 16585
    },
    {
      "onset": 304.5,
      "x": 16612
    },
    {
      "onset": 305,
      "x": 16647
    },
    {
      "onset": 305.5,
      "x": 16690
    },
    {
      "onset": 306,
      "x": 16727
    },
    {
      "onset": 306.5,
      "x": 16755
    },
    {
      "onset": 307,
      "x": 16782
    },
    {
      "onset": 307.5,
      "x": 16810
    },
    {
      "onset": 308,
      "x": 16837
    },
    {
      "onset": 308.5,
      "x": 16883
    },
    {
      "onset": 309,
      "x": 16920
    },
    {
      "onset": 310,
      "x": 16962
    },
    {
      "onset": 310.5,
      "x": 16989
    },
    {
      "onset": 311,
      "x": 17029
    },
    {
      "onset": 311.5,
      "x": 17057
    },
    {
      "onset": 312,
      "x": 17094
    },
    {
      "onset": 313,
      "x": 17136
    },
    {
      "onset": 313.5,
      "x": 17163
    },
    {
      "onset": 314,
      "x": 17191
    },
    {
      "onset": 314.5,
      "x": 17218
    },
    {
      "onset": 315,
      "x": 17255
    },
    {
      "onset": 316,
      "x": 17297
    },
    {
      "onset": 316.5,
      "x": 17324
    },
    {
      "onset": 317,
      "x": 17352
    },
    {
      "onset": 317.5,
      "x": 17379
    },
    {
      "onset": 318,
      "x": 17417
    },
    {
      "onset": 319,
      "x": 17458
    },
    {
      "onset": 319.5,
      "x": 17486
    },
    {
      "onset": 320,
      "x": 17513
    },
    {
      "onset": 320.5,
      "x": 17541
    },
    {
      "onset": 321,
      "x": 17578
    },
    {
      "onset": 322,
      "x": 17619
    },
    {
      "onset": 322.5,
      "x": 17647
    },
    {
      "onset": 323,
      "x": 17674
    },
    {
      "onset": 323.5,
      "x": 17702
    },
    {
      "onset": 324,
      "x": 17739
    },
    {
      "onset": 325,
      "x": 17781
    },
    {
      "onset": 326,
      "x": 17822
    },
    {
      "onset": 327,
      "x": 17873
    },
    {
      "onset": 328,
      "x": 17915
    },
    {
      "onset": 329,
      "x": 17956
    },
    {
      "onset": 329.5,
      "x": 17984
    },
    {
      "onset": 330,
      "x": 18021
    },
    {
      "onset": 331,
      "x": 18063
    },
    {
      "onset": 332,
      "x": 18104
    },
    {
      "onset": 333,
      "x": 18155
    },
    {
      "onset": 335,
      "x": 18218
    },
    {
      "onset": 335.5,
      "x": 18246
    },
    {
      "onset": 336,
      "x": 18296
    },
    {
      "onset": 336.375,
      "x": 18319
    },
    {
      "onset": 336.5,
      "x": 18336
    },
    {
      "onset": 337,
      "x": 18363
    },
    {
      "onset": 337.5,
      "x": 18391
    },
    {
      "onset": 338,
      "x": 18418
    },
    {
      "onset": 338.5,
      "x": 18446
    },
    {
      "onset": 339,
      "x": 18495
    },
    {
      "onset": 339.5,
      "x": 18523
    },
    {
      "onset": 340,
      "x": 18550
    },
    {
      "onset": 340.5,
      "x": 18578
    },
    {
      "onset": 341,
      "x": 18605
    },
    {
      "onset": 342,
      "x": 18669
    },
    {
      "onset": 342.375,
      "x": 18692
    },
    {
      "onset": 343,
      "x": 18724
    },
    {
      "onset": 343.5,
      "x": 18751
    },
    {
      "onset": 344,
      "x": 18779
    },
    {
      "onset": 344.5,
      "x": 18806
    },
    {
      "onset": 345,
      "x": 18856
    },
    {
      "onset": 345.375,
      "x": 18879
    },
    {
      "onset": 346,
      "x": 18910
    },
    {
      "onset": 346.5,
      "x": 18938
    },
    {
      "onset": 347,
      "x": 18965
    },
    {
      "onset": 347.5,
      "x": 18993
    },
    {
      "onset": 348,
      "x": 19043
    },
    {
      "onset": 349,
      "x": 19084
    },
    {
      "onset": 350,
      "x": 19126
    },
    {
      "onset": 351,
      "x": 19189
    },
    {
      "onset": 354,
      "x": 19292
    },
    {
      "onset": 357,
      "x": 19395
    },
    {
      "onset": 360,
      "x": 19485
    },
    {
      "onset": 363,
      "x": 19575
    },
    {
      "onset": 364,
      "x": 19617
    },
    {
      "onset": 365,
      "x": 19658
    },
    {
      "onset": 366,
      "x": 19710
    },
    {
      "onset": 369,
      "x": 19800
    },
    {
      "onset": 370,
      "x": 19841
    },
    {
      "onset": 371,
      "x": 19883
    },
    {
      "onset": 372,
      "x": 19934
    },
    {
      "onset": 375,
      "x": 20024
    },
    {
      "onset": 376,
      "x": 20066
    },
    {
      "onset": 377,
      "x": 20107
    },
    {
      "onset": 378,
      "x": 20159
    },
    {
      "onset": 381,
      "x": 20249
    },
    {
      "onset": 382,
      "x": 20290
    },
    {
      "onset": 383,
      "x": 20332
    },
    {
      "onset": 384,
      "x": 20393
    },
    {
      "onset": 385,
      "x": 20435
    },
    {
      "onset": 386,
      "x": 20476
    },
    {
      "onset": 387,
      "x": 20538
    },
    {
      "onset": 388,
      "x": 20580
    },
    {
      "onset": 389,
      "x": 20621
    },
    {
      "onset": 390,
      "x": 20672
    },
    {
      "onset": 393,
      "x": 20763
    },
    {
      "onset": 394.5,
      "x": 20816
    },
    {
      "onset": 395,
      "x": 20843
    },
    {
      "onset": 395.5,
      "x": 20873
    },
    {
      "onset": 396,
      "x": 20910
    },
    {
      "onset": 396.5,
      "x": 20938
    },
    {
      "onset": 397,
      "x": 20965
    },
    {
      "onset": 397.5,
      "x": 20993
    },
    {
      "onset": 398,
      "x": 21020
    },
    {
      "onset": 398.5,
      "x": 21048
    },
    {
      "onset": 399,
      "x": 21085
    },
    {
      "onset": 399.5,
      "x": 21113
    },
    {
      "onset": 400,
      "x": 21140
    },
    {
      "onset": 400.5,
      "x": 21168
    },
    {
      "onset": 401,
      "x": 21195
    },
    {
      "onset": 401.5,
      "x": 21223
    },
    {
      "onset": 402,
      "x": 21260
    },
    {
      "onset": 403,
      "x": 21301
    },
    {
      "onset": 404,
      "x": 21343
    },
    {
      "onset": 405,
      "x": 21407
    },
    {
      "onset": 406,
      "x": 21448
    },
    {
      "onset": 407,
      "x": 21490
    },
    {
      "onset": 408,
      "x": 21549
    },
    {
      "onset": 409,
      "x": 21591
    },
    {
      "onset": 410,
      "x": 21632
    }
  ]
}