[
  {
    "onset": 0,
    "date": 0
  },
  {
    "onset": 3,
    "date": 1.59
  },
  {
    "onset": 6,
    "date": 3.01
  },
  {
    "onset": 9,
    "date": 4.10
  },
  {
    "onset": 12,
    "date": 5.32
  },
  {
    "onset": 15,
    "date": 6.73
  },
  {
    "onset": 18,
    "date": 7.65
  },
  {
    "onset": 21,
    "date": 8.76
  },
  {
    "onset": 24,
    "date": 9.80
  },
  {
    "onset": 27,
    "date": 10.81
  },
  {
    "onset": 30,
    "date": 11.66
  },
  {
    "onset": 33,
    "date": 12.86
  },
  {
    "onset": 36,
    "date": 14.08
  },
  {
    "onset": 39,
    "date": 15.32
  },
  {
    "onset": 42,
    "date": 16.34
  },
  {
    "onset": 45,
    "date": 17.33
  },
  {
    "onset": 48,
    "date": 18.04
  },
  {
    "onset": 51,
    "date": 19.23
  },
  {
    "onset": 54,
    "date": 20.20
  },
  {
    "onset": 57,
    "date": 21.35
  },
  {
    "onset": 60,
    "date": 22.48
  },
  {
    "onset": 63,
    "date": 23.79
  },
  {
    "onset": 66,
    "date": 26.06
  },
  {
    "onset": 69,
    "date": 26.51
  },
  {
    "onset": 72,
    "date": 28.28
  },
  {
    "onset": 75,
    "date": 29.35
  },
  {
    "onset": 78,
    "date": 30.62
  },
  {
    "onset": 81,
    "date": 32.09
  },
  {
    "onset": 84,
    "date": 33.07
  },
  {
    "onset": 87,
    "date": 34.13
  },
  {
    "onset": 90,
    "date": 35.10
  },
  {
    "onset": 93,
    "date": 36.46
  },
  {
    "onset": 96,
    "date": 37.84
  },
  {
    "onset": 99,
    "date": 39.04
  },
  {
    "onset": 102,
    "date": 40.26
  },
  {
    "onset": 105,
    "date": 41.70
  },
  {
    "onset": 108,
    "date": 42.94
  },
  {
    "onset": 111,
    "date": 44.29
  },
  {
    "onset": 114,
    "date": 45.68
  },
  {
    "onset": 117,
    "date": 46.85
  },
  {
    "onset": 120,
    "date": 47.93
  },
  {
    "onset": 123,
    "date": 49.11
  },
  {
    "onset": 126,
    "date": 50.36
  },
  {
    "onset": 129,
    "date": 51.64
  },
  {
    "onset": 132,
    "date": 52.82
  },
  {
    "onset": 135,
    "date": 53.89
  },
  {
    "onset": 138,
    "date": 54.89
  },
  {
    "onset": 141,
    "date": 55.99
  },
  {
    "onset": 144,
    "date": 57.07
  },
  {
    "onset": 147,
    "date": 58.13
  },
  {
    "onset": 150,
    "date": 59.46
  },
  {
    "onset": 153,
    "date": 60.66
  },
  {
    "onset": 156,
    "date": 61.80
  },
  {
    "onset": 159,
    "date": 62.94
  },
  {
    "onset": 162,
    "date": 64.24
  },
  {
    "onset": 165,
    "date": 65.36
  },
  {
    "onset": 168,
    "date": 66.51
  },
  {
    "onset": 171,
    "date": 67.79
  },
  {
    "onset": 174,
    "date": 68.87
  },
  {
    "onset": 177,
    "date": 70.05
  },
  {
    "onset": 180,
    "date": 71.17
  },
  {
    "onset": 183,
    "date": 72.41
  },
  {
    "onset": 186,
    "date": 73.58
  },
  {
    "onset": 189,
    "date": 74.78
  },
  {
    "onset": 192,
    "date": 76.16
  },
  {
    "onset": 195,
    "date": 77.37
  },
  {
    "onset": 198,
    "date": 78.41
  },
  {
    "onset": 201,
    "date": 79.50
  },
  {
    "onset": 204,
    "date": 80.67
  },
  {
    "onset": 207,
    "date": 81.75
  },
  {
    "onset": 210,
    "date": 82.95
  },
  {
    "onset": 213,
    "date": 84.17
  },
  {
    "onset": 216,
    "date": 85.38
  },
  {
    "onset": 219,
    "date": 86.68
  },
  {
    "onset": 222,
    "date": 87.80
  },
  {
    "onset": 225,
    "date": 88.91
  },
  {
    "onset": 228,
    "date": 90.06
  },
  {
    "onset": 231,
    "date": 91.26
  },
  {
    "onset": 234,
    "date": 92.54
  },
  {
    "onset": 237,
    "date": 93.55
  },
  {
    "onset": 240,
    "date": 94.70
  },
  {
    "onset": 243,
    "date": 95.87
  },
  {
    "onset": 246,
    "date": 97.20
  },
  {
    "onset": 249,
    "date": 98.40
  },
  {
    "onset": 252,
    "date": 99.65
  },
  {
    "onset": 255,
    "date": 100.74
  },
  {
    "onset": 258,
    "date": 101.91
  },
  {
    "onset": 261,
    "date": 103.11
  },
  {
    "onset": 264,
    "date": 104.24
  },
  {
    "onset": 267,
    "date": 104.94
  },
  {
    "onset": 270,
    "date": 214.99
  },
  {
    "onset": 273,
    "date": 216.29
  },
  {
    "onset": 276,
    "date": 217.64
  },
  {
    "onset": 279,
    "date": 218.95
  },
  {
    "onset": 282,
    "date": 220.05
  },
  {
    "onset": 285,
    "date": 221.28
  },
  {
    "onset": 288,
    "date": 222.43
  },
  {
    "onset": 291,
    "date": 223.50
  },
  {
    "onset": 294,
    "date": 224.57
  },
  {
    "onset": 297,
    "date": 225.80
  },
  {
    "onset": 300,
    "date": 226.81
  },
  {
    "onset": 303,
    "date": 227.81
  },
  {
    "onset": 306,
    "date": 228.63
  },
  {
    "onset": 309,
    "date": 229.47
  },
  {
    "onset": 312,
    "date": 230.46
  },
  {
    "onset": 315,
    "date": 231.65
  },
  {
    "onset": 318,
    "date": 232.74
  },
  {
    "onset": 321,
    "date": 233.90
  },
  {
    "onset": 324,
    "date": 235.00
  },
  {
    "onset": 327,
    "date": 236.22
  },
  {
    "onset": 330,
    "date": 237.31
  },
  {
    "onset": 333,
    "date": 238.28
  },
  {
    "onset": 336,
    "date": 239.81
  },
  {
    "onset": 339,
    "date": 241.08
  },
  {
    "onset": 342,
    "date": 242.28
  },
  {
    "onset": 345,
    "date": 243.54
  },
  {
    "onset": 348,
    "date": 244.80
  },
  {
    "onset": 351,
    "date": 245.92
  },
  {
    "onset": 354,
    "date": 247.13
  },
  {
    "onset": 357,
    "date": 248.40
  },
  {
    "onset": 360,
    "date": 249.56
  },
  {
    "onset": 363,
    "date": 250.75
  },
  {
    "onset": 366,
    "date": 251.91
  },
  {
    "onset": 369,
    "date": 253.06
  },
  {
    "onset": 372,
    "date": 254.31
  },
  {
    "onset": 375,
    "date": 255.42
  },
  {
    "onset": 378,
    "date": 256.57
  },
  {
    "onset": 381,
    "date": 258.53
  },
  {
    "onset": 384,
    "date": 259.90
  },
  {
    "onset": 387,
    "date": 260.77
  },
  {
    "onset": 390,
    "date": 261.93
  },
  {
    "onset": 393,
    "date": 263.02
  },
  {
    "onset": 396,
    "date": 264.34
  },
  {
    "onset": 399,
    "date": 265.61
  },
  {
    "onset": 402,
    "date": 266.77
  },
  {
    "onset": 405,
    "date": 268.11
  },
  {
    "onset": 408,
    "date": 269.25
  },
  {
    "onset": 411,
    "date": 270.52
  },
  {
    "onset": 414,
    "date": 271.85
  },
  {
    "onset": 417,
    "date": 273.07
  },
  {
    "onset": 420,
    "date": 274.25
  },
  {
    "onset": 423,
    "date": 275.38
  },
  {
    "onset": 426,
    "date": 276.63
  },
  {
    "onset": 429,
    "date": 277.68
  },
  {
    "onset": 432,
    "date": 278.73
  },
  {
    "onset": 435,
    "date": 279.63
  },
  {
    "onset": 438,
    "date": 280.42
  },
  {
    "onset": 441,
    "date": 281.21
  },
  {
    "onset": 444,
    "date": 282.82
  },
  {
    "onset": 447,
    "date": 283.79
  },
  {
    "onset": 450,
    "date": 285.15
  },
  {
    "onset": 453,
    "date": 286.15
  },
  {
    "onset": 456,
    "date": 287.43
  },
  {
    "onset": 459,
    "date": 288.69
  },
  {
    "onset": 462,
    "date": 291.41
  },
  {
    "onset": 465,
    "date": 292.46
  },
  {
    "onset": 468,
    "date": 293.04
  },
  {
    "onset": 471,
    "date": 293.77
  },
  {
    "onset": 474,
    "date": 294.54
  },
  {
    "onset": 477,
    "date": 295.60
  },
  {
    "onset": 480,
    "date": 296.93
  },
  {
    "onset": 483,
    "date": 298.25
  },
  {
    "onset": 486,
    "date": 299.63
  },
  {
    "onset": 489,
    "date": 300.76
  },
  {
    "onset": 492,
    "date": 301.98
  },
  {
    "onset": 495,
    "date": 303.20
  },
  {
    "onset": 498,
    "date": 304.37
  },
  {
    "onset": 501,
    "date": 305.54
  },
  {
    "onset": 504,
    "date": 306.79
  },
  {
    "onset": 507,
    "date": 308.07
  },
  {
    "onset": 510,
    "date": 309.32
  },
  {
    "onset": 513,
    "date": 310.60
  },
  {
    "onset": 516,
    "date": 311.95
  },
  {
    "onset": 519,
    "date": 313.20
  },
  {
    "onset": 522,
    "date": 314.29
  },
  {
    "onset": 525,
    "date": 315.53
  },
  {
    "onset": 528,
    "date": 316.76
  },
  {
    "onset": 531,
    "date": 317.99
  },
  {
    "onset": 534,
    "date": 319.19
  },
  {
    "onset": 537,
    "date": 320.25
  },
  {
    "onset": 540,
    "date": 321.39
  },
  {
    "onset": 543,
    "date": 322.54
  },
  {
    "onset": 546,
    "date": 323.68
  },
  {
    "onset": 549,
    "date": 324.73
  },
  {
    "onset": 552,
    "date": 325.91
  },
  {
    "onset": 555,
    "date": 327.41
  },
  {
    "onset": 558,
    "date": 328.78
  },
  {
    "onset": 561,
    "date": 329.92
  },
  {
    "onset": 564,
    "date": 331.09
  },
  {
    "onset": 567,
    "date": 332.34
  },
  {
    "onset": 570,
    "date": 333.52
  },
  {
    "onset": 573,
    "date": 334.77
  },
  {
    "onset": 576,
    "date": 336.07
  },
  {
    "onset": 579,
    "date": 337.28
  },
  {
    "onset": 582,
    "date": 338.58
  },
  {
    "onset": 585,
    "date": 339.83
  },
  {
    "onset": 588,
    "date": 341.07
  },
  {
    "onset": 591,
    "date": 342.39
  },
  {
    "onset": 594,
    "date": 343.74
  },
  {
    "onset": 597,
    "date": 345.14
  },
  {
    "onset": 600,
    "date": 346.22
  },
  {
    "onset": 603,
    "date": 347.38
  },
  {
    "onset": 606,
    "date": 348.53
  },
  {
    "onset": 609,
    "date": 349.68
  },
  {
    "onset": 612,
    "date": 350.86
  },
  {
    "onset": 615,
    "date": 352.03
  },
  {
    "onset": 618,
    "date": 353.18
  },
  {
    "onset": 621,
    "date": 354.39
  },
  {
    "onset": 624,
    "date": 355.66
  },
  {
    "onset": 627,
    "date": 356.87
  },
  {
    "onset": 630,
    "date": 358.07
  },
  {
    "onset": 633,
    "date": 359.24
  },
  {
    "onset": 636,
    "date": 360.35
  },
  {
    "onset": 639,
    "date": 361.51
  },
  {
    "onset": 642,
    "date": 362.68
  },
  {
    "onset": 645,
    "date": 363.82
  },
  {
    "onset": 648,
    "date": 365.01
  },
  {
    "onset": 651,
    "date": 366.25
  },
  {
    "onset": 654,
    "date": 367.49
  },
  {
    "onset": 657,
    "date": 368.94
  },
  {
    "onset": 660,
    "date": 370.14
  },
  {
    "onset": 663,
    "date": 371.44
  },
  {
    "onset": 666,
    "date": 372.57
  },
  {
    "onset": 669,
    "date": 373.75
  },
  {
    "onset": 672,
    "date": 374.91
  },
  {
    "onset": 675,
    "date": 375.71
  },
  {
    "onset": 678,
    "date": 377.25
  },
  {
    "onset": 681,
    "date": 378.44
  },
  {
    "onset": 684,
    "date": 379.51
  },
  {
    "onset": 687,
    "date": 380.84
  },
  {
    "onset": 690,
    "date": 383.02
  },
  {
    "onset": 693,
    "date": 384.04
  },
  {
    "onset": 696,
    "date": 385.18
  },
  {
    "onset": 699,
    "date": 386.07
  },
  {
    "onset": 702,
    "date": 387.57
  },
  {
    "onset": 705,
    "date": 388.71
  },
  {
    "onset": 708,
    "date": 390.16
  },
  {
    "onset": 711,
    "date": 391.33
  },
  {
    "onset": 714,
    "date": 392.31
  },
  {
    "onset": 717,
    "date": 393.54
  },
  {
    "onset": 720,
    "date": 394.69
  },
  {
    "onset": 723,
    "date": 396.64
  },
  {
    "onset": 726,
    "date": 398.12
  },
  {
    "onset": 729,
    "date": 399.38
  },
  {
    "onset": 732,
    "date": 400.67
  },
  {
    "onset": 734.5,
    "date": 410.54
  }
]