[
  {
    "onset": 0,
    "date": 0.63
  },
  {
    "onset": 3,
    "date": 3.04
  },
  {
    "onset": 6,
    "date": 5.72
  },
  {
    "onset": 9,
    "date": 8.19
  },
  {
    "onset": 12,
    "date": 10.86
  },
  {
    "onset": 15,
    "date": 13.53
  },
  {
    "onset": 18,
    "date": 16.11
  },
  {
    "onset": 21,
    "date": 18.69
  },
  {
    "onset": 24,
    "date": 21.53
  },
  {
    "onset": 27,
    "date": 23.95
  },
  {
    "onset": 30,
    "date": 26.63
  },
  {
    "onset": 33,
    "date": 28.97
  },
  {
    "onset": 36,
    "date": 31.58
  },
  {
    "onset": 39,
    "date": 34.08
  },
  {
    "onset": 42,
    "date": 36.55
  },
  {
    "onset": 45,
    "date": 38.98
  },
  {
    "onset": 48,
    "date": 42.03
  },
  {
    "onset": 51,
    "date": 44.68
  },
  {
    "onset": 54,
    "date": 47.48
  },
  {
    "onset": 57,
    "date": 50.16
  },
  {
    "onset": 60,
    "date": 52.77
  },
  {
    "onset": 63,
    "date": 55.51
  },
  {
    "onset": 66,
    "date": 58.35
  },
  {
    "onset": 69,
    "date": 60.96
  },
  {
    "onset": 72,
    "date": 63.88
  },
  {
    "onset": 75,
    "date": 66.30
  },
  {
    "onset": 78,
    "date": 68.95
  },
  {
    "onset": 81,
    "date": 71.31
  },
  {
    "onset": 84,
    "date": 73.73
  },
  {
    "onset": 87,
    "date": 76.25
  },
  {
    "onset": 89,
    "date": 78.27
  },
  {
    "onset": 90,
    "date": 79.64
  },
  {
    "onset": 93,
    "date": 82.14
  },
  {
    "onset": 95.5,
    "date": 84.31
  },
  {
    "onset": 96,
    "date": 84.94
  },
  {
    "onset": 99,
    "date": 87.46
  },
  {
    "onset": 101.5,
    "date": 89.60
  },
  {
    "onset": 102,
    "date": 90.10
  },
  {
    "onset": 103,
    "date": 90.90
  },
  {
    "onset": 106,
    "date": 93.58
  },
  {
    "onset": 108,
    "date": 95.47
  },
  {
    "onset": 111,
    "date": 97.92
  },
  {
    "onset": 114,
    "date": 100.80
  },
  {
    "onset": 117,
    "date": 103.41
  },
  {
    "onset": 120,
    "date": 106.19
  },
  {
    "onset": 123,
    "date": 108.73
  },
  {
    "onset": 126,
    "date": 111.41
  },
  {
    "onset": 129,
    "date": 114.10
  },
  {
    "onset": 132,
    "date": 116.78
  },
  {
    "onset": 135,
    "date": 119.23
  },
  {
    "onset": 137,
    "date": 121.37
  },
  {
    "onset": 138,
    "date": 122.83
  },
  {
    "onset": 141,
    "date": 125.48
  },
  {
    "onset": 144,
    "date": 128.04
  },
  {
    "onset": 147,
    "date": 130.46
  },
  {
    "onset": 150,
    "date": 133.07
  },
  {
    "onset": 152.5,
    "date": 135.44
  },
  {
    "onset": 153,
    "date": 136.08
  },
  {
    "onset": 156,
    "date": 139.13
  },
  {
    "onset": 159,
    "date": 141.80
  },
  {
    "onset": 162,
    "date": 144.59
  },
  {
    "onset": 165,
    "date": 147.35
  },
  {
    "onset": 168,
    "date": 150.04
  },
  {
    "onset": 171,
    "date": 152.89
  },
  {
    "onset": 174,
    "date": 155.85
  },
  {
    "onset": 177,
    "date": 158.50
  },
  {
    "onset": 180,
    "date": 161.53
  },
  {
    "onset": 183,
    "date": 164.02
  },
  {
    "onset": 186,
    "date": 166.57
  },
  {
    "onset": 189,
    "date": 168.99
  },
  {
    "onset": 192,
    "date": 171.41
  },
  {
    "onset": 195,
    "date": 174.05
  },
  {
    "onset": 196.75,
    "date": 175.64
  },
  {
    "onset": 198,
    "date": 176.91
  },
  {
    "onset": 201,
    "date": 179.91
  },
  {
    "onset": 204,
    "date": 183.21
  },
  {
    "onset": 205,
    "date": 184.37
  },
  {
    "onset": 207,
    "date": 186.59
  },
  {
    "onset": 210,
    "date": 189.40
  },
  {
    "onset": 213,
    "date": 192.37
  },
  {
    "onset": 216,
    "date": 195.30
  },
  {
    "onset": 219,
    "date": 198.42
  },
  {
    "onset": 222,
    "date": 201.50
  },
  {
    "onset": 225,
    "date": 204.68
  },
  {
    "onset": 228,
    "date": 207.59
  },
  {
    "onset": 231,
    "date": 211.14
  },
  {
    "onset": 234,
    "date": 214.18
  },
  {
    "onset": 237,
    "date": 217.27
  },
  {
    "onset": 240,
    "date": 220.19
  },
  {
    "onset": 243,
    "date": 223.26
  },
  {
    "onset": 246,
    "date": 226.16
  },
  {
    "onset": 249,
    "date": 229.10
  },
  {
    "onset": 252,
    "date": 232.33
  },
  {
    "onset": 255,
    "date": 235.71
  },
  {
    "onset": 258,
    "date": 238.87
  },
  {
    "onset": 261,
    "date": 242.35
  },
  {
    "onset": 264,
    "date": 245.47
  },
  {
    "onset": 264.75,
    "date": 246.61
  },
  {
    "onset": 267,
    "date": 249.16
  },
  {
    "onset": 270,
    "date": 251.98
  },
  {
    "onset": 273,
    "date": 255.52
  },
  {
    "onset": 274,
    "date": 256.82
  },
  {
    "onset": 275,
    "date": 258.30
  },
  {
    "onset": 275.5,
    "date": 259.85
  }
]