[
  {
    "onset": 0,
    "date": 0
  },
  {
    "onset": 8,
    "date": 13.23
  },
  {
    "onset": 12,
    "date": 20.60
  },
  {
    "onset": 16,
    "date": 27.41
  },
  {
    "onset": 24,
    "date": 41.59
  },
  {
    "onset": 32,
    "date": 55.07
  },
  {
    "onset": 44,
    "date": 75.04
  },
  {
    "onset": 48,
    "date": 81.15
  },
  {
    "onset": 72,
    "date": 119.46
  },
  {
    "onset": 84,
    "date": 137.71
  },
  {
    "onset": 92,
    "date": 149.85
  },
  {
    "onset": 112,
    "date": 180.40
  },
  {
    "onset": 126,
    "date": 201.40
  },
  {
    "onset": 136,
    "date": 215.97
  },
  {
    "onset": 148,
    "date": 233.91
  },
  {
    "onset": 160,
    "date": 252.24
  },
  {
    "onset": 168,
    "date": 264.15
  },
  {
    "onset": 172,
    "date": 270.18
  },
  {
    "onset": 180,
    "date": 282.01
  },
  {
    "onset": 188,
    "date": 293.92
  },
  {
    "onset": 192,
    "date": 299.95
  },
  {
    "onset": 196,
    "date": 305.98
  },
  {
    "onset": 200,
    "date": 311.54
  },
  {
    "onset": 213,
    "date": 331.67
  },
  {
    "onset": 222,
    "date": 345.23
  },
  {
    "onset": 238,
    "date": 369.12
  },
  {
    "onset": 248,
    "date": 384.86
  },
  {
    "onset": 276,
    "date": 426.85
  },
  {
    "onset": 280,
    "date": 432.57
  },
  {
    "onset": 286,
    "date": 442.05
  },
  {
    "onset": 288,
    "date": 444.71
  },
  {
    "onset": 292,
    "date": 451.14
  },
  {
    "onset": 296,
    "date": 457.80
  },
  {
    "onset": 298.02150537634407,
    "date": 461.40
  },
  {
    "onset": 300,
    "date": 465.08
  }
]