[
  {
    "onset": 0,
    "date": 0.43
  },
  {
    "onset": 0.5,
    "date": 0.68
  },
  {
    "onset": 3.5,
    "date": 2.11
  },
  {
    "onset": 6.5,
    "date": 3.70
  },
  {
    "onset": 9.5,
    "date": 5.23
  },
  {
    "onset": 12.5,
    "date": 6.61
  },
  {
    "onset": 15.5,
    "date": 7.88
  },
  {
    "onset": 18.5,
    "date": 9.41
  },
  {
    "onset": 21.5,
    "date": 10.86
  },
  {
    "onset": 24.5,
    "date": 12.50
  },
  {
    "onset": 27.5,
    "date": 13.76
  },
  {
    "onset": 30.5,
    "date": 15.08
  },
  {
    "onset": 33.5,
    "date": 16.43
  },
  {
    "onset": 36.5,
    "date": 17.87
  },
  {
    "onset": 39.5,
    "date": 19.17
  },
  {
    "onset": 42.5,
    "date": 20.52
  },
  {
    "onset": 45.5,
    "date": 21.98
  },
  {
    "onset": 48.5,
    "date": 23.30
  },
  {
    "onset": 51.5,
    "date": 24.65
  },
  {
    "onset": 54.5,
    "date": 26.00
  },
  {
    "onset": 57.5,
    "date": 27.43
  },
  {
    "onset": 60.5,
    "date": 28.91
  },
  {
    "onset": 63.5,
    "date": 30.18
  },
  {
    "onset": 66.5,
    "date": 31.58
  },
  {
    "onset": 69.5,
    "date": 32.93
  },
  {
    "onset": 72.5,
    "date": 34.27
  },
  {
    "onset": 75.5,
    "date": 35.67
  },
  {
    "onset": 78.5,
    "date": 37.05
  },
  {
    "onset": 81.5,
    "date": 38.43
  },
  {
    "onset": 84.5,
    "date": 39.82
  },
  {
    "onset": 87.5,
    "date": 41.08
  },
  {
    "onset": 90.5,
    "date": 42.35
  },
  {
    "onset": 93.5,
    "date": 43.70
  },
  {
    "onset": 96.5,
    "date": 45.13
  },
  {
    "onset": 99.5,
    "date": 46.38
  },
  {
    "onset": 102.5,
    "date": 47.92
  },
  {
    "onset": 105.5,
    "date": 49.27
  },
  {
    "onset": 108.5,
    "date": 50.65
  },
  {
    "onset": 111.5,
    "date": 52.10
  },
  {
    "onset": 114.5,
    "date": 53.48
  },
  {
    "onset": 117.5,
    "date": 54.80
  },
  {
    "onset": 120.5,
    "date": 56.27
  },
  {
    "onset": 123.5,
    "date": 57.73
  },
  {
    "onset": 126.5,
    "date": 59.23
  },
  {
    "onset": 129.5,
    "date": 60.88
  },
  {
    "onset": 132.5,
    "date": 62.22
  },
  {
    "onset": 135.5,
    "date": 63.90
  },
  {
    "onset": 138.5,
    "date": 65.13
  },
  {
    "onset": 141.5,
    "date": 66.48
  },
  {
    "onset": 144.5,
    "date": 67.75
  },
  {
    "onset": 147.5,
    "date": 69.47
  },
  {
    "onset": 150.5,
    "date": 71.03
  },
  {
    "onset": 153.5,
    "date": 72.68
  },
  {
    "onset": 156.5,
    "date": 74.18
  },
  {
    "onset": 159.5,
    "date": 75.62
  },
  {
    "onset": 162.5,
    "date": 76.92
  },
  {
    "onset": 165.5,
    "date": 78.35
  },
  {
    "onset": 168.5,
    "date": 79.57
  },
  {
    "onset": 171.5,
    "date": 81.14
  },
  {
    "onset": 174.5,
    "date": 164.76
  },
  {
    "onset": 177.5,
    "date": 166.29
  },
  {
    "onset": 180.5,
    "date": 167.69
  },
  {
    "onset": 183.5,
    "date": 168.89
  },
  {
    "onset": 186.5,
    "date": 170.27
  },
  {
    "onset": 189.5,
    "date": 171.74
  },
  {
    "onset": 192.5,
    "date": 173.16
  },
  {
    "onset": 195.5,
    "date": 174.39
  },
  {
    "onset": 198.5,
    "date": 175.62
  },
  {
    "onset": 201.5,
    "date": 176.92
  },
  {
    "onset": 204.5,
    "date": 178.26
  },
  {
    "onset": 207.5,
    "date": 179.44
  },
  {
    "onset": 210.5,
    "date": 180.76
  },
  {
    "onset": 213.5,
    "date": 182.16
  },
  {
    "onset": 216.5,
    "date": 183.37
  },
  {
    "onset": 219.5,
    "date": 184.76
  },
  {
    "onset": 222.5,
    "date": 186.09
  },
  {
    "onset": 225.5,
    "date": 187.34
  },
  {
    "onset": 228.5,
    "date": 188.66
  },
  {
    "onset": 231.5,
    "date": 189.94
  },
  {
    "onset": 234.5,
    "date": 191.31
  },
  {
    "onset": 237.5,
    "date": 192.68
  },
  {
    "onset": 240.5,
    "date": 194.03
  },
  {
    "onset": 243.5,
    "date": 195.37
  },
  {
    "onset": 246.5,
    "date": 196.81
  },
  {
    "onset": 249.5,
    "date": 198.24
  },
  {
    "onset": 252.5,
    "date": 199.66
  },
  {
    "onset": 255.5,
    "date": 201.07
  },
  {
    "onset": 258.5,
    "date": 202.34
  },
  {
    "onset": 261.5,
    "date": 203.88
  },
  {
    "onset": 264.5,
    "date": 205.36
  },
  {
    "onset": 267.5,
    "date": 206.66
  },
  {
    "onset": 270.5,
    "date": 208.11
  },
  {
    "onset": 273.5,
    "date": 209.56
  },
  {
    "onset": 276.5,
    "date": 210.94
  },
  {
    "onset": 279.5,
    "date": 212.26
  },
  {
    "onset": 282.5,
    "date": 213.76
  },
  {
    "onset": 285.5,
    "date": 215.23
  },
  {
    "onset": 288.5,
    "date": 216.58
  },
  {
    "onset": 291.5,
    "date": 217.99
  },
  {
    "onset": 294.5,
    "date": 219.18
  },
  {
    "onset": 297.5,
    "date": 220.39
  },
  {
    "onset": 300.5,
    "date": 221.81
  },
  {
    "onset": 303.5,
    "date": 223.34
  },
  {
    "onset": 306.5,
    "date": 224.88
  },
  {
    "onset": 309.5,
    "date": 226.13
  },
  {
    "onset": 312.5,
    "date": 227.66
  },
  {
    "onset": 315.5,
    "date": 228.99
  },
  {
    "onset": 318.5,
    "date": 230.53
  },
  {
    "onset": 321.5,
    "date": 231.74
  },
  {
    "onset": 324.5,
    "date": 233.09
  },
  {
    "onset": 327.5,
    "date": 234.38
  },
  {
    "onset": 330.5,
    "date": 235.75
  },
  {
    "onset": 333.5,
    "date": 237.14
  },
  {
    "onset": 336.5,
    "date": 238.42
  },
  {
    "onset": 339.5,
    "date": 239.82
  },
  {
    "onset": 342.5,
    "date": 241.10
  },
  {
    "onset": 345.5,
    "date": 242.38
  },
  {
    "onset": 348.5,
    "date": 243.65
  },
  {
    "onset": 351.5,
    "date": 244.97
  },
  {
    "onset": 354.5,
    "date": 246.25
  },
  {
    "onset": 357.5,
    "date": 247.63
  },
  {
    "onset": 360.5,
    "date": 248.93
  },
  {
    "onset": 363.5,
    "date": 250.49
  },
  {
    "onset": 366.5,
    "date": 252.12
  },
  {
    "onset": 369.5,
    "date": 253.77
  },
  {
    "onset": 372.5,
    "date": 255.08
  },
  {
    "onset": 375.5,
    "date": 256.73
  },
  {
    "onset": 378.5,
    "date": 258.19
  },
  {
    "onset": 381.5,
    "date": 259.75
  },
  {
    "onset": 384.5,
    "date": 261.27
  },
  {
    "onset": 387.5,
    "date": 262.85
  },
  {
    "onset": 390.5,
    "date": 264.30
  },
  {
    "onset": 393.5,
    "date": 266.02
  },
  {
    "onset": 396.5,
    "date": 267.38
  },
  {
    "onset": 399.5,
    "date": 269.12
  },
  {
    "onset": 402.5,
    "date": 270.45
  },
  {
    "onset": 405.5,
    "date": 271.79
  },
  {
    "onset": 408.5,
    "date": 273.30
  },
  {
    "onset": 411.5,
    "date": 274.99
  },
  {
    "onset": 414.5,
    "date": 276.27
  },
  {
    "onset": 417.5,
    "date": 277.55
  },
  {
    "onset": 420.5,
    "date": 278.94
  },
  {
    "onset": 423.5,
    "date": 280.27
  },
  {
    "onset": 426.5,
    "date": 281.65
  },
  {
    "onset": 429.5,
    "date": 282.95
  },
  {
    "onset": 432.5,
    "date": 284.50
  },
  {
    "onset": 435.5,
    "date": 285.79
  },
  {
    "onset": 438.5,
    "date": 287.17
  },
  {
    "onset": 441.5,
    "date": 288.54
  },
  {
    "onset": 444.5,
    "date": 289.85
  },
  {
    "onset": 447.5,
    "date": 291.27
  },
  {
    "onset": 450.5,
    "date": 292.74
  },
  {
    "onset": 453.5,
    "date": 294.05
  },
  {
    "onset": 456.5,
    "date": 295.47
  },
  {
    "onset": 459.5,
    "date": 297.12
  },
  {
    "onset": 462.5,
    "date": 298.67
  },
  {
    "onset": 465.5,
    "date": 300.05
  },
  {
    "onset": 468.5,
    "date": 301.42
  },
  {
    "onset": 471.5,
    "date": 302.80
  },
  {
    "onset": 474.5,
    "date": 304.17
  },
  {
    "onset": 477.5,
    "date": 305.80
  },
  {
    "onset": 480,
    "date": 307.49
  }
]