[
  {
    "onset": 0,
    "date": 97.99
  },
  {
    "onset": 1.5,
    "date": 98.48
  },
  {
    "onset": 2,
    "date": 99.04
  },
  {
    "onset": 6,
    "date": 102.55
  },
  {
    "onset": 8,
    "date": 104.20
  },
  {
    "onset": 18.5,
    "date": 112.96
  },
  {
    "onset": 20,
    "date": 114.24
  },
  {
    "onset": 22,
    "date": 115.89
  },
  {
    "onset": 25.25,
    "date": 118.94
  },
  {
    "onset": 28,
    "date": 121.14
  },
  {
    "onset": 30,
    "date": 122.81
  },
  {
    "onset": 32,
    "date": 124.53
  },
  {
    "onset": 34,
    "date": 126.22
  },
  {
    "onset": 36,
    "date": 127.96
  },
  {
    "onset": 38,
    "date": 129.86
  },
  {
    "onset": 40,
    "date": 131.41
  },
  {
    "onset": 42,
    "date": 133.22
  },
  {
    "onset": 44,
    "date": 134.87
  },
  {
    "onset": 46,
    "date": 136.58
  },
  {
    "onset": 48,
    "date": 138.51
  },
  {
    "onset": 52,
    "date": 142.01
  },
  {
    "onset": 56,
    "date": 145.28
  },
  {
    "onset": 60,
    "date": 148.70
  },
  {
    "onset": 64,
    "date": 152.17
  },
  {
    "onset": 68,
    "date": 155.52
  },
  {
    "onset": 72,
    "date": 158.67
  },
  {
    "onset": 76,
    "date": 162.18
  },
  {
    "onset": 80,
    "date": 165.35
  },
  {
    "onset": 84,
    "date": 169.06
  },
  {
    "onset": 88,
    "date": 172.84
  },
  {
    "onset": 92,
    "date": 176.14
  },
  {
    "onset": 96,
    "date": 179.52
  },
  {
    "onset": 100,
    "date": 183.00
  },
  {
    "onset": 104,
    "date": 186.49
  },
  {
    "onset": 108,
    "date": 189.86
  },
  {
    "onset": 111,
    "date": 192.68
  },
  {
    "onset": 112,
    "date": 194.06
  }
]