[
  {
    "onset": 0,
    "date": 163.07
  },
  {
    "onset": 5,
    "date": 165.13
  },
  {
    "onset": 8,
    "date": 166.70
  },
  {
    "onset": 18,
    "date": 171.25
  },
  {
    "onset": 21,
    "date": 172.65
  },
  {
    "onset": 24,
    "date": 173.95
  },
  {
    "onset": 30,
    "date": 176.63
  },
  {
    "onset": 39,
    "date": 180.90
  },
  {
    "onset": 42,
    "date": 182.33
  },
  {
    "onset": 48,
    "date": 184.91
  },
  {
    "onset": 56,
    "date": 188.39
  },
  {
    "onset": 62,
    "date": 191.14
  },
  {
    "onset": 64,
    "date": 192.01
  },
  {
    "onset": 76,
    "date": 197.27
  },
  {
    "onset": 82,
    "date": 199.92
  },
  {
    "onset": 86,
    "date": 201.57
  },
  {
    "onset": 88,
    "date": 202.44
  },
  {
    "onset": 90,
    "date": 203.37
  },
  {
    "onset": 92,
    "date": 204.15
  },
  {
    "onset": 94,
    "date": 205.12
  },
  {
    "onset": 96,
    "date": 205.99
  },
  {
    "onset": 98,
    "date": 207.20
  },
  {
    "onset": 101,
    "date": 208.85
  },
  {
    "onset": 110,
    "date": 212.76
  },
  {
    "onset": 116,
    "date": 215.61
  },
  {
    "onset": 124,
    "date": 219.30
  },
  {
    "onset": 144,
    "date": 228.24
  },
  {
    "onset": 149,
    "date": 230.74
  },
  {
    "onset": 153,
    "date": 232.60
  },
  {
    "onset": 156,
    "date": 233.95
  },
  {
    "onset": 157,
    "date": 234.52
  },
  {
    "onset": 160,
    "date": 235.56
  },
  {
    "onset": 164,
    "date": 237.71
  },
  {
    "onset": 184,
    "date": 246.44
  },
  {
    "onset": 194,
    "date": 250.85
  },
  {
    "onset": 201,
    "date": 254.15
  },
  {
    "onset": 204,
    "date": 255.36
  },
  {
    "onset": 216,
    "date": 261.02
  },
  {
    "onset": 221,
    "date": 263.08
  },
  {
    "onset": 228,
    "date": 266.13
  },
  {
    "onset": 236,
    "date": 269.84
  },
  {
    "onset": 241,
    "date": 272.30
  },
  {
    "onset": 248,
    "date": 275.66
  },
  {
    "onset": 252,
    "date": 277.79
  },
  {
    "onset": 260,
    "date": 281.33
  },
  {
    "onset": 271,
    "date": 286.40
  },
  {
    "onset": 278,
    "date": 289.59
  },
  {
    "onset": 284,
    "date": 292.09
  },
  {
    "onset": 292,
    "date": 296.15
  },
  {
    "onset": 294,
    "date": 297.27
  },
  {
    "onset": 295,
    "date": 297.79
  },
  {
    "onset": 296,
    "date": 298.78
  }
]