[
  {
    "onset": 0,
    "date": 157.00
  },
  {
    "onset": 4,
    "date": 160.89
  },
  {
    "onset": 8,
    "date": 164.78
  },
  {
    "onset": 12,
    "date": 168.77
  },
  {
    "onset": 16,
    "date": 172.49
  },
  {
    "onset": 20,
    "date": 176.06
  },
  {
    "onset": 24,
    "date": 179.78
  },
  {
    "onset": 28,
    "date": 183.41
  },
  {
    "onset": 32,
    "date": 187.26
  },
  {
    "onset": 36,
    "date": 190.98
  },
  {
    "onset": 40,
    "date": 194.99
  },
  {
    "onset": 44,
    "date": 198.58
  },
  {
    "onset": 48,
    "date": 201.71
  },
  {
    "onset": 52,
    "date": 206.07
  },
  {
    "onset": 56,
    "date": 210.39
  },
  {
    "onset": 60,
    "date": 214.02
  },
  {
    "onset": 64,
    "date": 217.74
  },
  {
    "onset": 68,
    "date": 221.53
  },
  {
    "onset": 72,
    "date": 225.29
  },
  {
    "onset": 76,
    "date": 229.21
  },
  {
    "onset": 80,
    "date": 232.83
  },
  {
    "onset": 84,
    "date": 236.55
  },
  {
    "onset": 88,
    "date": 240.27
  },
  {
    "onset": 92,
    "date": 244.14
  },
  {
    "onset": 96,
    "date": 248.18
  },
  {
    "onset": 100,
    "date": 251.66
  },
  {
    "onset": 104,
    "date": 255.14
  },
  {
    "onset": 108,
    "date": 258.58
  },
  {
    "onset": 112,
    "date": 262.15
  },
  {
    "onset": 116,
    "date": 265.75
  },
  {
    "onset": 120,
    "date": 269.54
  },
  {
    "onset": 124,
    "date": 273.37
  },
  {
    "onset": 128,
    "date": 277.06
  },
  {
    "onset": 132,
    "date": 280.68
  },
  {
    "onset": 136,
    "date": 284.45
  },
  {
    "onset": 140,
    "date": 288.22
  },
  {
    "onset": 144,
    "date": 291.85
  },
  {
    "onset": 148,
    "date": 295.74
  },
  {
    "onset": 152,
    "date": 299.37
  },
  {
    "onset": 156,
    "date": 303.12
  },
  {
    "onset": 160,
    "date": 306.79
  },
  {
    "onset": 164,
    "date": 310.55
  },
  {
    "onset": 168,
    "date": 314.43
  },
  {
    "onset": 172,
    "date": 318.20
  },
  {
    "onset": 176,
    "date": 322.12
  },
  {
    "onset": 180,
    "date": 325.81
  },
  {
    "onset": 184,
    "date": 329.53
  },
  {
    "onset": 188,
    "date": 333.38
  },
  {
    "onset": 192,
    "date": 336.76
  },
  {
    "onset": 196,
    "date": 340.65
  },
  {
    "onset": 200,
    "date": 344.41
  },
  {
    "onset": 204,
    "date": 348.39
  },
  {
    "onset": 208,
    "date": 352.56
  },
  {
    "onset": 212,
    "date": 356.19
  },
  {
    "onset": 216,
    "date": 359.93
  },
  {
    "onset": 220,
    "date": 363.61
  },
  {
    "onset": 224,
    "date": 367.28
  },
  {
    "onset": 228,
    "date": 371.25
  },
  {
    "onset": 232,
    "date": 374.92
  },
  {
    "onset": 236,
    "date": 378.65
  },
  {
    "onset": 240,
    "date": 382.35
  },
  {
    "onset": 244,
    "date": 386.77
  },
  {
    "onset": 248,
    "date": 390.69
  },
  {
    "onset": 252,
    "date": 394.22
  },
  {
    "onset": 256,
    "date": 398.03
  },
  {
    "onset": 260,
    "date": 401.55
  },
  {
    "onset": 264,
    "date": 405.34
  },
  {
    "onset": 268,
    "date": 408.89
  },
  {
    "onset": 272,
    "date": 412.53
  },
  {
    "onset": 276,
    "date": 416.31
  },
  {
    "onset": 280,
    "date": 419.89
  },
  {
    "onset": 284,
    "date": 423.36
  },
  {
    "onset": 288,
    "date": 427.13
  },
  {
    "onset": 292,
    "date": 430.78
  },
  {
    "onset": 296,
    "date": 434.68
  },
  {
    "onset": 300,
    "date": 438.33
  },
  {
    "onset": 304,
    "date": 442.19
  },
  {
    "onset": 308,
    "date": 446.34
  },
  {
    "onset": 312,
    "date": 449.99
  },
  {
    "onset": 316,
    "date": 453.66
  },
  {
    "onset": 320,
    "date": 457.55
  },
  {
    "onset": 324,
    "date": 461.28
  },
  {
    "onset": 328,
    "date": 465.24
  },
  {
    "onset": 332,
    "date": 468.97
  },
  {
    "onset": 336,
    "date": 472.64
  },
  {
    "onset": 340,
    "date": 476.88
  },
  {
    "onset": 344,
    "date": 481.26
  },
  {
    "onset": 346,
    "date": 484.70
  }
]