[
  {
    "onset": 0,
    "date": 0
  },
  {
    "onset": 3,
    "date": 3.22
  },
  {
    "onset": 6,
    "date": 5.52
  },
  {
    "onset": 9,
    "date": 8.20
  },
  {
    "onset": 12,
    "date": 10.06
  },
  {
    "onset": 15,
    "date": 12.38
  },
  {
    "onset": 18,
    "date": 14.66
  },
  {
    "onset": 21,
    "date": 17.01
  },
  {
    "onset": 24,
    "date": 19.38
  },
  {
    "onset": 27,
    "date": 21.58
  },
  {
    "onset": 30,
    "date": 24.10
  },
  {
    "onset": 33,
    "date": 26.54
  },
  {
    "onset": 36,
    "date": 28.85
  },
  {
    "onset": 39,
    "date": 30.97
  },
  {
    "onset": 42,
    "date": 33.18
  },
  {
    "onset": 45,
    "date": 36.16
  },
  {
    "onset": 48,
    "date": 38.40
  },
  {
    "onset": 51,
    "date": 40.58
  },
  {
    "onset": 54,
    "date": 43.29
  },
  {
    "onset": 57,
    "date": 46.40
  },
  {
    "onset": 60,
    "date": 49.21
  },
  {
    "onset": 63,
    "date": 50.99
  },
  {
    "onset": 66,
    "date": 53.24
  },
  {
    "onset": 69,
    "date": 55.41
  },
  {
    "onset": 72,
    "date": 57.71
  },
  {
    "onset": 75,
    "date": 59.92
  },
  {
    "onset": 78,
    "date": 62.22
  },
  {
    "onset": 81,
    "date": 64.37
  },
  {
    "onset": 84,
    "date": 66.72
  },
  {
    "onset": 87,
    "date": 68.82
  },
  {
    "onset": 90,
    "date": 71.19
  },
  {
    "onset": 93,
    "date": 73.83
  },
  {
    "onset": 96,
    "date": 76.13
  },
  {
    "onset": 99,
    "date": 78.67
  },
  {
    "onset": 102,
    "date": 81.03
  },
  {
    "onset": 105,
    "date": 83.73
  },
  {
    "onset": 108,
    "date": 86.22
  },
  {
    "onset": 111,
    "date": 88.76
  },
  {
    "onset": 114,
    "date": 91.24
  },
  {
    "onset": 117,
    "date": 93.79
  },
  {
    "onset": 120,
    "date": 95.93
  },
  {
    "onset": 123,
    "date": 200.25
  }
]