[
  {
    "onset": 0,
    "date": 0
  },
  {
    "onset": 3,
    "date": 1.28
  },
  {
    "onset": 6,
    "date": 2.45
  },
  {
    "onset": 9,
    "date": 3.61
  },
  {
    "onset": 12,
    "date": 4.75
  },
  {
    "onset": 15,
    "date": 5.91
  },
  {
    "onset": 18,
    "date": 7.15
  },
  {
    "onset": 21,
    "date": 8.25
  },
  {
    "onset": 24,
    "date": 9.39
  },
  {
    "onset": 27,
    "date": 10.52
  },
  {
    "onset": 30,
    "date": 11.65
  },
  {
    "onset": 33,
    "date": 12.79
  },
  {
    "onset": 36,
    "date": 13.98
  },
  {
    "onset": 39,
    "date": 15.15
  },
  {
    "onset": 42,
    "date": 16.35
  },
  {
    "onset": 45,
    "date": 17.52
  },
  {
    "onset": 48,
    "date": 18.72
  },
  {
    "onset": 51,
    "date": 19.89
  },
  {
    "onset": 54,
    "date": 21.02
  },
  {
    "onset": 57,
    "date": 22.26
  },
  {
    "onset": 60,
    "date": 23.46
  },
  {
    "onset": 63,
    "date": 24.66
  },
  {
    "onset": 66,
    "date": 25.86
  },
  {
    "onset": 69,
    "date": 27.09
  },
  {
    "onset": 72,
    "date": 28.26
  },
  {
    "onset": 75,
    "date": 29.43
  },
  {
    "onset": 78,
    "date": 30.59
  },
  {
    "onset": 81,
    "date": 31.73
  },
  {
    "onset": 84,
    "date": 32.86
  },
  {
    "onset": 87,
    "date": 34.03
  },
  {
    "onset": 90,
    "date": 35.23
  },
  {
    "onset": 93,
    "date": 36.40
  },
  {
    "onset": 96,
    "date": 37.60
  },
  {
    "onset": 99,
    "date": 38.76
  },
  {
    "onset": 102,
    "date": 40.00
  },
  {
    "onset": 105,
    "date": 41.13
  },
  {
    "onset": 108,
    "date": 42.37
  },
  {
    "onset": 111,
    "date": 43.73
  },
  {
    "onset": 114,
    "date": 44.97
  },
  {
    "onset": 117,
    "date": 46.27
  },
  {
    "onset": 120,
    "date": 47.57
  },
  {
    "onset": 123,
    "date": 49.20
  },
  {
    "onset": 126,
    "date": 50.40
  },
  {
    "onset": 129,
    "date": 51.57
  },
  {
    "onset": 132,
    "date": 52.74
  },
  {
    "onset": 135,
    "date": 53.94
  },
  {
    "onset": 138,
    "date": 55.07
  },
  {
    "onset": 141,
    "date": 56.24
  },
  {
    "onset": 144,
    "date": 57.47
  },
  {
    "onset": 147,
    "date": 58.64
  },
  {
    "onset": 150,
    "date": 59.81
  },
  {
    "onset": 153,
    "date": 60.98
  },
  {
    "onset": 156,
    "date": 62.27
  },
  {
    "onset": 159,
    "date": 63.58
  },
  {
    "onset": 162,
    "date": 64.68
  },
  {
    "onset": 165,
    "date": 65.88
  },
  {
    "onset": 168,
    "date": 67.11
  },
  {
    "onset": 171,
    "date": 68.28
  },
  {
    "onset": 174,
    "date": 69.29
  },
  {
    "onset": 177,
    "date": 70.41
  },
  {
    "onset": 180,
    "date": 71.58
  },
  {
    "onset": 183,
    "date": 72.75
  },
  {
    "onset": 186,
    "date": 73.91
  },
  {
    "onset": 189,
    "date": 75.08
  },
  {
    "onset": 192,
    "date": 76.15
  },
  {
    "onset": 195,
    "date": 77.31
  },
  {
    "onset": 198,
    "date": 78.45
  },
  {
    "onset": 201,
    "date": 79.58
  },
  {
    "onset": 204,
    "date": 80.75
  },
  {
    "onset": 207,
    "date": 81.88
  },
  {
    "onset": 210,
    "date": 83.08
  },
  {
    "onset": 213,
    "date": 84.28
  },
  {
    "onset": 216,
    "date": 85.52
  },
  {
    "onset": 219,
    "date": 86.65
  },
  {
    "onset": 222,
    "date": 88.02
  },
  {
    "onset": 225,
    "date": 89.25
  },
  {
    "onset": 228,
    "date": 90.35
  },
  {
    "onset": 231,
    "date": 91.52
  },
  {
    "onset": 234,
    "date": 92.79
  },
  {
    "onset": 237,
    "date": 93.99
  },
  {
    "onset": 240,
    "date": 95.32
  },
  {
    "onset": 243,
    "date": 96.52
  },
  {
    "onset": 246,
    "date": 97.72
  },
  {
    "onset": 249,
    "date": 98.82
  },
  {
    "onset": 252,
    "date": 99.96
  },
  {
    "onset": 255,
    "date": 101.16
  },
  {
    "onset": 258,
    "date": 102.33
  },
  {
    "onset": 261,
    "date": 103.46
  },
  {
    "onset": 264,
    "date": 104.59
  },
  {
    "onset": 267,
    "date": 105.79
  },
  {
    "onset": 270,
    "date": 107.06
  },
  {
    "onset": 273,
    "date": 108.26
  },
  {
    "onset": 276,
    "date": 109.43
  },
  {
    "onset": 279,
    "date": 222.55
  },
  {
    "onset": 282,
    "date": 223.78
  },
  {
    "onset": 285,
    "date": 225.12
  },
  {
    "onset": 288,
    "date": 226.32
  },
  {
    "onset": 291,
    "date": 227.65
  },
  {
    "onset": 294,
    "date": 228.82
  },
  {
    "onset": 297,
    "date": 230.02
  },
  {
    "onset": 300,
    "date": 231.32
  },
  {
    "onset": 303,
    "date": 232.59
  },
  {
    "onset": 306,
    "date": 233.75
  },
  {
    "onset": 309,
    "date": 235.15
  },
  {
    "onset": 312,
    "date": 236.35
  },
  {
    "onset": 315,
    "date": 237.72
  },
  {
    "onset": 318,
    "date": 238.89
  },
  {
    "onset": 321,
    "date": 240.16
  },
  {
    "onset": 324,
    "date": 241.46
  },
  {
    "onset": 327,
    "date": 242.79
  },
  {
    "onset": 330,
    "date": 243.89
  },
  {
    "onset": 333,
    "date": 244.99
  },
  {
    "onset": 336,
    "date": 246.12
  },
  {
    "onset": 339,
    "date": 247.23
  },
  {
    "onset": 342,
    "date": 248.36
  },
  {
    "onset": 345,
    "date": 249.40
  },
  {
    "onset": 348,
    "date": 250.53
  },
  {
    "onset": 351,
    "date": 251.66
  },
  {
    "onset": 354,
    "date": 252.83
  },
  {
    "onset": 357,
    "date": 253.93
  },
  {
    "onset": 360,
    "date": 255.06
  },
  {
    "onset": 363,
    "date": 256.19
  },
  {
    "onset": 366,
    "date": 257.40
  },
  {
    "onset": 369,
    "date": 258.60
  },
  {
    "onset": 372,
    "date": 259.76
  },
  {
    "onset": 375,
    "date": 260.90
  },
  {
    "onset": 378,
    "date": 262.23
  },
  {
    "onset": 381,
    "date": 263.60
  },
  {
    "onset": 384,
    "date": 265.07
  },
  {
    "onset": 387,
    "date": 266.27
  },
  {
    "onset": 390,
    "date": 267.70
  },
  {
    "onset": 393,
    "date": 269.04
  },
  {
    "onset": 396,
    "date": 270.57
  },
  {
    "onset": 399,
    "date": 270.66
  },
  {
    "onset": 402,
    "date": 273.27
  },
  {
    "onset": 405,
    "date": 274.41
  },
  {
    "onset": 408,
    "date": 275.57
  },
  {
    "onset": 411,
    "date": 276.87
  },
  {
    "onset": 414,
    "date": 278.17
  },
  {
    "onset": 417,
    "date": 279.29
  },
  {
    "onset": 420,
    "date": 280.47
  },
  {
    "onset": 423,
    "date": 281.58
  },
  {
    "onset": 426,
    "date": 282.68
  },
  {
    "onset": 429,
    "date": 283.84
  },
  {
    "onset": 432,
    "date": 284.91
  },
  {
    "onset": 435,
    "date": 286.28
  },
  {
    "onset": 438,
    "date": 287.41
  },
  {
    "onset": 441,
    "date": 288.54
  },
  {
    "onset": 444,
    "date": 289.74
  },
  {
    "onset": 447,
    "date": 290.88
  },
  {
    "onset": 450,
    "date": 292.05
  },
  {
    "onset": 453,
    "date": 293.25
  },
  {
    "onset": 456,
    "date": 294.45
  },
  {
    "onset": 459,
    "date": 295.65
  },
  {
    "onset": 462,
    "date": 297.11
  },
  {
    "onset": 465,
    "date": 298.28
  },
  {
    "onset": 468,
    "date": 299.42
  },
  {
    "onset": 471,
    "date": 300.58
  },
  {
    "onset": 474,
    "date": 301.75
  },
  {
    "onset": 477,
    "date": 302.98
  },
  {
    "onset": 480,
    "date": 304.18
  },
  {
    "onset": 483,
    "date": 305.35
  },
  {
    "onset": 486,
    "date": 306.52
  },
  {
    "onset": 489,
    "date": 307.75
  },
  {
    "onset": 492,
    "date": 308.92
  },
  {
    "onset": 495,
    "date": 310.12
  },
  {
    "onset": 498,
    "date": 311.32
  },
  {
    "onset": 501,
    "date": 312.52
  },
  {
    "onset": 504,
    "date": 313.79
  },
  {
    "onset": 507,
    "date": 315.09
  },
  {
    "onset": 510,
    "date": 316.39
  },
  {
    "onset": 513,
    "date": 317.66
  },
  {
    "onset": 516,
    "date": 318.96
  },
  {
    "onset": 519,
    "date": 320.22
  },
  {
    "onset": 522,
    "date": 321.49
  },
  {
    "onset": 525,
    "date": 322.79
  },
  {
    "onset": 528,
    "date": 324.63
  },
  {
    "onset": 531,
    "date": 325.93
  },
  {
    "onset": 534,
    "date": 327.26
  },
  {
    "onset": 537,
    "date": 328.46
  },
  {
    "onset": 540,
    "date": 329.76
  },
  {
    "onset": 543,
    "date": 330.90
  },
  {
    "onset": 546,
    "date": 332.06
  },
  {
    "onset": 549,
    "date": 333.23
  },
  {
    "onset": 552,
    "date": 334.40
  },
  {
    "onset": 555,
    "date": 335.50
  },
  {
    "onset": 558,
    "date": 336.70
  },
  {
    "onset": 561,
    "date": 337.90
  },
  {
    "onset": 564,
    "date": 339.00
  },
  {
    "onset": 567,
    "date": 340.50
  },
  {
    "onset": 570,
    "date": 341.64
  },
  {
    "onset": 573,
    "date": 342.80
  },
  {
    "onset": 576,
    "date": 344.14
  },
  {
    "onset": 579,
    "date": 345.24
  },
  {
    "onset": 582,
    "date": 346.34
  },
  {
    "onset": 585,
    "date": 347.44
  },
  {
    "onset": 588,
    "date": 348.60
  },
  {
    "onset": 591,
    "date": 349.74
  },
  {
    "onset": 594,
    "date": 350.91
  },
  {
    "onset": 597,
    "date": 352.07
  },
  {
    "onset": 600,
    "date": 353.21
  },
  {
    "onset": 603,
    "date": 354.41
  },
  {
    "onset": 606,
    "date": 355.61
  },
  {
    "onset": 609,
    "date": 356.77
  },
  {
    "onset": 612,
    "date": 357.88
  },
  {
    "onset": 615,
    "date": 359.01
  },
  {
    "onset": 618,
    "date": 360.21
  },
  {
    "onset": 621,
    "date": 361.44
  },
  {
    "onset": 624,
    "date": 362.74
  },
  {
    "onset": 627,
    "date": 363.91
  },
  {
    "onset": 630,
    "date": 365.28
  },
  {
    "onset": 633,
    "date": 366.35
  },
  {
    "onset": 636,
    "date": 367.51
  },
  {
    "onset": 639,
    "date": 368.68
  },
  {
    "onset": 642,
    "date": 369.90
  },
  {
    "onset": 645,
    "date": 371.08
  },
  {
    "onset": 648,
    "date": 372.45
  },
  {
    "onset": 651,
    "date": 373.62
  },
  {
    "onset": 654,
    "date": 374.78
  },
  {
    "onset": 657,
    "date": 375.88
  },
  {
    "onset": 660,
    "date": 376.98
  },
  {
    "onset": 663,
    "date": 378.12
  },
  {
    "onset": 666,
    "date": 379.39
  },
  {
    "onset": 669,
    "date": 380.59
  },
  {
    "onset": 672,
    "date": 381.69
  },
  {
    "onset": 675,
    "date": 382.85
  },
  {
    "onset": 678,
    "date": 384.12
  },
  {
    "onset": 681,
    "date": 385.29
  },
  {
    "onset": 684,
    "date": 386.52
  },
  {
    "onset": 686,
    "date": 393.45
  }
]