[
  {
    "onset": 0,
    "date": 0.65
  },
  {
    "onset": 1,
    "date": 0.98
  },
  {
    "onset": 5,
    "date": 2.85
  },
  {
    "onset": 9,
    "date": 4.83
  },
  {
    "onset": 13,
    "date": 6.70
  },
  {
    "onset": 17,
    "date": 8.67
  },
  {
    "onset": 21,
    "date": 10.59
  },
  {
    "onset": 25,
    "date": 12.44
  },
  {
    "onset": 29,
    "date": 14.29
  },
  {
    "onset": 33,
    "date": 16.13
  },
  {
    "onset": 37,
    "date": 18.07
  },
  {
    "onset": 41,
    "date": 20.27
  },
  {
    "onset": 45,
    "date": 22.03
  },
  {
    "onset": 49,
    "date": 23.90
  },
  {
    "onset": 53,
    "date": 25.65
  },
  {
    "onset": 57,
    "date": 27.77
  },
  {
    "onset": 61,
    "date": 29.49
  },
  {
    "onset": 65,
    "date": 31.25
  },
  {
    "onset": 69,
    "date": 33.12
  },
  {
    "onset": 73,
    "date": 35.02
  },
  {
    "onset": 77,
    "date": 36.87
  },
  {
    "onset": 81,
    "date": 38.59
  },
  {
    "onset": 85,
    "date": 40.50
  },
  {
    "onset": 89,
    "date": 42.60
  },
  {
    "onset": 93,
    "date": 44.62
  },
  {
    "onset": 97,
    "date": 46.59
  },
  {
    "onset": 101,
    "date": 48.62
  },
  {
    "onset": 105,
    "date": 50.47
  },
  {
    "onset": 109,
    "date": 52.34
  },
  {
    "onset": 113,
    "date": 54.20
  },
  {
    "onset": 117,
    "date": 56.17
  },
  {
    "onset": 121,
    "date": 58.11
  },
  {
    "onset": 125,
    "date": 59.84
  },
  {
    "onset": 129,
    "date": 61.96
  },
  {
    "onset": 133,
    "date": 63.84
  },
  {
    "onset": 137,
    "date": 65.82
  },
  {
    "onset": 141,
    "date": 67.55
  },
  {
    "onset": 145,
    "date": 69.25
  },
  {
    "onset": 149,
    "date": 71.19
  },
  {
    "onset": 153,
    "date": 73.03
  },
  {
    "onset": 157,
    "date": 74.87
  },
  {
    "onset": 161,
    "date": 76.77
  },
  {
    "onset": 165,
    "date": 78.61
  },
  {
    "onset": 169,
    "date": 80.51
  },
  {
    "onset": 173,
    "date": 82.71
  },
  {
    "onset": 177,
    "date": 84.72
  },
  {
    "onset": 181,
    "date": 86.56
  },
  {
    "onset": 185,
    "date": 88.51
  },
  {
    "onset": 189,
    "date": 90.47
  },
  {
    "onset": 193,
    "date": 92.43
  },
  {
    "onset": 197,
    "date": 94.41
  },
  {
    "onset": 201,
    "date": 96.41
  },
  {
    "onset": 205,
    "date": 98.26
  },
  {
    "onset": 209,
    "date": 99.99
  },
  {
    "onset": 213,
    "date": 101.86
  },
  {
    "onset": 217,
    "date": 103.77
  },
  {
    "onset": 221,
    "date": 105.58
  },
  {
    "onset": 225,
    "date": 107.50
  },
  {
    "onset": 229,
    "date": 109.28
  },
  {
    "onset": 233,
    "date": 111.06
  },
  {
    "onset": 237,
    "date": 113.11
  },
  {
    "onset": 241,
    "date": 114.94
  },
  {
    "onset": 245,
    "date": 116.92
  },
  {
    "onset": 249,
    "date": 118.99
  },
  {
    "onset": 251,
    "date": 120.14
  },
  {
    "onset": 251.83340438092796,
    "date": 241.62
  },
  {
    "onset": 256,
    "date": 242.36
  },
  {
    "onset": 264,
    "date": 245.97
  },
  {
    "onset": 268,
    "date": 247.95
  },
  {
    "onset": 272,
    "date": 249.86
  },
  {
    "onset": 276,
    "date": 251.78
  },
  {
    "onset": 280,
    "date": 253.82
  },
  {
    "onset": 284,
    "date": 255.67
  },
  {
    "onset": 288,
    "date": 257.40
  },
  {
    "onset": 292,
    "date": 259.18
  },
  {
    "onset": 296,
    "date": 261.16
  },
  {
    "onset": 300,
    "date": 263.00
  },
  {
    "onset": 304,
    "date": 264.85
  },
  {
    "onset": 308,
    "date": 266.65
  },
  {
    "onset": 312,
    "date": 268.40
  },
  {
    "onset": 316,
    "date": 270.23
  },
  {
    "onset": 320,
    "date": 272.23
  },
  {
    "onset": 324,
    "date": 274.15
  },
  {
    "onset": 328,
    "date": 276.07
  },
  {
    "onset": 332,
    "date": 277.87
  },
  {
    "onset": 336,
    "date": 279.73
  },
  {
    "onset": 340,
    "date": 281.68
  },
  {
    "onset": 344,
    "date": 283.62
  },
  {
    "onset": 348,
    "date": 285.52
  },
  {
    "onset": 352,
    "date": 287.42
  },
  {
    "onset": 356,
    "date": 289.20
  },
  {
    "onset": 360,
    "date": 291.03
  },
  {
    "onset": 364,
    "date": 292.97
  },
  {
    "onset": 368,
    "date": 294.83
  },
  {
    "onset": 372,
    "date": 296.85
  },
  {
    "onset": 376,
    "date": 299.20
  },
  {
    "onset": 380,
    "date": 301.26
  },
  {
    "onset": 384,
    "date": 302.87
  },
  {
    "onset": 388,
    "date": 304.67
  },
  {
    "onset": 392,
    "date": 306.67
  },
  {
    "onset": 396,
    "date": 308.68
  },
  {
    "onset": 400,
    "date": 310.40
  },
  {
    "onset": 404,
    "date": 312.48
  },
  {
    "onset": 408,
    "date": 314.24
  },
  {
    "onset": 412,
    "date": 316.19
  },
  {
    "onset": 416,
    "date": 318.19
  },
  {
    "onset": 420,
    "date": 320.20
  },
  {
    "onset": 424,
    "date": 322.14
  },
  {
    "onset": 428,
    "date": 324.00
  },
  {
    "onset": 432,
    "date": 325.92
  },
  {
    "onset": 436,
    "date": 327.87
  },
  {
    "onset": 440,
    "date": 329.83
  },
  {
    "onset": 444,
    "date": 331.80
  },
  {
    "onset": 448,
    "date": 333.67
  },
  {
    "onset": 452,
    "date": 335.54
  },
  {
    "onset": 456,
    "date": 337.54
  },
  {
    "onset": 460,
    "date": 339.35
  },
  {
    "onset": 464,
    "date": 341.30
  },
  {
    "onset": 468,
    "date": 343.15
  },
  {
    "onset": 472,
    "date": 344.94
  },
  {
    "onset": 476,
    "date": 346.95
  },
  {
    "onset": 480,
    "date": 349.05
  },
  {
    "onset": 484,
    "date": 351.17
  },
  {
    "onset": 488,
    "date": 353.09
  },
  {
    "onset": 492,
    "date": 354.97
  },
  {
    "onset": 496,
    "date": 356.86
  },
  {
    "onset": 500,
    "date": 358.80
  },
  {
    "onset": 504,
    "date": 360.75
  },
  {
    "onset": 508,
    "date": 362.45
  },
  {
    "onset": 512,
    "date": 364.30
  },
  {
    "onset": 516,
    "date": 366.35
  },
  {
    "onset": 520,
    "date": 368.34
  },
  {
    "onset": 524,
    "date": 370.30
  },
  {
    "onset": 528,
    "date": 372.09
  },
  {
    "onset": 532,
    "date": 373.85
  },
  {
    "onset": 536,
    "date": 375.82
  },
  {
    "onset": 540,
    "date": 377.64
  },
  {
    "onset": 544,
    "date": 379.49
  },
  {
    "onset": 548,
    "date": 381.30
  },
  {
    "onset": 552,
    "date": 383.24
  },
  {
    "onset": 556,
    "date": 385.14
  },
  {
    "onset": 560,
    "date": 387.37
  },
  {
    "onset": 564,
    "date": 389.40
  },
  {
    "onset": 568,
    "date": 391.47
  },
  {
    "onset": 572,
    "date": 393.41
  },
  {
    "onset": 576,
    "date": 395.32
  },
  {
    "onset": 580,
    "date": 397.24
  },
  {
    "onset": 584,
    "date": 399.12
  },
  {
    "onset": 588,
    "date": 401.09
  },
  {
    "onset": 592,
    "date": 402.86
  },
  {
    "onset": 596,
    "date": 404.81
  },
  {
    "onset": 600,
    "date": 406.76
  },
  {
    "onset": 604,
    "date": 408.64
  },
  {
    "onset": 608,
    "date": 410.72
  },
  {
    "onset": 612,
    "date": 412.42
  },
  {
    "onset": 616,
    "date": 414.27
  },
  {
    "onset": 620,
    "date": 416.17
  },
  {
    "onset": 624,
    "date": 417.99
  },
  {
    "onset": 628,
    "date": 419.89
  },
  {
    "onset": 632,
    "date": 421.71
  },
  {
    "onset": 636,
    "date": 423.51
  },
  {
    "onset": 640,
    "date": 425.41
  },
  {
    "onset": 644,
    "date": 427.11
  },
  {
    "onset": 648,
    "date": 429.09
  },
  {
    "onset": 652,
    "date": 431.06
  },
  {
    "onset": 656,
    "date": 433.07
  },
  {
    "onset": 660,
    "date": 435.21
  },
  {
    "onset": 662,
    "date": 436.59
  }
]