[
  {
    "onset": 0,
    "date": 0.49
  },
  {
    "onset": 2,
    "date": 1.31
  },
  {
    "onset": 10,
    "date": 4.15
  },
  {
    "onset": 18,
    "date": 6.81
  },
  {
    "onset": 26,
    "date": 9.56
  },
  {
    "onset": 34,
    "date": 12.56
  },
  {
    "onset": 42,
    "date": 14.76
  },
  {
    "onset": 50,
    "date": 18.73
  },
  {
    "onset": 58,
    "date": 20.88
  },
  {
    "onset": 66,
    "date": 23.86
  },
  {
    "onset": 74,
    "date": 26.83
  },
  {
    "onset": 82,
    "date": 29.58
  },
  {
    "onset": 90,
    "date": 32.50
  },
  {
    "onset": 98,
    "date": 35.25
  },
  {
    "onset": 102,
    "date": 36.75
  },
  {
    "onset": 110,
    "date": 39.75
  },
  {
    "onset": 118,
    "date": 42.66
  },
  {
    "onset": 126,
    "date": 45.58
  },
  {
    "onset": 134,
    "date": 48.49
  },
  {
    "onset": 142,
    "date": 51.29
  },
  {
    "onset": 150,
    "date": 54.06
  },
  {
    "onset": 158,
    "date": 57.13
  },
  {
    "onset": 166,
    "date": 60.05
  },
  {
    "onset": 170,
    "date": 61.81
  },
  {
    "onset": 170.25,
    "date": 63.43
  },
  {
    "onset": 170.5,
    "date": 65.35
  },
  {
    "onset": 172,
    "date": 68.36
  },
  {
    "onset": 174,
    "date": 69.17
  },
  {
    "onset": 182,
    "date": 71.92
  },
  {
    "onset": 190,
    "date": 75.02
  },
  {
    "onset": 198,
    "date": 77.55
  },
  {
    "onset": 206,
    "date": 80.70
  },
  {
    "onset": 214,
    "date": 83.43
  },
  {
    "onset": 222,
    "date": 86.30
  },
  {
    "onset": 230,
    "date": 89.10
  },
  {
    "onset": 236,
    "date": 91.42
  },
  {
    "onset": 238,
    "date": 103.94
  },
  {
    "onset": 246,
    "date": 106.79
  },
  {
    "onset": 254,
    "date": 110.13
  },
  {
    "onset": 258,
    "date": 111.74
  },
  {
    "onset": 259,
    "date": 112.62
  },
  {
    "onset": 261.5,
    "date": 114.40
  },
  {
    "onset": 262,
    "date": 114.62
  },
  {
    "onset": 268,
    "date": 117.12
  },
  {
    "onset": 270,
    "date": 132.76
  },
  {
    "onset": 272,
    "date": 133.78
  },
  {
    "onset": 273.9999999999999,
    "date": 134.66
  },
  {
    "onset": 276,
    "date": 135.40
  },
  {
    "onset": 278,
    "date": 136.55
  },
  {
    "onset": 284,
    "date": 139.38
  },
  {
    "onset": 286,
    "date": 140.15
  },
  {
    "onset": 290,
    "date": 141.59
  },
  {
    "onset": 298,
    "date": 144.54
  },
  {
    "onset": 306,
    "date": 147.20
  },
  {
    "onset": 314,
    "date": 150.05
  },
  {
    "onset": 318,
    "date": 151.33
  },
  {
    "onset": 322,
    "date": 152.75
  },
  {
    "onset": 326,
    "date": 154.17
  },
  {
    "onset": 330,
    "date": 155.50
  },
  {
    "onset": 338,
    "date": 158.34
  },
  {
    "onset": 346,
    "date": 161.22
  },
  {
    "onset": 354,
    "date": 164.14
  },
  {
    "onset": 358,
    "date": 165.87
  },
  {
    "onset": 366,
    "date": 168.60
  },
  {
    "onset": 374,
    "date": 171.60
  },
  {
    "onset": 382,
    "date": 174.32
  },
  {
    "onset": 390,
    "date": 177.10
  },
  {
    "onset": 398,
    "date": 179.93
  },
  {
    "onset": 406,
    "date": 182.93
  },
  {
    "onset": 412,
    "date": 185.10
  },
  {
    "onset": 414,
    "date": 185.85
  },
  {
    "onset": 422,
    "date": 188.64
  },
  {
    "onset": 430,
    "date": 191.44
  },
  {
    "onset": 438,
    "date": 194.47
  },
  {
    "onset": 446,
    "date": 197.21
  },
  {
    "onset": 454,
    "date": 200.07
  },
  {
    "onset": 462,
    "date": 203.05
  },
  {
    "onset": 470,
    "date": 205.97
  },
  {
    "onset": 478,
    "date": 209.02
  },
  {
    "onset": 486,
    "date": 211.82
  },
  {
    "onset": 494,
    "date": 214.72
  },
  {
    "onset": 502,
    "date": 217.66
  },
  {
    "onset": 510,
    "date": 220.57
  },
  {
    "onset": 518,
    "date": 223.41
  },
  {
    "onset": 526,
    "date": 226.25
  },
  {
    "onset": 534,
    "date": 228.99
  },
  {
    "onset": 542,
    "date": 231.92
  },
  {
    "onset": 550,
    "date": 234.79
  },
  {
    "onset": 558,
    "date": 237.91
  },
  {
    "onset": 566,
    "date": 240.69
  },
  {
    "onset": 574,
    "date": 243.83
  },
  {
    "onset": 582,
    "date": 246.70
  },
  {
    "onset": 590,
    "date": 249.63
  },
  {
    "onset": 598,
    "date": 252.41
  },
  {
    "onset": 606,
    "date": 255.13
  },
  {
    "onset": 614,
    "date": 257.91
  },
  {
    "onset": 622,
    "date": 260.81
  },
  {
    "onset": 630,
    "date": 263.63
  },
  {
    "onset": 638,
    "date": 266.51
  },
  {
    "onset": 645,
    "date": 269.54
  },
  {
    "onset": 646,
    "date": 269.92
  }
]