[
  {
    "onset": 0,
    "date": 0
  },
  {
    "onset": 1.5,
    "date": 2.75
  },
  {
    "onset": 3,
    "date": 4.77
  },
  {
    "onset": 4.5,
    "date": 6.92
  },
  {
    "onset": 6,
    "date": 9.04
  },
  {
    "onset": 7.5,
    "date": 11.07
  },
  {
    "onset": 9,
    "date": 13.08
  },
  {
    "onset": 10.5,
    "date": 15.18
  },
  {
    "onset": 12,
    "date": 17.15
  },
  {
    "onset": 13.5,
    "date": 19.30
  },
  {
    "onset": 15,
    "date": 21.37
  },
  {
    "onset": 16.5,
    "date": 23.45
  },
  {
    "onset": 18,
    "date": 25.59
  },
  {
    "onset": 19.5,
    "date": 27.67
  },
  {
    "onset": 21,
    "date": 29.90
  },
  {
    "onset": 22.5,
    "date": 32.69
  },
  {
    "onset": 24,
    "date": 35.75
  },
  {
    "onset": 25.5,
    "date": 39.09
  },
  {
    "onset": 27,
    "date": 40.95
  },
  {
    "onset": 28.5,
    "date": 43.10
  },
  {
    "onset": 30,
    "date": 45.07
  },
  {
    "onset": 31.5,
    "date": 46.90
  },
  {
    "onset": 33,
    "date": 49.00
  },
  {
    "onset": 34.5,
    "date": 50.91
  },
  {
    "onset": 36,
    "date": 52.89
  },
  {
    "onset": 37.5,
    "date": 54.77
  },
  {
    "onset": 39,
    "date": 56.79
  },
  {
    "onset": 40.5,
    "date": 58.67
  },
  {
    "onset": 42,
    "date": 60.53
  },
  {
    "onset": 43.5,
    "date": 62.62
  },
  {
    "onset": 45,
    "date": 64.57
  },
  {
    "onset": 46.5,
    "date": 66.58
  },
  {
    "onset": 48,
    "date": 68.64
  },
  {
    "onset": 49.5,
    "date": 70.59
  },
  {
    "onset": 51,
    "date": 72.52
  },
  {
    "onset": 52.5,
    "date": 74.45
  },
  {
    "onset": 54,
    "date": 76.35
  },
  {
    "onset": 55.5,
    "date": 78.52
  },
  {
    "onset": 57,
    "date": 80.47
  },
  {
    "onset": 58.5,
    "date": 82.35
  },
  {
    "onset": 60,
    "date": 84.43
  },
  {
    "onset": 61.5,
    "date": 86.60
  },
  {
    "onset": 63,
    "date": 88.72
  },
  {
    "onset": 64.5,
    "date": 90.92
  },
  {
    "onset": 66,
    "date": 93.47
  },
  {
    "onset": 67.5,
    "date": 95.80
  },
  {
    "onset": 69,
    "date": 98.05
  },
  {
    "onset": 70.5,
    "date": 100.90
  },
  {
    "onset": 71.5,
    "date": 204.44
  },
  {
    "onset": 72,
    "date": 204.79
  },
  {
    "onset": 73.5,
    "date": 206.98
  },
  {
    "onset": 75,
    "date": 209.10
  },
  {
    "onset": 76.5,
    "date": 211.13
  },
  {
    "onset": 78,
    "date": 213.17
  },
  {
    "onset": 79.5,
    "date": 215.33
  },
  {
    "onset": 81,
    "date": 217.37
  },
  {
    "onset": 82.5,
    "date": 219.22
  },
  {
    "onset": 84,
    "date": 221.43
  },
  {
    "onset": 85.5,
    "date": 223.33
  },
  {
    "onset": 87,
    "date": 225.25
  },
  {
    "onset": 88.5,
    "date": 227.23
  },
  {
    "onset": 90,
    "date": 229.07
  },
  {
    "onset": 91.5,
    "date": 230.95
  },
  {
    "onset": 93,
    "date": 232.90
  },
  {
    "onset": 94.5,
    "date": 235.07
  },
  {
    "onset": 96,
    "date": 237.27
  },
  {
    "onset": 97.5,
    "date": 239.18
  },
  {
    "onset": 99,
    "date": 241.12
  },
  {
    "onset": 100.5,
    "date": 243.17
  },
  {
    "onset": 102,
    "date": 245.38
  },
  {
    "onset": 103.5,
    "date": 247.50
  },
  {
    "onset": 105,
    "date": 249.55
  },
  {
    "onset": 106.5,
    "date": 251.76
  },
  {
    "onset": 108,
    "date": 253.77
  },
  {
    "onset": 109.5,
    "date": 255.99
  },
  {
    "onset": 111,
    "date": 258.00
  },
  {
    "onset": 112.5,
    "date": 260.03
  },
  {
    "onset": 114,
    "date": 262.10
  },
  {
    "onset": 115.5,
    "date": 264.18
  },
  {
    "onset": 117,
    "date": 266.18
  },
  {
    "onset": 118.5,
    "date": 268.20
  },
  {
    "onset": 120,
    "date": 270.40
  },
  {
    "onset": 121.5,
    "date": 272.62
  },
  {
    "onset": 123,
    "date": 275.02
  },
  {
    "onset": 124.5,
    "date": 277.82
  },
  {
    "onset": 126,
    "date": 282.30
  },
  {
    "onset": 127.5,
    "date": 284.68
  },
  {
    "onset": 129,
    "date": 286.62
  },
  {
    "onset": 130.5,
    "date": 288.68
  },
  {
    "onset": 132,
    "date": 290.60
  },
  {
    "onset": 133.5,
    "date": 292.38
  },
  {
    "onset": 135,
    "date": 294.27
  },
  {
    "onset": 136.5,
    "date": 296.23
  },
  {
    "onset": 138,
    "date": 298.10
  },
  {
    "onset": 139.5,
    "date": 299.93
  },
  {
    "onset": 141,
    "date": 301.97
  },
  {
    "onset": 142.5,
    "date": 303.85
  },
  {
    "onset": 144,
    "date": 305.77
  },
  {
    "onset": 145.5,
    "date": 307.68
  },
  {
    "onset": 147,
    "date": 309.58
  },
  {
    "onset": 148.5,
    "date": 311.85
  },
  {
    "onset": 150,
    "date": 313.85
  },
  {
    "onset": 151.5,
    "date": 316.10
  },
  {
    "onset": 153,
    "date": 318.05
  },
  {
    "onset": 154.5,
    "date": 319.95
  },
  {
    "onset": 156,
    "date": 321.87
  },
  {
    "onset": 157.5,
    "date": 323.90
  },
  {
    "onset": 159,
    "date": 325.77
  },
  {
    "onset": 160.5,
    "date": 327.82
  },
  {
    "onset": 162,
    "date": 330.10
  },
  {
    "onset": 163.5,
    "date": 332.12
  },
  {
    "onset": 165,
    "date": 334.02
  },
  {
    "onset": 166.5,
    "date": 336.07
  },
  {
    "onset": 168,
    "date": 338.47
  },
  {
    "onset": 169.5,
    "date": 340.92
  },
  {
    "onset": 171,
    "date": 343.13
  },
  {
    "onset": 172.5,
    "date": 345.25
  },
  {
    "onset": 174,
    "date": 347.72
  },
  {
    "onset": 175.5,
    "date": 350.32
  },
  {
    "onset": 177,
    "date": 352.40
  },
  {
    "onset": 178.5,
    "date": 355.35
  }
]