[
  {
    "onset": 0,
    "date": 0
  },
  {
    "onset": 0.5,
    "date": 1.25
  },
  {
    "onset": 2,
    "date": 3.17
  },
  {
    "onset": 6.5,
    "date": 7.67
  },
  {
    "onset": 9.5,
    "date": 11.02
  },
  {
    "onset": 12.5,
    "date": 14.68
  },
  {
    "onset": 18,
    "date": 19.38
  },
  {
    "onset": 30.5,
    "date": 31.34
  },
  {
    "onset": 33.5,
    "date": 33.85
  },
  {
    "onset": 36.5,
    "date": 36.61
  },
  {
    "onset": 39.5,
    "date": 39.04
  },
  {
    "onset": 45.5,
    "date": 44.07
  },
  {
    "onset": 51.5,
    "date": 49.61
  },
  {
    "onset": 56,
    "date": 54.92
  },
  {
    "onset": 72.5,
    "date": 71.12
  },
  {
    "onset": 81,
    "date": 80.37
  },
  {
    "onset": 86,
    "date": 84.60
  },
  {
    "onset": 90.5,
    "date": 88.49
  },
  {
    "onset": 99,
    "date": 96.39
  },
  {
    "onset": 105.5,
    "date": 104.18
  },
  {
    "onset": 108.5,
    "date": 107.02
  },
  {
    "onset": 111.5,
    "date": 111.15
  },
  {
    "onset": 112.5,
    "date": 112.38
  },
  {
    "onset": 116,
    "date": 117.18
  },
  {
    "onset": 117.5,
    "date": 120.03
  },
  {
    "onset": 120.5,
    "date": 125.75
  },
  {
    "onset": 123,
    "date": 134.80
  }
]