[
  {
    "onset": 0,
    "date": 0.42
  },
  {
    "onset": 0.5,
    "date": 0.69
  },
  {
    "onset": 4,
    "date": 2.05
  },
  {
    "onset": 8,
    "date": 7.51
  },
  {
    "onset": 16,
    "date": 14.58
  },
  {
    "onset": 24,
    "date": 21.57
  },
  {
    "onset": 32,
    "date": 28.43
  },
  {
    "onset": 36.5,
    "date": 32.42
  },
  {
    "onset": 40,
    "date": 35.49
  },
  {
    "onset": 48,
    "date": 42.24
  },
  {
    "onset": 56,
    "date": 49.22
  },
  {
    "onset": 64,
    "date": 56.19
  },
  {
    "onset": 72,
    "date": 62.98
  },
  {
    "onset": 80,
    "date": 69.87
  },
  {
    "onset": 84,
    "date": 73.33
  },
  {
    "onset": 86,
    "date": 74.96
  },
  {
    "onset": 88,
    "date": 77.25
  },
  {
    "onset": 96,
    "date": 83.59
  },
  {
    "onset": 104,
    "date": 88.32
  },
  {
    "onset": 112,
    "date": 97.23
  },
  {
    "onset": 120,
    "date": 104.08
  },
  {
    "onset": 128,
    "date": 111.15
  },
  {
    "onset": 133,
    "date": 115.46
  },
  {
    "onset": 133.9965940386445,
    "date": 116.43
  },
  {
    "onset": 135,
    "date": 117.28
  },
  {
    "onset": 136,
    "date": 118.38
  },
  {
    "onset": 136.25,
    "date": 118.48
  }
]