[
  {
    "onset": 0,
    "date": 1.0399999999999998
  },
  {
    "onset": 3,
    "date": 4.68
  },
  {
    "onset": 21,
    "date": 24.588143923624234
  },
  {
    "onset": 24,
    "date": 28.150826924972886
  },
  {
    "onset": 27,
    "date": 31.6639990234375
  },
  {
    "onset": 39,
    "date": 44.93
  },
  {
    "onset": 51,
    "date": 58.64999999999999
  },
  {
    "onset": 63,
    "date": 71.66491596049282
  },
  {
    "onset": 75,
    "date": 85.21436850995478
  },
  {
    "onset": 84,
    "date": 95.14919074670084
  },
  {
    "onset": 93,
    "date": 105.12730196922793
  },
  {
    "onset": 102,
    "date": 114.42577822871287
  },
  {
    "onset": 111,
    "date": 124.27402249389687
  },
  {
    "onset": 120,
    "date": 134.23914490696964
  },
  {
    "onset": 126,
    "date": 140.5506811475636
  },
  {
    "onset": 129,
    "date": 144.0224556934821
  },
  {
    "onset": 132,
    "date": 148.17819832846087
  }
]