[
  {
    "onset": 0,
    "date": 0.43
  },
  {
    "onset": 12,
    "date": 5.73
  },
  {
    "onset": 18,
    "date": 8.27
  },
  {
    "onset": 24,
    "date": 11.47
  },
  {
    "onset": 36,
    "date": 16.92
  },
  {
    "onset": 52,
    "date": 24.53
  },
  {
    "onset": 72,
    "date": 33.15
  },
  {
    "onset": 92,
    "date": 42.40
  },
  {
    "onset": 104,
    "date": 48.19
  },
  {
    "onset": 115,
    "date": 53.62
  },
  {
    "onset": 116,
    "date": 54.24
  },
  {
    "onset": 130,
    "date": 61.12
  },
  {
    "onset": 132,
    "date": 62.29
  },
  {
    "onset": 149,
    "date": 69.22
  },
  {
    "onset": 152,
    "date": 70.85
  },
  {
    "onset": 156,
    "date": 72.68
  },
  {
    "onset": 158,
    "date": 73.91
  },
  {
    "onset": 159,
    "date": 74.45
  },
  {
    "onset": 160,
    "date": 75.39
  }
]