[
  {
    "onset": 0,
    "date": 1.17
  },
  {
    "onset": 24,
    "date": 16.21
  },
  {
    "onset": 36,
    "date": 23.85
  },
  {
    "onset": 42,
    "date": 27.56
  },
  {
    "onset": 56,
    "date": 36.08
  },
  {
    "onset": 60,
    "date": 38.55
  },
  {
    "onset": 96,
    "date": 60.94
  },
  {
    "onset": 110,
    "date": 69.93
  },
  {
    "onset": 116,
    "date": 73.57
  },
  {
    "onset": 128,
    "date": 81.27
  },
  {
    "onset": 132,
    "date": 83.74
  },
  {
    "onset": 144,
    "date": 90.97
  },
  {
    "onset": 184,
    "date": 115.06
  },
  {
    "onset": 194,
    "date": 120.99
  },
  {
    "onset": 208,
    "date": 129.40
  },
  {
    "onset": 229,
    "date": 142.15
  },
  {
    "onset": 236,
    "date": 146.44
  },
  {
    "onset": 241,
    "date": 149.32
  },
  {
    "onset": 255,
    "date": 158.31
  },
  {
    "onset": 264,
    "date": 163.78
  },
  {
    "onset": 278,
    "date": 172.42
  },
  {
    "onset": 282,
    "date": 174.59
  },
  {
    "onset": 292,
    "date": 181.23
  },
  {
    "onset": 295,
    "date": 183.40
  },
  {
    "onset": 296,
    "date": 184.52
  }
]