{
    "bars": [
        280.0,
        503.79732224396577,
        709.3238878016961,
        951.1252848445313,
        1203.3965205545283,
        1397.1864659774506,
        1646.857193968379,
        1889.3995467624661,
        2124.608033389992,
        2369.2190817700757,
        2618.9169895827094,
        2863.3155751447875,
        3112.107280159703,
        3346.380472810282,
        3580.760717356195,
        3826.4425162255097,
        4061.7017351861573,
        4331.148839991552,
        4566.408058952192,
        4829.603728662998,
        5073.5683946773515,
        5317.461768889141,
        5560.7689330552585,
        5817.832193546674,
        6084.664839556674,
        6348.431891741934,
        6611.961272042002,
        6883.310964366423,
        7123.5598684760125,
        7366.247327706279,
        7609.7740874366555,
        7865.866427075724,
        8109.411919574048,
        8349.761914138127,
        8602.898254429529,
        8856.22338010898,
        9126.977775629757,
        9375.546451428843,
        9618.116436208144,
        9852.406247906394,
        10084.730046123364,
        10322.913283783715,
        10567.414591676788,
        10810.555898120167,
        11064.532733301752,
        11319.728287878843,
        11569.124300599013,
        11812.307536193684,
        12055.479899859743,
        12304.924235041322,
        12549.59904162968,
        12798.822161873213,
        13046.89098096431,
        13290.572519668418,
        13533.510078485539,
        13777.711810166364,
        14021.375835497947,
        14273.8713301707,
        14411.16511686347,
        14654.621770048936,
        14859.935875832802,
        15094.556826148097,
        15336.871320603426,
        15561.51405598067,
        15795.74315969886,
        16047.225448239882,
        16289.921066417734,
        16533.442344956544,
        16795.562299946803,
        17039.049452153802,
        17272.211069624966,
        17515.835070494748,
        17777.650566254644,
        18026.890511170244,
        18272.831753396807,
        18516.42249703668,
        18778.12113695845,
        19057.246420280902,
        19300.287823412025,
        19528.175273509896,
        19770.388677510728,
        20013.471161528993,
        20265.089349178463,
        20458.03178449049,
        20700.95843115282,
        20923.649094340493,
        21186.742647939118,
        21449.85677818478,
        21693.46820396576,
        21952.045135907458,
        22204.16955262854,
        22461.782990332347,
        22715.1792357118,
        22964.79646336994,
        23216.667102639345,
        23458.11611959962,
        23711.327651019485,
        23965.15288541827,
        24202.172329319103,
        24456.6222853965,
        24698.3347149102,
        24777.84005737595
    ],
    "onset-x": [
        {
            "onset": 0.0,
            "x": 271.91776255707765
        },
        {
            "onset": 0.5,
            "x": 297.04794520547944
        },
        {
            "onset": 1.0,
            "x": 327.14088280060884
        },
        {
            "onset": 1.5,
            "x": 355.3312328767123
        },
        {
            "onset": 2.0,
            "x": 383.52158295281583
        },
        {
            "onset": 2.5,
            "x": 411.71193302891936
        },
        {
            "onset": 2.75,
            "x": 430.7698630136986
        },
        {
            "onset": 3.0,
            "x": 449.8277929984779
        },
        {
            "onset": 3.5,
            "x": 478.0181430745814
        },
        {
            "onset": 4.0,
            "x": 517.0773831267663
        },
        {
            "onset": 5.0,
            "x": 551.7525581648181
        },
        {
            "onset": 5.5,
            "x": 579.9429082409216
        },
        {
            "onset": 6.0,
            "x": 608.1332583170251
        },
        {
            "onset": 6.5,
            "x": 636.3236083931287
        },
        {
            "onset": 6.75,
            "x": 655.3815383779079
        },
        {
            "onset": 7.0,
            "x": 674.4394683626872
        },
        {
            "onset": 8.0,
            "x": 722.4483753714578
        },
        {
            "onset": 8.5,
            "x": 747.7341313328983
        },
        {
            "onset": 9.0,
            "x": 777.8270689280282
        },
        {
            "onset": 9.5,
            "x": 806.0174190041313
        },
        {
            "onset": 10.0,
            "x": 832.8599151989563
        },
        {
            "onset": 10.5,
            "x": 862.3981191563383
        },
        {
            "onset": 10.75,
            "x": 881.4560491411175
        },
        {
            "onset": 11.0,
            "x": 900.5139791258966
        },
        {
            "onset": 11.5,
            "x": 928.704329202
        },
        {
            "onset": 12.0,
            "x": 965.5981466260781
        },
        {
            "onset": 12.5,
            "x": 993.2918249619482
        },
        {
            "onset": 12.75,
            "x": 1012.3497549467274
        },
        {
            "onset": 13.0,
            "x": 1031.407684931507
        },
        {
            "onset": 13.5,
            "x": 1059.5980350076104
        },
        {
            "onset": 14.0,
            "x": 1087.7883850837138
        },
        {
            "onset": 14.5,
            "x": 1115.0274414003045
        },
        {
            "onset": 14.75,
            "x": 1134.0853713850838
        },
        {
            "onset": 15.0,
            "x": 1153.143301369863
        },
        {
            "onset": 15.75,
            "x": 1186.6757747402207
        },
        {
            "onset": 16.0,
            "x": 1217.2016710945027
        },
        {
            "onset": 16.5,
            "x": 1244.895349430373
        },
        {
            "onset": 17.0,
            "x": 1273.0856995064767
        },
        {
            "onset": 17.5,
            "x": 1301.27604958258
        },
        {
            "onset": 18.0,
            "x": 1329.4663996586833
        },
        {
            "onset": 19.0,
            "x": 1365.5107810459438
        },
        {
            "onset": 20.0,
            "x": 1411.6756356520145
        },
        {
            "onset": 20.5,
            "x": 1439.3693139878844
        },
        {
            "onset": 20.75,
            "x": 1458.4272439726637
        },
        {
            "onset": 21.0,
            "x": 1477.4851739574428
        },
        {
            "onset": 21.5,
            "x": 1505.6755240335465
        },
        {
            "onset": 21.75,
            "x": 1524.7334540183258
        },
        {
            "onset": 22.0,
            "x": 1543.7913840031051
        },
        {
            "onset": 22.5,
            "x": 1571.0304403196958
        },
        {
            "onset": 23.0,
            "x": 1599.2207903957992
        },
        {
            "onset": 23.75,
            "x": 1632.7532637661645
        },
        {
            "onset": 24.0,
            "x": 1660.1526146395386
        },
        {
            "onset": 24.5,
            "x": 1686.0725664406546
        },
        {
            "onset": 25.0,
            "x": 1716.165504035784
        },
        {
            "onset": 25.5,
            "x": 1744.3558541118873
        },
        {
            "onset": 26.0,
            "x": 1772.5462041879907
        },
        {
            "onset": 26.5,
            "x": 1800.7365542640944
        },
        {
            "onset": 26.75,
            "x": 1819.794484248874
        },
        {
            "onset": 27.0,
            "x": 1838.852414233653
        },
        {
            "onset": 27.5,
            "x": 1867.0427643097566
        },
        {
            "onset": 28.0,
            "x": 1903.2555393695511
        },
        {
            "onset": 28.5,
            "x": 1931.4458894456548
        },
        {
            "onset": 29.0,
            "x": 1959.6362395217584
        },
        {
            "onset": 29.5,
            "x": 1987.8265895978614
        },
        {
            "onset": 30.0,
            "x": 2016.0864047750765
        },
        {
            "onset": 30.5,
            "x": 2044.27675485118
        },
        {
            "onset": 30.75,
            "x": 2063.334684835959
        },
        {
            "onset": 31.0,
            "x": 2082.3926148207383
        },
        {
            "onset": 31.5,
            "x": 2100.6574550033865
        },
        {
            "onset": 32.0,
            "x": 2138.05829192446
        },
        {
            "onset": 32.5,
            "x": 2164.226579595693
        },
        {
            "onset": 33.0,
            "x": 2194.319517190822
        },
        {
            "onset": 33.5,
            "x": 2222.5098672669255
        },
        {
            "onset": 34.0,
            "x": 2250.250932715936
        },
        {
            "onset": 34.5,
            "x": 2278.890567419133
        },
        {
            "onset": 34.75,
            "x": 2297.9484974039115
        },
        {
            "onset": 35.0,
            "x": 2317.006427388691
        },
        {
            "onset": 35.5,
            "x": 2345.1967774647946
        },
        {
            "onset": 36.0,
            "x": 2382.9941411308073
        },
        {
            "onset": 36.5,
            "x": 2411.1844912069105
        },
        {
            "onset": 36.75,
            "x": 2430.2424211916896
        },
        {
            "onset": 37.0,
            "x": 2449.3003511764687
        },
        {
            "onset": 37.5,
            "x": 2477.4907012525723
        },
        {
            "onset": 38.0,
            "x": 2505.6810513286764
        },
        {
            "onset": 38.5,
            "x": 2532.9201076452664
        },
        {
            "onset": 38.75,
            "x": 2551.9780376300455
        },
        {
            "onset": 39.0,
            "x": 2571.0359676148255
        },
        {
            "onset": 39.75,
            "x": 2604.568440985183
        },
        {
            "onset": 40.0,
            "x": 2640.2967079997566
        },
        {
            "onset": 40.5,
            "x": 2668.394295518782
        },
        {
            "onset": 41.0,
            "x": 2696.584645594882
        },
        {
            "onset": 41.5,
            "x": 2724.7749956709895
        },
        {
            "onset": 42.0,
            "x": 2752.965345747086
        },
        {
            "onset": 42.5,
            "x": 2771.2301859297336
        },
        {
            "onset": 43.0,
            "x": 2799.4205360058368
        },
        {
            "onset": 43.5,
            "x": 2827.610886081941
        },
        {
            "onset": 43.75,
            "x": 2846.66881606672
        },
        {
            "onset": 44.0,
            "x": 2877.2917651860957
        },
        {
            "onset": 44.5,
            "x": 2905.4821152622
        },
        {
            "onset": 44.75,
            "x": 2924.540045246979
        },
        {
            "onset": 45.0,
            "x": 2943.5979752317585
        },
        {
            "onset": 45.5,
            "x": 2971.7883253078617
        },
        {
            "onset": 45.75,
            "x": 2990.8462552926408
        },
        {
            "onset": 46.0,
            "x": 3009.7652550752055
        },
        {
            "onset": 46.5,
            "x": 3037.321409311629
        },
        {
            "onset": 47.0,
            "x": 3065.558069455145
        },
        {
            "onset": 47.75,
            "x": 3099.0905428255023
        },
        {
            "onset": 48.0,
            "x": 3126.9178055637803
        },
        {
            "onset": 48.5,
            "x": 3154.2738202771234
        },
        {
            "onset": 49.0,
            "x": 3182.464170353227
        },
        {
            "onset": 49.5,
            "x": 3210.6545204293307
        },
        {
            "onset": 50.0,
            "x": 3238.844870505434
        },
        {
            "onset": 50.5,
            "x": 3257.1097106880825
        },
        {
            "onset": 51.0,
            "x": 3285.3000607641857
        },
        {
            "onset": 51.5,
            "x": 3313.4904108402893
        },
        {
            "onset": 51.75,
            "x": 3332.548340825069
        },
        {
            "onset": 52.0,
            "x": 3360.3566628515905
        },
        {
            "onset": 52.5,
            "x": 3388.5470129276946
        },
        {
            "onset": 52.75,
            "x": 3407.6049429124737
        },
        {
            "onset": 53.0,
            "x": 3426.662872897253
        },
        {
            "onset": 53.5,
            "x": 3454.853222973357
        },
        {
            "onset": 53.75,
            "x": 3473.911152958135
        },
        {
            "onset": 54.0,
            "x": 3492.9690829429146
        },
        {
            "onset": 54.5,
            "x": 3521.1594330190187
        },
        {
            "onset": 55.0,
            "x": 3549.3497830951214
        },
        {
            "onset": 56.0,
            "x": 3595.5118918144117
        },
        {
            "onset": 56.5,
            "x": 3622.0034240315604
        },
        {
            "onset": 57.0,
            "x": 3650.193774107664
        },
        {
            "onset": 57.5,
            "x": 3678.384124183767
        },
        {
            "onset": 58.0,
            "x": 3706.5744742598713
        },
        {
            "onset": 58.5,
            "x": 3734.7648243359745
        },
        {
            "onset": 58.75,
            "x": 3753.8227543207536
        },
        {
            "onset": 59.0,
            "x": 3772.880684305532
        },
        {
            "onset": 59.5,
            "x": 3801.0710343816363
        },
        {
            "onset": 60.0,
            "x": 3840.667042136943
        },
        {
            "onset": 60.5,
            "x": 3868.6090563429307
        },
        {
            "onset": 61.0,
            "x": 3896.799406419034
        },
        {
            "onset": 61.5,
            "x": 3924.9897564951366
        },
        {
            "onset": 62.0,
            "x": 3953.18010657124
        },
        {
            "onset": 62.5,
            "x": 3981.370456647345
        },
        {
            "onset": 62.75,
            "x": 4000.4283866321234
        },
        {
            "onset": 63.0,
            "x": 4019.4863166169025
        },
        {
            "onset": 63.5,
            "x": 4037.7511567995507
        },
        {
            "onset": 64.0,
            "x": 4081.8672400060454
        },
        {
            "onset": 64.25,
            "x": 4100.676834120707
        },
        {
            "onset": 64.5,
            "x": 4119.734764105488
        },
        {
            "onset": 64.75,
            "x": 4138.792694090267
        },
        {
            "onset": 65.0,
            "x": 4157.850624075047
        },
        {
            "onset": 65.5,
            "x": 4186.040974151149
        },
        {
            "onset": 66.0,
            "x": 4214.231324227252
        },
        {
            "onset": 66.5,
            "x": 4242.421674303356
        },
        {
            "onset": 66.75,
            "x": 4261.479604288136
        },
        {
            "onset": 67.0,
            "x": 4280.537534272915
        },
        {
            "onset": 67.5,
            "x": 4308.7278843490185
        },
        {
            "onset": 68.0,
            "x": 4345.373365902979
        },
        {
            "onset": 68.5,
            "x": 4373.315380108966
        },
        {
            "onset": 69.0,
            "x": 4401.505730185068
        },
        {
            "onset": 69.5,
            "x": 4429.696080261172
        },
        {
            "onset": 70.0,
            "x": 4457.886430337275
        },
        {
            "onset": 70.5,
            "x": 4486.076780413379
        },
        {
            "onset": 70.75,
            "x": 4505.134710398159
        },
        {
            "onset": 71.0,
            "x": 4524.192640382938
        },
        {
            "onset": 71.5,
            "x": 4542.457480565586
        },
        {
            "onset": 72.0,
            "x": 4579.443314442519
        },
        {
            "onset": 72.25,
            "x": 4598.887104396857
        },
        {
            "onset": 72.5,
            "x": 4617.945034381637
        },
        {
            "onset": 72.75,
            "x": 4637.002964366417
        },
        {
            "onset": 73.0,
            "x": 4656.060894351195
        },
        {
            "onset": 73.5,
            "x": 4684.251244427298
        },
        {
            "onset": 74.0,
            "x": 4712.441594503402
        },
        {
            "onset": 74.5,
            "x": 4740.631944579506
        },
        {
            "onset": 74.75,
            "x": 4759.689874564285
        },
        {
            "onset": 75.0,
            "x": 4778.747804549065
        },
        {
            "onset": 75.5,
            "x": 4806.938154625169
        },
        {
            "onset": 76.0,
            "x": 4843.54821529053
        },
        {
            "onset": 76.5,
            "x": 4871.738565366629
        },
        {
            "onset": 77.0,
            "x": 4899.9289154427315
        },
        {
            "onset": 77.5,
            "x": 4928.119265518836
        },
        {
            "onset": 78.0,
            "x": 4956.379080696051
        },
        {
            "onset": 78.5,
            "x": 4984.569430772154
        },
        {
            "onset": 78.75,
            "x": 5003.627360756933
        },
        {
            "onset": 79.0,
            "x": 5022.685290741712
        },
        {
            "onset": 79.5,
            "x": 5050.875640817816
        },
        {
            "onset": 80.0,
            "x": 5088.426125270958
        },
        {
            "onset": 80.5,
            "x": 5115.533804114186
        },
        {
            "onset": 80.75,
            "x": 5134.591734098965
        },
        {
            "onset": 81.0,
            "x": 5153.649664083744
        },
        {
            "onset": 81.5,
            "x": 5181.840014159849
        },
        {
            "onset": 82.0,
            "x": 5209.891434033737
        },
        {
            "onset": 82.5,
            "x": 5238.081784109841
        },
        {
            "onset": 83.0,
            "x": 5266.272134185943
        },
        {
            "onset": 83.5,
            "x": 5292.559896743021
        },
        {
            "onset": 84.0,
            "x": 5330.664427003223
        },
        {
            "onset": 84.5,
            "x": 5356.677141361416
        },
        {
            "onset": 85.0,
            "x": 5386.770078956545
        },
        {
            "onset": 85.5,
            "x": 5414.960429032648
        },
        {
            "onset": 86.0,
            "x": 5443.150779108752
        },
        {
            "onset": 86.5,
            "x": 5471.341129184855
        },
        {
            "onset": 86.75,
            "x": 5490.399059169635
        },
        {
            "onset": 87.0,
            "x": 5509.456989154414
        },
        {
            "onset": 87.5,
            "x": 5537.647339230518
        },
        {
            "onset": 88.0,
            "x": 5574.438384385261
        },
        {
            "onset": 88.5,
            "x": 5602.380398591249
        },
        {
            "onset": 89.0,
            "x": 5630.570748667352
        },
        {
            "onset": 89.5,
            "x": 5658.761098743455
        },
        {
            "onset": 90.0,
            "x": 5686.951448819559
        },
        {
            "onset": 90.5,
            "x": 5716.093092655176
        },
        {
            "onset": 90.75,
            "x": 5735.151022639954
        },
        {
            "onset": 91.0,
            "x": 5754.208952624735
        },
        {
            "onset": 91.5,
            "x": 5782.399302700837
        },
        {
            "onset": 91.75,
            "x": 5801.457232685616
        },
        {
            "onset": 92.0,
            "x": 5832.117778601396
        },
        {
            "onset": 92.5,
            "x": 5859.967030250305
        },
        {
            "onset": 92.75,
            "x": 5879.024960235084
        },
        {
            "onset": 93.0,
            "x": 5898.082890219864
        },
        {
            "onset": 93.25,
            "x": 5917.140820204642
        },
        {
            "onset": 93.5,
            "x": 5936.198750189422
        },
        {
            "onset": 93.75,
            "x": 5953.354092655176
        },
        {
            "onset": 94.0,
            "x": 5971.738095699315
        },
        {
            "onset": 94.5,
            "x": 6002.504960235084
        },
        {
            "onset": 95.0,
            "x": 6030.695310311187
        },
        {
            "onset": 95.5,
            "x": 6058.885660387292
        },
        {
            "onset": 96.0,
            "x": 6098.75010004809
        },
        {
            "onset": 96.5,
            "x": 6126.847687567116
        },
        {
            "onset": 96.75,
            "x": 6145.905617551896
        },
        {
            "onset": 97.0,
            "x": 6164.963547536675
        },
        {
            "onset": 97.25,
            "x": 6184.021477521454
        },
        {
            "onset": 97.5,
            "x": 6203.079407506234
        },
        {
            "onset": 97.75,
            "x": 6220.234749971986
        },
        {
            "onset": 98.0,
            "x": 6239.292679956767
        },
        {
            "onset": 98.5,
            "x": 6269.385617551895
        },
        {
            "onset": 99.0,
            "x": 6297.575967627999
        },
        {
            "onset": 99.5,
            "x": 6325.766317704102
        },
        {
            "onset": 100.0,
            "x": 6362.380646906104
        },
        {
            "onset": 100.5,
            "x": 6390.47823442513
        },
        {
            "onset": 100.75,
            "x": 6409.536164409908
        },
        {
            "onset": 101.0,
            "x": 6428.594094394689
        },
        {
            "onset": 101.25,
            "x": 6447.652024379467
        },
        {
            "onset": 101.5,
            "x": 6466.709954364247
        },
        {
            "onset": 101.75,
            "x": 6483.865296829999
        },
        {
            "onset": 102.0,
            "x": 6503.2015144860125
        },
        {
            "onset": 102.5,
            "x": 6533.016164409908
        },
        {
            "onset": 103.0,
            "x": 6561.206514486012
        },
        {
            "onset": 103.5,
            "x": 6589.396864562115
        },
        {
            "onset": 104.0,
            "x": 6632.0639661059295
        },
        {
            "onset": 104.5,
            "x": 6660.068791067877
        },
        {
            "onset": 104.75,
            "x": 6679.126721052656
        },
        {
            "onset": 105.0,
            "x": 6698.46293870867
        },
        {
            "onset": 105.25,
            "x": 6717.242581022215
        },
        {
            "onset": 105.5,
            "x": 6736.3005110069935
        },
        {
            "onset": 105.75,
            "x": 6753.455853472755
        },
        {
            "onset": 106.0,
            "x": 6774.694658647789
        },
        {
            "onset": 106.5,
            "x": 6804.509308571691
        },
        {
            "onset": 107.0,
            "x": 6832.699658647785
        },
        {
            "onset": 107.5,
            "x": 6860.8900087238935
        },
        {
            "onset": 108.0,
            "x": 6903.320895873273
        },
        {
            "onset": 108.5,
            "x": 6931.418483392298
        },
        {
            "onset": 109.0,
            "x": 6959.608833468404
        },
        {
            "onset": 109.5,
            "x": 6987.7991835445055
        },
        {
            "onset": 110.0,
            "x": 7016.082296177688
        },
        {
            "onset": 110.5,
            "x": 7044.179883696712
        },
        {
            "onset": 111.0,
            "x": 7072.370233772816
        },
        {
            "onset": 111.5,
            "x": 7098.657996329894
        },
        {
            "onset": 112.0,
            "x": 7136.717224422953
        },
        {
            "onset": 112.5,
            "x": 7162.856174194647
        },
        {
            "onset": 113.0,
            "x": 7193.227399461009
        },
        {
            "onset": 113.5,
            "x": 7221.139461865875
        },
        {
            "onset": 114.0,
            "x": 7249.608099613212
        },
        {
            "onset": 114.5,
            "x": 7277.520162018085
        },
        {
            "onset": 114.75,
            "x": 7296.57809200287
        },
        {
            "onset": 115.0,
            "x": 7315.63602198765
        },
        {
            "onset": 115.5,
            "x": 7343.826372063744
        },
        {
            "onset": 116.0,
            "x": 7380.223517747589
        },
        {
            "onset": 116.5,
            "x": 7408.4138678237
        },
        {
            "onset": 117.0,
            "x": 7436.604217899803
        },
        {
            "onset": 117.5,
            "x": 7464.794567975899
        },
        {
            "onset": 118.0,
            "x": 7492.98491805201
        },
        {
            "onset": 118.5,
            "x": 7521.175268128105
        },
        {
            "onset": 118.75,
            "x": 7540.233198112884
        },
        {
            "onset": 119.0,
            "x": 7559.291128097669
        },
        {
            "onset": 119.5,
            "x": 7587.481478173775
        },
        {
            "onset": 120.0,
            "x": 7623.195202896539
        },
        {
            "onset": 120.5,
            "x": 7653.288140491668
        },
        {
            "onset": 121.0,
            "x": 7682.4297843272825
        },
        {
            "onset": 121.5,
            "x": 7710.620134403387
        },
        {
            "onset": 122.0,
            "x": 7738.879949580598
        },
        {
            "onset": 122.5,
            "x": 7767.070299656706
        },
        {
            "onset": 122.75,
            "x": 7786.128229641485
        },
        {
            "onset": 123.0,
            "x": 7805.186159626264
        },
        {
            "onset": 123.5,
            "x": 7833.37650970236
        },
        {
            "onset": 123.75,
            "x": 7852.434439687138
        },
        {
            "onset": 124.0,
            "x": 7879.722419682801
        },
        {
            "onset": 124.5,
            "x": 7907.912769758905
        },
        {
            "onset": 125.0,
            "x": 7936.103119835009
        },
        {
            "onset": 125.5,
            "x": 7964.293469911111
        },
        {
            "onset": 126.0,
            "x": 7992.622750189423
        },
        {
            "onset": 126.5,
            "x": 8020.8131002655255
        },
        {
            "onset": 126.75,
            "x": 8039.871030250304
        },
        {
            "onset": 127.0,
            "x": 8058.928960235085
        },
        {
            "onset": 127.5,
            "x": 8087.119310311187
        },
        {
            "onset": 128.0,
            "x": 8124.102247543965
        },
        {
            "onset": 128.5,
            "x": 8151.458262257306
        },
        {
            "onset": 128.75,
            "x": 8170.516192242087
        },
        {
            "onset": 129.0,
            "x": 8196.042919791555
        },
        {
            "onset": 129.5,
            "x": 8224.233269867656
        },
        {
            "onset": 130.0,
            "x": 8252.423619943758
        },
        {
            "onset": 130.5,
            "x": 8270.688460126408
        },
        {
            "onset": 131.0,
            "x": 8298.204883261871
        },
        {
            "onset": 131.5,
            "x": 8327.069160278617
        },
        {
            "onset": 132.0,
            "x": 8362.964018726103
        },
        {
            "onset": 132.5,
            "x": 8389.581591024431
        },
        {
            "onset": 133.0,
            "x": 8419.674528619558
        },
        {
            "onset": 133.5,
            "x": 8447.864878695662
        },
        {
            "onset": 134.0,
            "x": 8476.055228771767
        },
        {
            "onset": 134.5,
            "x": 8504.24557884787
        },
        {
            "onset": 134.75,
            "x": 8523.303508832647
        },
        {
            "onset": 135.0,
            "x": 8542.36143881743
        },
        {
            "onset": 135.5,
            "x": 8570.551788893532
        },
        {
            "onset": 135.75,
            "x": 8589.609718878311
        },
        {
            "onset": 136.0,
            "x": 8616.890752363852
        },
        {
            "onset": 136.5,
            "x": 8645.081102439955
        },
        {
            "onset": 136.75,
            "x": 8664.139032424735
        },
        {
            "onset": 137.0,
            "x": 8683.196962409513
        },
        {
            "onset": 137.5,
            "x": 8711.387312485615
        },
        {
            "onset": 138.0,
            "x": 8739.57766256172
        },
        {
            "onset": 138.5,
            "x": 8767.768012637824
        },
        {
            "onset": 138.75,
            "x": 8786.825942622601
        },
        {
            "onset": 139.0,
            "x": 8805.883872607383
        },
        {
            "onset": 139.5,
            "x": 8834.074222683486
        },
        {
            "onset": 140.0,
            "x": 8877.510335968951
        },
        {
            "onset": 140.5,
            "x": 8905.700686045053
        },
        {
            "onset": 140.75,
            "x": 8924.758616029832
        },
        {
            "onset": 141.0,
            "x": 8943.816546014612
        },
        {
            "onset": 141.5,
            "x": 8962.08138619726
        },
        {
            "onset": 141.75,
            "x": 8981.13931618204
        },
        {
            "onset": 142.0,
            "x": 9006.944331402741
        },
        {
            "onset": 142.5,
            "x": 9024.930883914156
        },
        {
            "onset": 142.75,
            "x": 9043.988813898935
        },
        {
            "onset": 143.0,
            "x": 9066.440960017657
        },
        {
            "onset": 143.5,
            "x": 9094.63131009376
        },
        {
            "onset": 143.75,
            "x": 9113.68924007854
        },
        {
            "onset": 144.0,
            "x": 9148.264731489726
        },
        {
            "onset": 144.5,
            "x": 9174.13992174848
        },
        {
            "onset": 145.0,
            "x": 9202.330271824583
        },
        {
            "onset": 145.5,
            "x": 9230.520621900685
        },
        {
            "onset": 146.0,
            "x": 9258.757282044216
        },
        {
            "onset": 146.5,
            "x": 9286.94763212032
        },
        {
            "onset": 146.75,
            "x": 9306.0055621051
        },
        {
            "onset": 147.0,
            "x": 9325.063492089877
        },
        {
            "onset": 147.5,
            "x": 9353.253842165983
        },
        {
            "onset": 148.0,
            "x": 9396.833407288814
        },
        {
            "onset": 148.5,
            "x": 9425.023757364917
        },
        {
            "onset": 149.0,
            "x": 9453.21410744102
        },
        {
            "onset": 149.5,
            "x": 9481.404457517121
        },
        {
            "onset": 150.0,
            "x": 9509.594807593227
        },
        {
            "onset": 150.5,
            "x": 9537.78515766933
        },
        {
            "onset": 150.75,
            "x": 9556.84308765411
        },
        {
            "onset": 151.0,
            "x": 9575.901017638891
        },
        {
            "onset": 151.5,
            "x": 9594.16585782154
        },
        {
            "onset": 152.0,
            "x": 9632.246447949847
        },
        {
            "onset": 152.5,
            "x": 9660.251272911797
        },
        {
            "onset": 153.0,
            "x": 9688.4416229879
        },
        {
            "onset": 153.5,
            "x": 9714.729385544977
        },
        {
            "onset": 154.0,
            "x": 9744.465801070091
        },
        {
            "onset": 154.5,
            "x": 9773.012673216212
        },
        {
            "onset": 155.0,
            "x": 9801.203023292313
        },
        {
            "onset": 155.5,
            "x": 9828.442079608903
        },
        {
            "onset": 156.0,
            "x": 9866.475200504721
        },
        {
            "onset": 156.5,
            "x": 9894.572788023745
        },
        {
            "onset": 157.0,
            "x": 9922.763138099848
        },
        {
            "onset": 157.5,
            "x": 9949.050900656925
        },
        {
            "onset": 158.0,
            "x": 9978.28530704962
        },
        {
            "onset": 158.5,
            "x": 10006.382894568722
        },
        {
            "onset": 159.0,
            "x": 10034.573244644824
        },
        {
            "onset": 159.5,
            "x": 10060.861007201904
        },
        {
            "onset": 160.0,
            "x": 10104.895550943253
        },
        {
            "onset": 160.5,
            "x": 10132.83756514924
        },
        {
            "onset": 160.75,
            "x": 10151.895495134018
        },
        {
            "onset": 161.0,
            "x": 10170.953425118798
        },
        {
            "onset": 161.5,
            "x": 10199.143775194902
        },
        {
            "onset": 162.0,
            "x": 10227.612412942239
        },
        {
            "onset": 162.5,
            "x": 10245.598965453652
        },
        {
            "onset": 163.0,
            "x": 10273.789315529757
        },
        {
            "onset": 163.5,
            "x": 10300.077078086835
        },
        {
            "onset": 164.0,
            "x": 10336.350889060224
        },
        {
            "onset": 164.5,
            "x": 10364.742187893304
        },
        {
            "onset": 164.75,
            "x": 10383.800117878081
        },
        {
            "onset": 165.0,
            "x": 10402.858047862861
        },
        {
            "onset": 165.5,
            "x": 10431.048397938965
        },
        {
            "onset": 166.0,
            "x": 10459.23874801507
        },
        {
            "onset": 166.5,
            "x": 10487.429098091174
        },
        {
            "onset": 167.0,
            "x": 10515.619448167276
        },
        {
            "onset": 167.5,
            "x": 10541.907210724354
        },
        {
            "onset": 168.0,
            "x": 10581.518920153983
        },
        {
            "onset": 168.5,
            "x": 10609.460934359971
        },
        {
            "onset": 168.75,
            "x": 10628.518864344749
        },
        {
            "onset": 169.0,
            "x": 10647.576794329529
        },
        {
            "onset": 169.5,
            "x": 10675.767144405634
        },
        {
            "onset": 170.0,
            "x": 10703.957494481736
        },
        {
            "onset": 170.5,
            "x": 10732.147844557838
        },
        {
            "onset": 171.0,
            "x": 10760.338194633941
        },
        {
            "onset": 171.5,
            "x": 10787.577250950533
        },
        {
            "onset": 172.0,
            "x": 10824.660226597362
        },
        {
            "onset": 172.5,
            "x": 10852.602240803388
        },
        {
            "onset": 172.75,
            "x": 10871.660170788206
        },
        {
            "onset": 173.0,
            "x": 10890.718100772983
        },
        {
            "onset": 173.5,
            "x": 10918.908450849087
        },
        {
            "onset": 174.0,
            "x": 10947.09880092519
        },
        {
            "onset": 174.5,
            "x": 10975.289151001294
        },
        {
            "onset": 174.75,
            "x": 10994.347080986074
        },
        {
            "onset": 175.0,
            "x": 11013.405010970853
        },
        {
            "onset": 175.5,
            "x": 11041.595361046957
        },
        {
            "onset": 176.0,
            "x": 11078.85002177027
        },
        {
            "onset": 176.5,
            "x": 11106.699273419179
        },
        {
            "onset": 176.75,
            "x": 11125.757203403959
        },
        {
            "onset": 177.0,
            "x": 11144.815133388738
        },
        {
            "onset": 177.5,
            "x": 11173.005483464842
        },
        {
            "onset": 178.0,
            "x": 11201.195833540944
        },
        {
            "onset": 178.5,
            "x": 11229.386183617047
        },
        {
            "onset": 178.75,
            "x": 11248.444113601827
        },
        {
            "onset": 179.0,
            "x": 11267.502043586604
        },
        {
            "onset": 179.5,
            "x": 11295.69239366271
        },
        {
            "onset": 180.0,
            "x": 11339.645456828615
        },
        {
            "onset": 180.5,
            "x": 11367.835806904719
        },
        {
            "onset": 181.0,
            "x": 11396.165300816438
        },
        {
            "onset": 181.5,
            "x": 11422.313919537899
        },
        {
            "onset": 182.0,
            "x": 11452.40685713303
        },
        {
            "onset": 182.5,
            "x": 11480.597207209134
        },
        {
            "onset": 182.75,
            "x": 11499.655137193911
        },
        {
            "onset": 183.0,
            "x": 11518.71306717869
        },
        {
            "onset": 183.5,
            "x": 11546.903417254796
        },
        {
            "onset": 184.0,
            "x": 11583.100490640336
        },
        {
            "onset": 184.5,
            "x": 11611.29084071644
        },
        {
            "onset": 185.0,
            "x": 11639.481190792541
        },
        {
            "onset": 185.5,
            "x": 11665.768953349621
        },
        {
            "onset": 186.0,
            "x": 11696.001034780365
        },
        {
            "onset": 186.5,
            "x": 11723.10094726134
        },
        {
            "onset": 186.75,
            "x": 11742.15887724612
        },
        {
            "onset": 187.0,
            "x": 11761.216807230898
        },
        {
            "onset": 187.5,
            "x": 11789.407157307003
        },
        {
            "onset": 188.0,
            "x": 11826.206255408017
        },
        {
            "onset": 188.5,
            "x": 11854.055507056928
        },
        {
            "onset": 189.0,
            "x": 11882.24585713303
        },
        {
            "onset": 189.5,
            "x": 11908.533619690108
        },
        {
            "onset": 190.0,
            "x": 11938.626557285237
        },
        {
            "onset": 190.5,
            "x": 11966.816907361339
        },
        {
            "onset": 190.75,
            "x": 11985.87483734612
        },
        {
            "onset": 191.0,
            "x": 12004.932767330896
        },
        {
            "onset": 191.5,
            "x": 12033.123117407002
        },
        {
            "onset": 192.0,
            "x": 12076.324166729351
        },
        {
            "onset": 192.5,
            "x": 12103.587418885618
        },
        {
            "onset": 193.0,
            "x": 12131.77776896172
        },
        {
            "onset": 193.5,
            "x": 12158.065531518798
        },
        {
            "onset": 194.0,
            "x": 12186.255881594901
        },
        {
            "onset": 194.5,
            "x": 12214.446231671003
        },
        {
            "onset": 194.75,
            "x": 12233.504161655785
        },
        {
            "onset": 195.0,
            "x": 12252.562091640564
        },
        {
            "onset": 195.5,
            "x": 12280.752441716668
        },
        {
            "onset": 196.0,
            "x": 12318.792056959133
        },
        {
            "onset": 196.5,
            "x": 12346.889644478159
        },
        {
            "onset": 197.0,
            "x": 12375.079994554262
        },
        {
            "onset": 197.5,
            "x": 12401.36775711134
        },
        {
            "onset": 198.0,
            "x": 12431.460694706468
        },
        {
            "onset": 198.5,
            "x": 12459.651044782573
        },
        {
            "onset": 198.75,
            "x": 12478.708974767353
        },
        {
            "onset": 199.0,
            "x": 12497.766904752132
        },
        {
            "onset": 199.5,
            "x": 12525.957254828236
        },
        {
            "onset": 200.0,
            "x": 12569.794498250685
        },
        {
            "onset": 200.5,
            "x": 12597.706560655555
        },
        {
            "onset": 201.0,
            "x": 12625.89691073166
        },
        {
            "onset": 201.5,
            "x": 12652.184673288737
        },
        {
            "onset": 202.0,
            "x": 12682.789258524659
        },
        {
            "onset": 202.5,
            "x": 12710.46796095997
        },
        {
            "onset": 202.75,
            "x": 12729.52589094475
        },
        {
            "onset": 203.0,
            "x": 12748.583820929527
        },
        {
            "onset": 203.5,
            "x": 12776.774171005633
        },
        {
            "onset": 204.0,
            "x": 12813.107746927955
        },
        {
            "onset": 204.5,
            "x": 12840.956998576863
        },
        {
            "onset": 205.0,
            "x": 12869.147348652969
        },
        {
            "onset": 205.5,
            "x": 12895.435111210047
        },
        {
            "onset": 206.0,
            "x": 12925.806336476408
        },
        {
            "onset": 206.5,
            "x": 12953.718398881281
        },
        {
            "onset": 206.75,
            "x": 12972.77632886606
        },
        {
            "onset": 207.0,
            "x": 12991.834258850839
        },
        {
            "onset": 207.5,
            "x": 13021.927196445966
        },
        {
            "onset": 208.0,
            "x": 13061.113755263092
        },
        {
            "onset": 208.5,
            "x": 13089.025817667962
        },
        {
            "onset": 209.0,
            "x": 13117.216167744065
        },
        {
            "onset": 209.5,
            "x": 13143.503930301142
        },
        {
            "onset": 210.0,
            "x": 13173.59686789627
        },
        {
            "onset": 210.5,
            "x": 13201.787217972376
        },
        {
            "onset": 210.75,
            "x": 13220.845147957154
        },
        {
            "onset": 211.0,
            "x": 13239.903077941932
        },
        {
            "onset": 211.5,
            "x": 13268.093428018037
        },
        {
            "onset": 212.0,
            "x": 13304.222903012633
        },
        {
            "onset": 212.5,
            "x": 13332.32049053166
        },
        {
            "onset": 213.0,
            "x": 13360.510840607762
        },
        {
            "onset": 213.5,
            "x": 13386.798603164842
        },
        {
            "onset": 214.0,
            "x": 13417.030684595584
        },
        {
            "onset": 214.5,
            "x": 13445.081890836076
        },
        {
            "onset": 214.75,
            "x": 13464.139820820852
        },
        {
            "onset": 215.0,
            "x": 13483.197750805632
        },
        {
            "onset": 215.5,
            "x": 13511.388100881735
        },
        {
            "onset": 216.0,
            "x": 13547.732852784326
        },
        {
            "onset": 216.5,
            "x": 13575.644915189196
        },
        {
            "onset": 217.0,
            "x": 13603.835265265297
        },
        {
            "onset": 217.5,
            "x": 13630.123027822374
        },
        {
            "onset": 218.0,
            "x": 13660.557063844699
        },
        {
            "onset": 218.5,
            "x": 13688.406315493608
        },
        {
            "onset": 218.75,
            "x": 13707.464245478388
        },
        {
            "onset": 219.0,
            "x": 13726.522175463166
        },
        {
            "onset": 219.5,
            "x": 13754.712525539271
        },
        {
            "onset": 220.0,
            "x": 13791.598700069964
        },
        {
            "onset": 220.5,
            "x": 13819.54071427595
        },
        {
            "onset": 221.0,
            "x": 13847.731064352056
        },
        {
            "onset": 221.5,
            "x": 13874.018826909132
        },
        {
            "onset": 222.0,
            "x": 13903.43530005548
        },
        {
            "onset": 222.5,
            "x": 13931.625650131586
        },
        {
            "onset": 222.75,
            "x": 13950.683580116362
        },
        {
            "onset": 223.0,
            "x": 13969.741510101141
        },
        {
            "onset": 223.5,
            "x": 13997.931860177247
        },
        {
            "onset": 224.0,
            "x": 14042.662791357914
        },
        {
            "onset": 224.5,
            "x": 14070.853141434018
        },
        {
            "onset": 225.0,
            "x": 14099.043491510123
        },
        {
            "onset": 225.5,
            "x": 14125.3312540672
        },
        {
            "onset": 226.0,
            "x": 14155.424191662329
        },
        {
            "onset": 226.5,
            "x": 14183.614541738434
        },
        {
            "onset": 226.75,
            "x": 14202.67247172321
        },
        {
            "onset": 227.0,
            "x": 14221.730401707991
        },
        {
            "onset": 227.5,
            "x": 14251.823339303122
        },
        {
            "onset": 228.0,
            "x": 14297.66129211895
        },
        {
            "onset": 230.0,
            "x": 14340.822197750607
        },
        {
            "onset": 231.0,
            "x": 14376.797114036757
        },
        {
            "onset": 232.0,
            "x": 14424.802652124761
        },
        {
            "onset": 232.5,
            "x": 14450.815366482957
        },
        {
            "onset": 233.0,
            "x": 14480.908304078084
        },
        {
            "onset": 233.5,
            "x": 14509.09865415419
        },
        {
            "onset": 234.0,
            "x": 14537.289004230292
        },
        {
            "onset": 234.5,
            "x": 14565.479354306395
        },
        {
            "onset": 234.75,
            "x": 14584.537284291173
        },
        {
            "onset": 235.0,
            "x": 14603.595214275952
        },
        {
            "onset": 235.5,
            "x": 14631.785564352058
        },
        {
            "onset": 236.0,
            "x": 14668.291221378948
        },
        {
            "onset": 237.0,
            "x": 14704.414361916743
        },
        {
            "onset": 237.5,
            "x": 14732.604711992848
        },
        {
            "onset": 238.0,
            "x": 14760.79506206895
        },
        {
            "onset": 238.5,
            "x": 14789.936705904569
        },
        {
            "onset": 238.75,
            "x": 14808.994635889345
        },
        {
            "onset": 239.0,
            "x": 14828.052565874123
        },
        {
            "onset": 240.0,
            "x": 14873.95927106365
        },
        {
            "onset": 240.5,
            "x": 14901.901285269636
        },
        {
            "onset": 241.0,
            "x": 14930.09163534574
        },
        {
            "onset": 241.5,
            "x": 14958.281985421843
        },
        {
            "onset": 242.0,
            "x": 14986.54180059909
        },
        {
            "onset": 242.5,
            "x": 15014.732150675192
        },
        {
            "onset": 243.0,
            "x": 15042.922500751294
        },
        {
            "onset": 243.5,
            "x": 15071.112850827398
        },
        {
            "onset": 244.0,
            "x": 15107.68484419551
        },
        {
            "onset": 244.5,
            "x": 15133.853131866743
        },
        {
            "onset": 245.0,
            "x": 15163.946069461872
        },
        {
            "onset": 245.5,
            "x": 15192.136419537976
        },
        {
            "onset": 246.0,
            "x": 15220.326769614081
        },
        {
            "onset": 246.5,
            "x": 15248.517119690183
        },
        {
            "onset": 246.75,
            "x": 15267.575049674962
        },
        {
            "onset": 247.0,
            "x": 15286.632979659744
        },
        {
            "onset": 247.5,
            "x": 15314.823329735846
        },
        {
            "onset": 248.0,
            "x": 15350.727313210506
        },
        {
            "onset": 249.0,
            "x": 15388.05008337793
        },
        {
            "onset": 249.5,
            "x": 15416.240433454033
        },
        {
            "onset": 250.0,
            "x": 15444.430783530139
        },
        {
            "onset": 250.5,
            "x": 15473.572427365756
        },
        {
            "onset": 250.75,
            "x": 15492.630357350532
        },
        {
            "onset": 251.0,
            "x": 15511.688287335312
        },
        {
            "onset": 251.5,
            "x": 15537.563477594065
        },
        {
            "onset": 252.0,
            "x": 15575.2891153414
        },
        {
            "onset": 252.5,
            "x": 15603.479465417504
        },
        {
            "onset": 253.0,
            "x": 15631.66981549361
        },
        {
            "onset": 253.5,
            "x": 15659.860165569711
        },
        {
            "onset": 254.0,
            "x": 15688.050515645817
        },
        {
            "onset": 254.5,
            "x": 15716.240865721918
        },
        {
            "onset": 255.0,
            "x": 15744.431215798022
        },
        {
            "onset": 255.5,
            "x": 15772.621565874124
        },
        {
            "onset": 256.0,
            "x": 15817.030115558828
        },
        {
            "onset": 256.5,
            "x": 15845.220465634933
        },
        {
            "onset": 257.0,
            "x": 15873.410815711035
        },
        {
            "onset": 257.5,
            "x": 15901.60116578714
        },
        {
            "onset": 258.0,
            "x": 15929.43499379329
        },
        {
            "onset": 258.5,
            "x": 15957.981865939384
        },
        {
            "onset": 258.75,
            "x": 15977.039795924124
        },
        {
            "onset": 259.0,
            "x": 15996.097725908907
        },
        {
            "onset": 259.5,
            "x": 16024.288075985047
        },
        {
            "onset": 260.0,
            "x": 16061.031404897134
        },
        {
            "onset": 260.5,
            "x": 16086.658259285769
        },
        {
            "onset": 261.0,
            "x": 16116.7511968809
        },
        {
            "onset": 261.5,
            "x": 16144.941546957005
        },
        {
            "onset": 262.0,
            "x": 16173.131897033107
        },
        {
            "onset": 262.5,
            "x": 16201.322247109209
        },
        {
            "onset": 262.75,
            "x": 16220.380177093988
        },
        {
            "onset": 263.0,
            "x": 16239.438107078768
        },
        {
            "onset": 263.5,
            "x": 16267.628457154873
        },
        {
            "onset": 264.0,
            "x": 16311.208022277702
        },
        {
            "onset": 264.5,
            "x": 16339.398372353806
        },
        {
            "onset": 265.0,
            "x": 16367.588722429908
        },
        {
            "onset": 265.5,
            "x": 16395.77907250601
        },
        {
            "onset": 266.0,
            "x": 16423.969422582115
        },
        {
            "onset": 266.5,
            "x": 16453.111066417732
        },
        {
            "onset": 266.75,
            "x": 16472.168996402514
        },
        {
            "onset": 267.0,
            "x": 16491.22692638729
        },
        {
            "onset": 267.5,
            "x": 16509.49176656994
        },
        {
            "onset": 268.0,
            "x": 16547.759633425067
        },
        {
            "onset": 268.5,
            "x": 16575.60888507397
        },
        {
            "onset": 269.0,
            "x": 16603.799235150076
        },
        {
            "onset": 269.5,
            "x": 16631.98958522618
        },
        {
            "onset": 270.0,
            "x": 16659.97898654531
        },
        {
            "onset": 270.5,
            "x": 16688.370285378387
        },
        {
            "onset": 270.75,
            "x": 16707.42821536317
        },
        {
            "onset": 271.0,
            "x": 16726.486145347946
        },
        {
            "onset": 271.25,
            "x": 16745.544075332728
        },
        {
            "onset": 271.5,
            "x": 16764.602005317505
        },
        {
            "onset": 271.75,
            "x": 16781.75734778326
        },
        {
            "onset": 272.0,
            "x": 16809.245392575573
        },
        {
            "onset": 272.5,
            "x": 16835.41368024688
        },
        {
            "onset": 273.0,
            "x": 16865.506617841973
        },
        {
            "onset": 273.5,
            "x": 16893.696967918077
        },
        {
            "onset": 274.0,
            "x": 16922.13565386426
        },
        {
            "onset": 274.5,
            "x": 16950.07766807032
        },
        {
            "onset": 274.75,
            "x": 16969.1355980551
        },
        {
            "onset": 275.0,
            "x": 16988.193528039843
        },
        {
            "onset": 275.5,
            "x": 17016.383878115907
        },
        {
            "onset": 276.0,
            "x": 17060.58474388389
        },
        {
            "onset": 276.5,
            "x": 17088.526758089884
        },
        {
            "onset": 277.0,
            "x": 17116.717108165984
        },
        {
            "onset": 277.5,
            "x": 17144.907458242087
        },
        {
            "onset": 278.0,
            "x": 17172.717988792163
        },
        {
            "onset": 278.5,
            "x": 17202.30891725487
        },
        {
            "onset": 278.75,
            "x": 17221.366847239653
        },
        {
            "onset": 279.0,
            "x": 17240.42477722443
        },
        {
            "onset": 280.0,
            "x": 17286.284500805632
        },
        {
            "onset": 280.5,
            "x": 17312.57226336271
        },
        {
            "onset": 281.0,
            "x": 17342.66520095784
        },
        {
            "onset": 281.5,
            "x": 17370.855551033943
        },
        {
            "onset": 282.0,
            "x": 17399.045901110047
        },
        {
            "onset": 282.5,
            "x": 17427.23625118615
        },
        {
            "onset": 282.75,
            "x": 17446.29418117093
        },
        {
            "onset": 283.0,
            "x": 17465.35211115571
        },
        {
            "onset": 283.5,
            "x": 17493.542461231813
        },
        {
            "onset": 284.0,
            "x": 17537.12202635472
        },
        {
            "onset": 284.5,
            "x": 17565.312376430822
        },
        {
            "onset": 285.0,
            "x": 17593.502726506922
        },
        {
            "onset": 285.5,
            "x": 17621.693076583026
        },
        {
            "onset": 286.0,
            "x": 17649.883426659133
        },
        {
            "onset": 286.5,
            "x": 17679.02507049475
        },
        {
            "onset": 286.75,
            "x": 17698.083000479528
        },
        {
            "onset": 287.0,
            "x": 17717.14093046431
        },
        {
            "onset": 287.5,
            "x": 17745.331280540413
        },
        {
            "onset": 287.75,
            "x": 17764.389210525194
        },
        {
            "onset": 288.0,
            "x": 17798.93752211461
        },
        {
            "onset": 288.25,
            "x": 17817.995452099396
        },
        {
            "onset": 288.5,
            "x": 17837.053382084174
        },
        {
            "onset": 288.75,
            "x": 17856.11131206895
        },
        {
            "onset": 289.0,
            "x": 17875.030311851522
        },
        {
            "onset": 289.5,
            "x": 17893.29515203417
        },
        {
            "onset": 290.0,
            "x": 17921.624645945893
        },
        {
            "onset": 290.5,
            "x": 17949.675852186378
        },
        {
            "onset": 290.75,
            "x": 17968.73378217116
        },
        {
            "onset": 291.0,
            "x": 17994.26050972063
        },
        {
            "onset": 292.0,
            "x": 18041.115037081687
        },
        {
            "onset": 292.5,
            "x": 18070.008345047187
        },
        {
            "onset": 293.0,
            "x": 18099.1499888828
        },
        {
            "onset": 293.5,
            "x": 18127.340338958904
        },
        {
            "onset": 294.0,
            "x": 18155.669619237215
        },
        {
            "onset": 294.5,
            "x": 18183.85996931332
        },
        {
            "onset": 294.75,
            "x": 18202.9178992981
        },
        {
            "onset": 295.0,
            "x": 18221.975829282877
        },
        {
            "onset": 295.5,
            "x": 18250.16617935898
        },
        {
            "onset": 296.0,
            "x": 18294.36704512689
        },
        {
            "onset": 296.5,
            "x": 18322.309059332878
        },
        {
            "onset": 297.0,
            "x": 18350.499409408978
        },
        {
            "onset": 297.5,
            "x": 18378.689759485085
        },
        {
            "onset": 298.0,
            "x": 18406.949574662252
        },
        {
            "onset": 298.5,
            "x": 18436.091218497906
        },
        {
            "onset": 298.75,
            "x": 18455.14914848265
        },
        {
            "onset": 299.0,
            "x": 18474.20707846743
        },
        {
            "onset": 299.5,
            "x": 18492.47191865008
        },
        {
            "onset": 300.0,
            "x": 18537.323592927092
        },
        {
            "onset": 300.5,
            "x": 18563.584643155406
        },
        {
            "onset": 301.0,
            "x": 18591.77499323151
        },
        {
            "onset": 301.5,
            "x": 18619.96534330765
        },
        {
            "onset": 302.0,
            "x": 18648.15569338375
        },
        {
            "onset": 302.5,
            "x": 18676.34604345982
        },
        {
            "onset": 302.75,
            "x": 18695.403973444598
        },
        {
            "onset": 303.0,
            "x": 18717.856119563396
        },
        {
            "onset": 303.5,
            "x": 18746.0464696395
        },
        {
            "onset": 303.75,
            "x": 18765.10439962428
        },
        {
            "onset": 304.0,
            "x": 18792.113634892772
        },
        {
            "onset": 304.5,
            "x": 18820.303984968872
        },
        {
            "onset": 304.75,
            "x": 18839.361914953653
        },
        {
            "onset": 305.0,
            "x": 18858.419844938435
        },
        {
            "onset": 305.5,
            "x": 18886.610195014535
        },
        {
            "onset": 305.75,
            "x": 18905.668124999316
        },
        {
            "onset": 306.0,
            "x": 18924.726054984094
        },
        {
            "onset": 306.25,
            "x": 18943.78398496888
        },
        {
            "onset": 306.5,
            "x": 18967.94092560814
        },
        {
            "onset": 306.75,
            "x": 18986.998855592923
        },
        {
            "onset": 307.0,
            "x": 19006.056785577704
        },
        {
            "onset": 307.5,
            "x": 19034.247135653804
        },
        {
            "onset": 308.0,
            "x": 19070.572195014538
        },
        {
            "onset": 308.5,
            "x": 19096.896669900383
        },
        {
            "onset": 309.0,
            "x": 19126.98960749551
        },
        {
            "onset": 309.5,
            "x": 19155.179957571614
        },
        {
            "onset": 310.0,
            "x": 19183.370307647718
        },
        {
            "onset": 310.5,
            "x": 19211.56065772382
        },
        {
            "onset": 310.75,
            "x": 19230.6185877086
        },
        {
            "onset": 311.0,
            "x": 19249.676517693377
        },
        {
            "onset": 311.5,
            "x": 19277.866867769484
        },
        {
            "onset": 312.0,
            "x": 19314.26401345335
        },
        {
            "onset": 313.0,
            "x": 19351.11113674102
        },
        {
            "onset": 313.5,
            "x": 19379.301486817123
        },
        {
            "onset": 314.0,
            "x": 19407.491836893227
        },
        {
            "onset": 314.5,
            "x": 19436.633480728844
        },
        {
            "onset": 314.75,
            "x": 19455.69141071362
        },
        {
            "onset": 315.0,
            "x": 19474.749340698403
        },
        {
            "onset": 315.5,
            "x": 19502.939690774507
        },
        {
            "onset": 316.0,
            "x": 19548.185205016744
        },
        {
            "onset": 316.5,
            "x": 19576.28279253577
        },
        {
            "onset": 317.0,
            "x": 19604.473142611878
        },
        {
            "onset": 317.5,
            "x": 19632.66349268798
        },
        {
            "onset": 318.0,
            "x": 19660.404558136983
        },
        {
            "onset": 318.5,
            "x": 19689.044192840185
        },
        {
            "onset": 319.0,
            "x": 19717.234542916285
        },
        {
            "onset": 319.5,
            "x": 19745.424892992392
        },
        {
            "onset": 320.0,
            "x": 19784.518689252433
        },
        {
            "onset": 320.5,
            "x": 19810.208354397033
        },
        {
            "onset": 321.0,
            "x": 19840.30129199216
        },
        {
            "onset": 321.5,
            "x": 19868.491642068264
        },
        {
            "onset": 322.0,
            "x": 19896.325470074356
        },
        {
            "onset": 322.5,
            "x": 19924.87234222047
        },
        {
            "onset": 322.75,
            "x": 19943.930272205253
        },
        {
            "onset": 323.0,
            "x": 19962.98820219003
        },
        {
            "onset": 323.5,
            "x": 19991.178552266134
        },
        {
            "onset": 324.0,
            "x": 20034.758117388967
        },
        {
            "onset": 324.5,
            "x": 20062.94846746507
        },
        {
            "onset": 325.0,
            "x": 20091.27796137679
        },
        {
            "onset": 325.5,
            "x": 20119.329167617278
        },
        {
            "onset": 326.0,
            "x": 20146.845590752742
        },
        {
            "onset": 326.5,
            "x": 20176.661161528995
        },
        {
            "onset": 326.75,
            "x": 20195.719091513776
        },
        {
            "onset": 327.0,
            "x": 20214.777021498554
        },
        {
            "onset": 327.5,
            "x": 20242.96737157466
        },
        {
            "onset": 328.0,
            "x": 20287.210640401197
        },
        {
            "onset": 328.5,
            "x": 20314.566655114537
        },
        {
            "onset": 329.0,
            "x": 20332.831495297185
        },
        {
            "onset": 329.5,
            "x": 20351.096335479833
        },
        {
            "onset": 330.0,
            "x": 20379.286685555937
        },
        {
            "onset": 330.5,
            "x": 20397.551525738585
        },
        {
            "onset": 331.0,
            "x": 20415.816365921237
        },
        {
            "onset": 331.5,
            "x": 20434.081206103885
        },
        {
            "onset": 332.0,
            "x": 20471.42098388166
        },
        {
            "onset": 332.5,
            "x": 20497.68203410997
        },
        {
            "onset": 333.0,
            "x": 20527.7749717051
        },
        {
            "onset": 333.5,
            "x": 20555.965321781205
        },
        {
            "onset": 334.0,
            "x": 20584.155671857305
        },
        {
            "onset": 334.5,
            "x": 20612.34602193341
        },
        {
            "onset": 334.75,
            "x": 20631.40395191823
        },
        {
            "onset": 335.0,
            "x": 20650.46188190297
        },
        {
            "onset": 335.5,
            "x": 20678.65223197907
        },
        {
            "onset": 336.0,
            "x": 20714.81442375993
        },
        {
            "onset": 336.5,
            "x": 20741.10218631701
        },
        {
            "onset": 337.0,
            "x": 20769.292536393154
        },
        {
            "onset": 337.5,
            "x": 20797.482886469257
        },
        {
            "onset": 338.0,
            "x": 20825.673236545357
        },
        {
            "onset": 338.5,
            "x": 20852.912292861947
        },
        {
            "onset": 338.75,
            "x": 20871.970222846732
        },
        {
            "onset": 339.0,
            "x": 20891.02815283151
        },
        {
            "onset": 340.0,
            "x": 20937.33218696933
        },
        {
            "onset": 340.5,
            "x": 20963.50047464056
        },
        {
            "onset": 341.0,
            "x": 20993.593412235692
        },
        {
            "onset": 341.5,
            "x": 21021.783762311796
        },
        {
            "onset": 341.75,
            "x": 21040.841692296577
        },
        {
            "onset": 342.0,
            "x": 21060.147958151472
        },
        {
            "onset": 342.5,
            "x": 21088.08997235746
        },
        {
            "onset": 342.75,
            "x": 21107.147902342236
        },
        {
            "onset": 343.0,
            "x": 21126.20583232702
        },
        {
            "onset": 343.5,
            "x": 21154.396182403125
        },
        {
            "onset": 343.75,
            "x": 21173.454112387903
        },
        {
            "onset": 344.0,
            "x": 21200.84697641631
        },
        {
            "onset": 344.5,
            "x": 21228.7889906223
        },
        {
            "onset": 344.75,
            "x": 21247.84692060708
        },
        {
            "onset": 345.0,
            "x": 21266.904850591858
        },
        {
            "onset": 345.5,
            "x": 21295.09520066796
        },
        {
            "onset": 345.75,
            "x": 21314.15313065274
        },
        {
            "onset": 346.0,
            "x": 21333.21106063752
        },
        {
            "onset": 346.5,
            "x": 21361.40141071362
        },
        {
            "onset": 346.75,
            "x": 21380.459340698406
        },
        {
            "onset": 347.0,
            "x": 21399.51727068318
        },
        {
            "onset": 347.5,
            "x": 21427.707620759284
        },
        {
            "onset": 348.0,
            "x": 21463.24597757595
        },
        {
            "onset": 348.5,
            "x": 21489.507027804262
        },
        {
            "onset": 349.0,
            "x": 21519.59996539939
        },
        {
            "onset": 349.5,
            "x": 21547.790315475497
        },
        {
            "onset": 350.0,
            "x": 21575.9806655516
        },
        {
            "onset": 350.5,
            "x": 21604.80521146743
        },
        {
            "onset": 350.75,
            "x": 21623.86314145221
        },
        {
            "onset": 351.0,
            "x": 21642.92107143699
        },
        {
            "onset": 351.5,
            "x": 21671.111421513095
        },
        {
            "onset": 352.0,
            "x": 21713.72647134272
        },
        {
            "onset": 352.5,
            "x": 21741.575722991627
        },
        {
            "onset": 352.75,
            "x": 21760.63365297641
        },
        {
            "onset": 353.0,
            "x": 21779.691582961186
        },
        {
            "onset": 353.5,
            "x": 21807.88193303729
        },
        {
            "onset": 354.0,
            "x": 21836.0042241151
        },
        {
            "onset": 354.5,
            "x": 21863.174518381966
        },
        {
            "onset": 354.75,
            "x": 21882.232448366743
        },
        {
            "onset": 355.0,
            "x": 21901.29037835152
        },
        {
            "onset": 355.5,
            "x": 21929.480728427625
        },
        {
            "onset": 356.0,
            "x": 21966.693411981985
        },
        {
            "onset": 356.5,
            "x": 21993.591369871385
        },
        {
            "onset": 356.75,
            "x": 22012.649299856166
        },
        {
            "onset": 357.0,
            "x": 22031.707229840944
        },
        {
            "onset": 357.5,
            "x": 22059.89757991705
        },
        {
            "onset": 358.0,
            "x": 22087.950405893713
        },
        {
            "onset": 358.5,
            "x": 22115.506560130136
        },
        {
            "onset": 358.75,
            "x": 22134.564490114917
        },
        {
            "onset": 359.0,
            "x": 22153.6224200997
        },
        {
            "onset": 359.5,
            "x": 22181.812770175802
        },
        {
            "onset": 360.0,
            "x": 22223.94919747887
        },
        {
            "onset": 360.5,
            "x": 22251.5053517153
        },
        {
            "onset": 360.75,
            "x": 22270.563281700077
        },
        {
            "onset": 361.0,
            "x": 22289.62121168486
        },
        {
            "onset": 361.5,
            "x": 22317.811561760962
        },
        {
            "onset": 362.0,
            "x": 22346.14105567268
        },
        {
            "onset": 362.5,
            "x": 22373.034682004494
        },
        {
            "onset": 362.75,
            "x": 22392.09261198927
        },
        {
            "onset": 363.0,
            "x": 22411.15054197405
        },
        {
            "onset": 363.5,
            "x": 22439.340892050153
        },
        {
            "onset": 364.0,
            "x": 22475.98008136662
        },
        {
            "onset": 364.5,
            "x": 22503.829333015525
        },
        {
            "onset": 364.75,
            "x": 22522.887263000302
        },
        {
            "onset": 365.0,
            "x": 22541.945192985084
        },
        {
            "onset": 365.5,
            "x": 22570.135543061187
        },
        {
            "onset": 366.0,
            "x": 22598.325893137295
        },
        {
            "onset": 366.5,
            "x": 22626.516243213395
        },
        {
            "onset": 366.75,
            "x": 22645.574173198173
        },
        {
            "onset": 367.0,
            "x": 22664.632103182954
        },
        {
            "onset": 367.5,
            "x": 22692.822453259058
        },
        {
            "onset": 368.0,
            "x": 22735.344740531687
        },
        {
            "onset": 368.5,
            "x": 22763.286754737674
        },
        {
            "onset": 368.75,
            "x": 22782.34468472245
        },
        {
            "onset": 369.0,
            "x": 22801.40261470723
        },
        {
            "onset": 369.5,
            "x": 22819.66745488988
        },
        {
            "onset": 370.0,
            "x": 22847.857804965985
        },
        {
            "onset": 370.5,
            "x": 22876.048155042085
        },
        {
            "onset": 370.75,
            "x": 22895.106085026866
        },
        {
            "onset": 371.0,
            "x": 22914.164015011647
        },
        {
            "onset": 371.5,
            "x": 22942.35436508775
        },
        {
            "onset": 372.0,
            "x": 22977.83171886027
        },
        {
            "onset": 372.5,
            "x": 23004.092769088587
        },
        {
            "onset": 373.0,
            "x": 23034.185706683715
        },
        {
            "onset": 373.5,
            "x": 23061.21847685114
        },
        {
            "onset": 374.0,
            "x": 23089.408826927247
        },
        {
            "onset": 374.5,
            "x": 23117.59917700335
        },
        {
            "onset": 374.75,
            "x": 23136.65710698813
        },
        {
            "onset": 375.0,
            "x": 23155.71503697291
        },
        {
            "onset": 375.5,
            "x": 23183.905387049013
        },
        {
            "onset": 375.75,
            "x": 23202.963317033795
        },
        {
            "onset": 376.0,
            "x": 23230.6115892669
        },
        {
            "onset": 376.5,
            "x": 23258.801939342997
        },
        {
            "onset": 377.0,
            "x": 23286.992289419104
        },
        {
            "onset": 377.5,
            "x": 23315.182639495208
        },
        {
            "onset": 378.0,
            "x": 23343.465752128388
        },
        {
            "onset": 378.5,
            "x": 23371.563339647415
        },
        {
            "onset": 378.75,
            "x": 23390.621269632193
        },
        {
            "onset": 379.0,
            "x": 23409.67919961697
        },
        {
            "onset": 379.5,
            "x": 23435.96696217405
        },
        {
            "onset": 380.0,
            "x": 23472.139514830465
        },
        {
            "onset": 380.5,
            "x": 23498.92394912778
        },
        {
            "onset": 381.0,
            "x": 23527.85930681423
        },
        {
            "onset": 381.5,
            "x": 23556.049656890336
        },
        {
            "onset": 382.0,
            "x": 23584.240006966436
        },
        {
            "onset": 382.5,
            "x": 23612.430357042544
        },
        {
            "onset": 382.75,
            "x": 23631.48828702732
        },
        {
            "onset": 383.0,
            "x": 23650.546217012103
        },
        {
            "onset": 383.5,
            "x": 23678.736567088203
        },
        {
            "onset": 383.75,
            "x": 23697.794497072984
        },
        {
            "onset": 384.0,
            "x": 23725.30384106081
        },
        {
            "onset": 384.5,
            "x": 23753.494191136913
        },
        {
            "onset": 385.0,
            "x": 23781.684541213017
        },
        {
            "onset": 385.5,
            "x": 23809.874891289117
        },
        {
            "onset": 386.0,
            "x": 23838.065241365224
        },
        {
            "onset": 386.5,
            "x": 23866.255591441324
        },
        {
            "onset": 386.75,
            "x": 23885.313521426102
        },
        {
            "onset": 387.0,
            "x": 23904.371451410887
        },
        {
            "onset": 387.5,
            "x": 23932.561801486987
        },
        {
            "onset": 387.75,
            "x": 23951.61973147177
        },
        {
            "onset": 388.0,
            "x": 23985.162816925116
        },
        {
            "onset": 388.5,
            "x": 24013.26040444414
        },
        {
            "onset": 389.0,
            "x": 24041.450754520247
        },
        {
            "onset": 389.5,
            "x": 24069.64110459635
        },
        {
            "onset": 390.0,
            "x": 24097.152497290408
        },
        {
            "onset": 390.5,
            "x": 24123.7066449312
        },
        {
            "onset": 391.0,
            "x": 24151.896995007308
        },
        {
            "onset": 391.5,
            "x": 24180.08734508341
        },
        {
            "onset": 392.0,
            "x": 24216.38226582702
        },
        {
            "onset": 392.5,
            "x": 24244.572615903122
        },
        {
            "onset": 392.75,
            "x": 24263.630545887903
        },
        {
            "onset": 393.0,
            "x": 24282.68847587268
        },
        {
            "onset": 393.5,
            "x": 24310.107106009666
        },
        {
            "onset": 394.0,
            "x": 24338.390218642846
        },
        {
            "onset": 394.5,
            "x": 24366.487806161873
        },
        {
            "onset": 394.75,
            "x": 24385.54573614665
        },
        {
            "onset": 395.0,
            "x": 24404.603666131436
        },
        {
            "onset": 395.5,
            "x": 24432.794016207536
        },
        {
            "onset": 396.0,
            "x": 24476.53945434627
        },
        {
            "onset": 396.5,
            "x": 24504.72980442237
        },
        {
            "onset": 396.75,
            "x": 24523.787734407157
        },
        {
            "onset": 397.0,
            "x": 24542.93842694901
        },
        {
            "onset": 397.5,
            "x": 24571.036014468038
        },
        {
            "onset": 398.0,
            "x": 24599.22636454414
        },
        {
            "onset": 398.5,
            "x": 24627.416714620245
        },
        {
            "onset": 398.75,
            "x": 24646.474644605023
        },
        {
            "onset": 399.0,
            "x": 24665.532574589804
        },
        {
            "onset": 400.0,
            "x": 24722.124676858446
        }
    ],
    "staffs": [
        {
            "bottom": 102.9,
            "notespos": [],
            "top": 0
        },
        {
            "bottom": 210.9,
            "notespos": [],
            "top": 108
        },
        {
            "bottom": 318.9,
            "notespos": [],
            "top": 216
        },
        {
            "bottom": 426.9,
            "notespos": [],
            "top": 324
        }
    ]
}