{
  "date-x": [
      {
          "date": 0,
          "x": 0
      },
      {
          "date": 348,
          "x": 1800
      }
  ],
  "staffs": [
      {
          "bottom": 95.0,
          "top": 5.0
      },
      {
          "bottom": 195.0,
          "top": 105.0
      },
      {
          "bottom": 280.0,
          "top": 205.0
      }
  ]
}