<?xml version="1.0" encoding="UTF-8" standalone="no"?>
<!DOCTYPE svg PUBLIC "-//W3C//DTD SVG 1.1//EN"
 "http://www.w3.org/Graphics/SVG/1.1/DTD/svg11.dtd">
<!-- Generated by graphviz version 2.43.0 (0)
 -->
<!-- Title: dependency&#45;cruiser output Pages: 1 -->
<svg width="626pt" height="176pt"
 viewBox="0.00 0.00 626.00 176.00" xmlns="http://www.w3.org/2000/svg" xmlns:xlink="http://www.w3.org/1999/xlink">
<g id="graph0" class="graph" transform="scale(1 1) rotate(0) translate(4 172)">
<title>dependency&#45;cruiser output</title>
<polygon fill="white" stroke="transparent" points="-4,4 -4,-172 622,-172 622,4 -4,4"/>
<g id="clust1" class="cluster">
<title>cluster_src</title>
<path fill="#ffffff" stroke="black" stroke-width="2" d="M20,-8C20,-8 598,-8 598,-8 604,-8 610,-14 610,-20 610,-20 610,-148 610,-148 610,-154 604,-160 598,-160 598,-160 20,-160 20,-160 14,-160 8,-154 8,-148 8,-148 8,-20 8,-20 8,-14 14,-8 20,-8"/>
<text text-anchor="middle" x="309" y="-148.8" font-family="Helvetica,sans-Serif" font-weight="bold" font-size="9.00">src</text>
</g>
<!-- src/App.vue -->
<g id="node1" class="node">
<title>src/App.vue</title>
<g id="a_node1"><a xlink:href="../../src/App.vue" xlink:title="App.vue">
<path fill="#41f083" stroke="black" d="M131,-60C131,-60 89,-60 89,-60 86,-60 83,-57 83,-54 83,-54 83,-48 83,-48 83,-45 86,-42 89,-42 89,-42 131,-42 131,-42 134,-42 137,-45 137,-48 137,-48 137,-54 137,-54 137,-57 134,-60 131,-60"/>
<text text-anchor="start" x="93" y="-48.8" font-family="Helvetica,sans-Serif" font-size="9.00">App.vue</text>
</a>
</g>
</g>
<!-- src/components -->
<g id="node2" class="node">
<title>src/components</title>
<g id="a_node2"><a xlink:href="../../src/components" xlink:title="components">
<polygon fill="#ffffcc" stroke="black" points="351,-73 286,-73 284,-71 284,-55 349,-55 351,-57 351,-73"/>
<polyline fill="none" stroke="black" points="349,-71 284,-71 "/>
<polyline fill="none" stroke="black" points="349,-71 349,-55 "/>
<polyline fill="none" stroke="black" points="349,-71 351,-73 "/>
<text text-anchor="start" x="292" y="-61.8" font-family="Helvetica,sans-Serif" font-size="9.00">components</text>
</a>
</g>
</g>
<!-- src/App.vue&#45;&gt;src/components -->
<g id="edge1" class="edge">
<title>src/App.vue&#45;&gt;src/components</title>
<path fill="none" stroke="#000000" stroke-width="2" stroke-opacity="0.200000" d="M119,-60.2C119,-61.5 119,-62.4 119,-62.4 119,-62.4 277.83,-62.4 277.83,-62.4"/>
<polygon fill="#000000" fill-opacity="0.200000" stroke="#000000" stroke-width="2" stroke-opacity="0.200000" points="277.83,-64.5 283.83,-62.4 277.83,-60.3 277.83,-64.5"/>
</g>
<!-- src/router -->
<g id="node3" class="node">
<title>src/router</title>
<g id="a_node3"><a xlink:href="../../src/router" xlink:title="router">
<polygon fill="#ffffcc" stroke="black" points="204,-105 152,-105 150,-103 150,-87 202,-87 204,-89 204,-105"/>
<polyline fill="none" stroke="black" points="202,-103 150,-103 "/>
<polyline fill="none" stroke="black" points="202,-103 202,-87 "/>
<polyline fill="none" stroke="black" points="202,-103 204,-105 "/>
<text text-anchor="start" x="164.5" y="-93.8" font-family="Helvetica,sans-Serif" font-size="9.00">router</text>
</a>
</g>
</g>
<!-- src/App.vue&#45;&gt;src/router -->
<g id="edge2" class="edge">
<title>src/App.vue&#45;&gt;src/router</title>
<path fill="none" stroke="#000000" stroke-width="2" stroke-opacity="0.200000" d="M101,-60.24C101,-63.87 101,-67.2 101,-67.2 101,-67.2 168,-67.2 168,-67.2 168,-67.2 168,-80.89 168,-80.89"/>
<polygon fill="#000000" fill-opacity="0.200000" stroke="#000000" stroke-width="2" stroke-opacity="0.200000" points="165.9,-80.89 168,-86.89 170.1,-80.89 165.9,-80.89"/>
</g>
<!-- src/client -->
<g id="node4" class="node">
<title>src/client</title>
<g id="a_node4"><a xlink:href="../../src/client" xlink:title="client">
<polygon fill="#ffffcc" stroke="black" points="443,-120 391,-120 389,-118 389,-102 441,-102 443,-104 443,-120"/>
<polyline fill="none" stroke="black" points="441,-118 389,-118 "/>
<polyline fill="none" stroke="black" points="441,-118 441,-102 "/>
<polyline fill="none" stroke="black" points="441,-118 443,-120 "/>
<text text-anchor="start" x="405" y="-108.8" font-family="Helvetica,sans-Serif" font-size="9.00">client</text>
</a>
</g>
</g>
<!-- src/components&#45;&gt;src/client -->
<g id="edge5" class="edge">
<title>src/components&#45;&gt;src/client</title>
<path fill="none" stroke="#000000" stroke-width="2" stroke-opacity="0.200000" d="M351.26,-67.5C378.04,-67.5 411,-67.5 411,-67.5 411,-67.5 411,-95.77 411,-95.77"/>
<polygon fill="#000000" fill-opacity="0.200000" stroke="#000000" stroke-width="2" stroke-opacity="0.200000" points="408.9,-95.77 411,-101.77 413.1,-95.77 408.9,-95.77"/>
</g>
<!-- src/data -->
<g id="node5" class="node">
<title>src/data</title>
<g id="a_node5"><a xlink:href="../../src/data" xlink:title="data">
<polygon fill="#ffffcc" stroke="black" points="602,-85 550,-85 548,-83 548,-67 600,-67 602,-69 602,-85"/>
<polyline fill="none" stroke="black" points="600,-83 548,-83 "/>
<polyline fill="none" stroke="black" points="600,-83 600,-67 "/>
<polyline fill="none" stroke="black" points="600,-83 602,-85 "/>
<text text-anchor="start" x="565.5" y="-73.8" font-family="Helvetica,sans-Serif" font-size="9.00">data</text>
</a>
</g>
</g>
<!-- src/components&#45;&gt;src/data -->
<g id="edge6" class="edge">
<title>src/components&#45;&gt;src/data</title>
<path fill="none" stroke="#000000" stroke-width="2" stroke-opacity="0.200000" d="M307,-73.22C307,-74.83 307,-76 307,-76 307,-76 541.83,-76 541.83,-76"/>
<polygon fill="#000000" fill-opacity="0.200000" stroke="#000000" stroke-width="2" stroke-opacity="0.200000" points="541.83,-78.1 547.83,-76 541.83,-73.9 541.83,-78.1"/>
</g>
<!-- src/formats -->
<g id="node6" class="node">
<title>src/formats</title>
<g id="a_node6"><a xlink:href="../../src/formats" xlink:title="formats">
<polygon fill="#ffffcc" stroke="black" points="535,-100 483,-100 481,-98 481,-82 533,-82 535,-84 535,-100"/>
<polyline fill="none" stroke="black" points="533,-98 481,-98 "/>
<polyline fill="none" stroke="black" points="533,-98 533,-82 "/>
<polyline fill="none" stroke="black" points="533,-98 535,-100 "/>
<text text-anchor="start" x="492.5" y="-88.8" font-family="Helvetica,sans-Serif" font-size="9.00">formats</text>
</a>
</g>
</g>
<!-- src/components&#45;&gt;src/formats -->
<g id="edge8" class="edge">
<title>src/components&#45;&gt;src/formats</title>
<path fill="none" stroke="#000000" stroke-width="2" stroke-opacity="0.200000" d="M329,-73.01C329,-81.69 329,-93.5 329,-93.5 329,-93.5 474.81,-93.5 474.81,-93.5"/>
<polygon fill="#000000" fill-opacity="0.200000" stroke="#000000" stroke-width="2" stroke-opacity="0.200000" points="474.81,-95.6 480.81,-93.5 474.81,-91.4 474.81,-95.6"/>
</g>
<!-- src/logic -->
<g id="node7" class="node">
<title>src/logic</title>
<g id="a_node7"><a xlink:href="../../src/logic" xlink:title="logic">
<polygon fill="#ffffcc" stroke="black" points="535,-70 483,-70 481,-68 481,-52 533,-52 535,-54 535,-70"/>
<polyline fill="none" stroke="black" points="533,-68 481,-68 "/>
<polyline fill="none" stroke="black" points="533,-68 533,-52 "/>
<polyline fill="none" stroke="black" points="533,-68 535,-70 "/>
<text text-anchor="start" x="498" y="-58.8" font-family="Helvetica,sans-Serif" font-size="9.00">logic</text>
</a>
</g>
</g>
<!-- src/components&#45;&gt;src/logic -->
<g id="edge7" class="edge">
<title>src/components&#45;&gt;src/logic</title>
<path fill="none" stroke="#000000" stroke-width="2" stroke-opacity="0.200000" d="M351.12,-62.5C351.12,-62.5 474.88,-62.5 474.88,-62.5"/>
<polygon fill="#000000" fill-opacity="0.200000" stroke="#000000" stroke-width="2" stroke-opacity="0.200000" points="474.88,-64.6 480.88,-62.5 474.88,-60.4 474.88,-64.6"/>
</g>
<!-- src/synchronization&#45;logic -->
<g id="node8" class="node">
<title>src/synchronization&#45;logic</title>
<g id="a_node8"><a xlink:href="../../src/synchronization-logic" xlink:title="synchronization&#45;logic">
<polygon fill="#ffffcc" stroke="black" points="468,-48 366,-48 364,-46 364,-30 466,-30 468,-32 468,-48"/>
<polyline fill="none" stroke="black" points="466,-46 364,-46 "/>
<polyline fill="none" stroke="black" points="466,-46 466,-30 "/>
<polyline fill="none" stroke="black" points="466,-46 468,-48 "/>
<text text-anchor="start" x="372" y="-36.8" font-family="Helvetica,sans-Serif" font-size="9.00">synchronization&#45;logic</text>
</a>
</g>
</g>
<!-- src/components&#45;&gt;src/synchronization&#45;logic -->
<g id="edge9" class="edge">
<title>src/components&#45;&gt;src/synchronization&#45;logic</title>
<path fill="none" stroke="#000000" stroke-width="2" stroke-opacity="0.200000" d="M351.08,-57.5C364.57,-57.5 377,-57.5 377,-57.5 377,-57.5 377,-54.25 377,-54.25"/>
<polygon fill="#000000" fill-opacity="0.200000" stroke="#000000" stroke-width="2" stroke-opacity="0.200000" points="379.1,-54.25 377,-48.25 374.9,-54.25 379.1,-54.25"/>
</g>
<!-- src/router&#45;&gt;src/components -->
<g id="edge17" class="edge">
<title>src/router&#45;&gt;src/components</title>
<path fill="none" stroke="#000000" stroke-width="2" stroke-opacity="0.200000" d="M186,-86.81C186,-77.6 186,-64.8 186,-64.8 186,-64.8 277.98,-64.8 277.98,-64.8"/>
<polygon fill="#000000" fill-opacity="0.200000" stroke="#000000" stroke-width="2" stroke-opacity="0.200000" points="277.98,-66.9 283.98,-64.8 277.98,-62.7 277.98,-66.9"/>
</g>
<!-- src/router&#45;&gt;src/client -->
<g id="edge16" class="edge">
<title>src/router&#45;&gt;src/client</title>
<path fill="none" stroke="#000000" stroke-width="2" stroke-opacity="0.200000" d="M177,-105.31C177,-108.98 177,-112.33 177,-112.33 177,-112.33 382.58,-112.33 382.58,-112.33"/>
<polygon fill="#000000" fill-opacity="0.200000" stroke="#000000" stroke-width="2" stroke-opacity="0.200000" points="382.58,-114.43 388.58,-112.33 382.58,-110.23 382.58,-114.43"/>
</g>
<!-- src/views -->
<g id="node12" class="node">
<title>src/views</title>
<g id="a_node12"><a xlink:href="../../src/views" xlink:title="views">
<polygon fill="#ffffcc" stroke="black" points="271,-105 219,-105 217,-103 217,-87 269,-87 271,-89 271,-105"/>
<polyline fill="none" stroke="black" points="269,-103 217,-103 "/>
<polyline fill="none" stroke="black" points="269,-103 269,-87 "/>
<polyline fill="none" stroke="black" points="269,-103 271,-105 "/>
<text text-anchor="start" x="232" y="-93.8" font-family="Helvetica,sans-Serif" font-size="9.00">views</text>
</a>
</g>
</g>
<!-- src/router&#45;&gt;src/views -->
<g id="edge18" class="edge">
<title>src/router&#45;&gt;src/views</title>
<path fill="none" stroke="#000000" stroke-width="2" stroke-opacity="0.200000" d="M204.25,-96C204.25,-96 210.99,-96 210.99,-96"/>
<polygon fill="#000000" fill-opacity="0.200000" stroke="#000000" stroke-width="2" stroke-opacity="0.200000" points="210.99,-98.1 216.99,-96 210.99,-93.9 210.99,-98.1"/>
</g>
<!-- src/client&#45;&gt;src/data -->
<g id="edge3" class="edge">
<title>src/client&#45;&gt;src/data</title>
<path fill="none" stroke="#000000" stroke-width="2" stroke-opacity="0.200000" d="M422,-101.92C422,-92.46 422,-79 422,-79 422,-79 542,-79 542,-79"/>
<polygon fill="#000000" fill-opacity="0.200000" stroke="#000000" stroke-width="2" stroke-opacity="0.200000" points="542,-81.1 548,-79 542,-76.9 542,-81.1"/>
</g>
<!-- src/client&#45;&gt;src/formats -->
<g id="edge4" class="edge">
<title>src/client&#45;&gt;src/formats</title>
<path fill="none" stroke="#000000" stroke-width="2" stroke-opacity="0.200000" d="M433,-101.89C433,-99.1 433,-96.75 433,-96.75 433,-96.75 474.92,-96.75 474.92,-96.75"/>
<polygon fill="#000000" fill-opacity="0.200000" stroke="#000000" stroke-width="2" stroke-opacity="0.200000" points="474.92,-98.85 480.92,-96.75 474.92,-94.65 474.92,-98.85"/>
</g>
<!-- src/formats&#45;&gt;src/data -->
<g id="edge10" class="edge">
<title>src/formats&#45;&gt;src/data</title>
<path fill="none" stroke="#000000" stroke-width="2" stroke-opacity="0.200000" d="M508,-81.79C508,-81 508,-80.5 508,-80.5 508,-80.5 541.75,-80.5 541.75,-80.5"/>
<polygon fill="#000000" fill-opacity="0.200000" stroke="#000000" stroke-width="2" stroke-opacity="0.200000" points="541.75,-82.6 547.75,-80.5 541.75,-78.4 541.75,-82.6"/>
</g>
<!-- src/logic&#45;&gt;src/data -->
<g id="edge11" class="edge">
<title>src/logic&#45;&gt;src/data</title>
<path fill="none" stroke="#000000" stroke-width="2" stroke-opacity="0.200000" d="M535.25,-59.5C553.8,-59.5 575,-59.5 575,-59.5 575,-59.5 575,-60.98 575,-60.98"/>
<polygon fill="#000000" fill-opacity="0.200000" stroke="#000000" stroke-width="2" stroke-opacity="0.200000" points="572.9,-60.98 575,-66.98 577.1,-60.98 572.9,-60.98"/>
</g>
<!-- src/synchronization&#45;logic&#45;&gt;src/data -->
<g id="edge19" class="edge">
<title>src/synchronization&#45;logic&#45;&gt;src/data</title>
<path fill="none" stroke="#000000" stroke-width="2" stroke-opacity="0.200000" d="M452,-48.33C452,-58.85 452,-74.5 452,-74.5 452,-74.5 541.7,-74.5 541.7,-74.5"/>
<polygon fill="#000000" fill-opacity="0.200000" stroke="#000000" stroke-width="2" stroke-opacity="0.200000" points="541.7,-76.6 547.7,-74.5 541.7,-72.4 541.7,-76.6"/>
</g>
<!-- src/synchronization&#45;logic&#45;&gt;src/logic -->
<g id="edge20" class="edge">
<title>src/synchronization&#45;logic&#45;&gt;src/logic</title>
<path fill="none" stroke="#000000" stroke-width="2" stroke-opacity="0.200000" d="M460,-48.03C460,-53.72 460,-60 460,-60 460,-60 474.91,-60 474.91,-60"/>
<polygon fill="#000000" fill-opacity="0.200000" stroke="#000000" stroke-width="2" stroke-opacity="0.200000" points="474.91,-62.1 480.91,-60 474.91,-57.9 474.91,-62.1"/>
</g>
<!-- src/main.ts -->
<g id="node9" class="node">
<title>src/main.ts</title>
<g id="a_node9"><a xlink:href="../../src/main.ts" xlink:title="main.ts">
<path fill="#ddfeff" stroke="black" d="M64,-101C64,-101 22,-101 22,-101 19,-101 16,-98 16,-95 16,-95 16,-89 16,-89 16,-86 19,-83 22,-83 22,-83 64,-83 64,-83 67,-83 70,-86 70,-89 70,-89 70,-95 70,-95 70,-98 67,-101 64,-101"/>
<text text-anchor="start" x="28" y="-89.8" font-family="Helvetica,sans-Serif" font-size="9.00">main.ts</text>
</a>
</g>
</g>
<!-- src/main.ts&#45;&gt;src/App.vue -->
<g id="edge12" class="edge">
<title>src/main.ts&#45;&gt;src/App.vue</title>
<path fill="none" stroke="#000000" stroke-width="2" stroke-opacity="0.200000" d="M43,-82.9C43,-70.82 43,-51 43,-51 43,-51 76.75,-51 76.75,-51"/>
<polygon fill="#000000" fill-opacity="0.200000" stroke="#000000" stroke-width="2" stroke-opacity="0.200000" points="76.75,-53.1 82.75,-51 76.75,-48.9 76.75,-53.1"/>
</g>
<!-- src/main.ts&#45;&gt;src/router -->
<g id="edge14" class="edge">
<title>src/main.ts&#45;&gt;src/router</title>
<path fill="none" stroke="#000000" stroke-width="2" stroke-opacity="0.200000" d="M70.12,-93.67C70.12,-93.67 143.92,-93.67 143.92,-93.67"/>
<polygon fill="#000000" fill-opacity="0.200000" stroke="#000000" stroke-width="2" stroke-opacity="0.200000" points="143.92,-95.77 149.92,-93.67 143.92,-91.57 143.92,-95.77"/>
</g>
<!-- src/plugins -->
<g id="node10" class="node">
<title>src/plugins</title>
<g id="a_node10"><a xlink:href="../../src/plugins" xlink:title="plugins">
<polygon fill="#ffffcc" stroke="black" points="137,-90 85,-90 83,-88 83,-72 135,-72 137,-74 137,-90"/>
<polyline fill="none" stroke="black" points="135,-88 83,-88 "/>
<polyline fill="none" stroke="black" points="135,-88 135,-72 "/>
<polyline fill="none" stroke="black" points="135,-88 137,-90 "/>
<text text-anchor="start" x="94.5" y="-78.8" font-family="Helvetica,sans-Serif" font-size="9.00">plugins</text>
</a>
</g>
</g>
<!-- src/main.ts&#45;&gt;src/plugins -->
<g id="edge13" class="edge">
<title>src/main.ts&#45;&gt;src/plugins</title>
<path fill="none" stroke="#000000" stroke-width="2" stroke-opacity="0.200000" d="M70.25,-86.5C70.25,-86.5 76.99,-86.5 76.99,-86.5"/>
<polygon fill="#000000" fill-opacity="0.200000" stroke="#000000" stroke-width="2" stroke-opacity="0.200000" points="76.99,-88.6 82.99,-86.5 76.99,-84.4 76.99,-88.6"/>
</g>
<!-- src/styles -->
<g id="node11" class="node">
<title>src/styles</title>
<g id="a_node11"><a xlink:href="../../src/styles" xlink:title="styles">
<polygon fill="#ffffcc" stroke="black" points="137,-134 85,-134 83,-132 83,-116 135,-116 137,-118 137,-134"/>
<polyline fill="none" stroke="black" points="135,-132 83,-132 "/>
<polyline fill="none" stroke="black" points="135,-132 135,-116 "/>
<polyline fill="none" stroke="black" points="135,-132 137,-134 "/>
<text text-anchor="start" x="98" y="-122.8" font-family="Helvetica,sans-Serif" font-size="9.00">styles</text>
</a>
</g>
</g>
<!-- src/main.ts&#45;&gt;src/styles -->
<g id="edge15" class="edge">
<title>src/main.ts&#45;&gt;src/styles</title>
<path fill="none" stroke="#000000" stroke-width="2" stroke-opacity="0.200000" d="M70.25,-97.33C88.8,-97.33 110,-97.33 110,-97.33 110,-97.33 110,-109.94 110,-109.94"/>
<polygon fill="#000000" fill-opacity="0.200000" stroke="#000000" stroke-width="2" stroke-opacity="0.200000" points="107.9,-109.94 110,-115.94 112.1,-109.94 107.9,-109.94"/>
</g>
<!-- src/views&#45;&gt;src/components -->
<g id="edge21" class="edge">
<title>src/views&#45;&gt;src/components</title>
<path fill="none" stroke="#000000" stroke-width="2" stroke-opacity="0.200000" d="M235,-86.77C235,-79.15 235,-69.6 235,-69.6 235,-69.6 277.94,-69.6 277.94,-69.6"/>
<polygon fill="#000000" fill-opacity="0.200000" stroke="#000000" stroke-width="2" stroke-opacity="0.200000" points="277.94,-71.7 283.94,-69.6 277.94,-67.5 277.94,-71.7"/>
</g>
<!-- src/views&#45;&gt;src/client -->
<g id="edge22" class="edge">
<title>src/views&#45;&gt;src/client</title>
<path fill="none" stroke="#000000" stroke-width="2" stroke-opacity="0.200000" d="M244,-105.21C244,-107.17 244,-108.67 244,-108.67 244,-108.67 382.75,-108.67 382.75,-108.67"/>
<polygon fill="#000000" fill-opacity="0.200000" stroke="#000000" stroke-width="2" stroke-opacity="0.200000" points="382.75,-110.77 388.75,-108.67 382.75,-106.57 382.75,-110.77"/>
</g>
<!-- src/views&#45;&gt;src/data -->
<g id="edge23" class="edge">
<title>src/views&#45;&gt;src/data</title>
<path fill="none" stroke="#000000" stroke-width="2" stroke-opacity="0.200000" d="M253,-86.75C253,-82.12 253,-77.5 253,-77.5 253,-77.5 541.82,-77.5 541.82,-77.5"/>
<polygon fill="#000000" fill-opacity="0.200000" stroke="#000000" stroke-width="2" stroke-opacity="0.200000" points="541.82,-79.6 547.82,-77.5 541.82,-75.4 541.82,-79.6"/>
</g>
<!-- src/views&#45;&gt;src/logic -->
<g id="edge24" class="edge">
<title>src/views&#45;&gt;src/logic</title>
<path fill="none" stroke="#000000" stroke-width="2" stroke-opacity="0.200000" d="M271.17,-90.25C315.87,-90.25 400,-90.25 400,-90.25 400,-90.25 400,-65 400,-65 400,-65 474.75,-65 474.75,-65"/>
<polygon fill="#000000" fill-opacity="0.200000" stroke="#000000" stroke-width="2" stroke-opacity="0.200000" points="474.75,-67.1 480.75,-65 474.75,-62.9 474.75,-67.1"/>
</g>
</g>
</svg>
