{
  "composer": "Schubert",
  "id": "01",
  "analysis:default": "test.dez",
  "opus": {
    "collection": "Winterreise",
    "composer": "Franz Schubert",
    "contributors": {
      "composer": "Franz Schubert",
      "encoder": " Christof Wei\u00df, Frank Zalkow, Vlora Arifi-M\u00fcller, Meinard M\u00fcller, Hendrik Vincent Koops, Anja Volk, Harald G. Grohganz",
      "lyricist": "Wilhelm M\u00fcller"
    },
    "genre": "lied",
    "id": "swd-01",
    "movement:num": "01",
    "movement:title": "Gute Nacht",
    "opus": "op. 89, D.911",
    "quality:audio": "4",
    "quality:audio:synchro": "4",
    "title": "Gute Nacht",
    "year": "1827-1828"
  },
  "sources": {
    "audios": [
      {
        "file": "sources/audios/01_HU33/01_HU33.wav",
        "info": "Randall Scarlata, Jeremy Denk (2006)",
        "onset-date": "sources/audios/01_HU33/synchro.json"
      },
      {
        "file": "sources/audios/01_SC06/01_SC06.wav",
        "info": "Gerhard H\u00fcsch, Hanns-Udo M\u00fcller (1933)",
        "onset-date": "sources/audios/01_SC06/synchro.json"
      }
    ],
    "images": [
      {
        "image": "sources/images/01-svg/01-svg.svg",
        "name": "MusicXML, rendered by Verovio",
        "type": "score",
        "positions": "sources/images/01-svg/positions.json"
      },
      {
        "image": "sources/images/scan/Schubert_D911-01_000.png",
        "name": "Ed. Peters, plate 9023",
        "type": "3d",
        "positions": "sources/images/scan/positions.json"
      }
    ]
  },
  "time-signature": "2/4",
  "time-signature-upbeat": 0.0,
  "title": "Gute Nacht"
}