{
    "id": "beethoven-violon",
    "editor": "dez-edit-bar",
    "sources": {
        "audios": [
            {
                "file": "beethoven-violon.mp3",
                "images": [
                    {
                        "image": "beethoven-violon-waves.png",
                        "positions": "beethoven-violon-waves-pos.json",
                        "type": "wave"
                    }
                ],
                "onset-date": "synchro.json"
            }
        ]
    },
    "time-signature": "4/4",
    "title": "Violin Concerto in D major op.61",
    "title:fr": "Concerto pour violon en ré majeur, op. 61",
    "composer": "Ludwig van Beethoven"
}
