<?xml version="1.0" encoding="UTF-8"?>
<?xml-model href="https://music-encoding.org/schema/5.0/mei-all.rng" type="application/xml" schematypens="http://relaxng.org/ns/structure/1.0"?>
<?xml-model href="https://music-encoding.org/schema/5.0/mei-all.rng" type="application/xml" schematypens="http://purl.oclc.org/dsdl/schematron"?>
<mei xmlns="http://www.music-encoding.org/ns/mei" meiversion="5.0">
 <meiHead xml:id="mku75n2">
  <fileDesc xml:id="f19wgnsj">
   <titleStmt xml:id="t2m6f93">
    <title>Die Ersehnte</title>
    <title type="subordinate">1</title>
    <respStmt>
     <persName role="composer">Fanny (Mendelssohn) Hensel</persName>
     <persName role="lyricist">Ludwig Christoph Heinrich Hölty</persName>
    </respStmt>
   </titleStmt>
   <pubStmt xml:id="pza97kn">
    <date isodate="2024-03-04" type="encoding-date">2024-03-04</date>
    <availability>
     <distributor>OpenScore (CC0)</distributor>
    </availability>
   </pubStmt>
  </fileDesc>
  <encodingDesc xml:id="e6gfgu">
   <appInfo xml:id="a14ii005">
    <application xml:id="aw3cfu6" isodate="2024-03-04T07:03:50" version="4.0.1-a99660b">
     <name xml:id="n14n2jst">Verovio</name>
     <p xml:id="p1tld9ii">Transcoded from MusicXML</p>
    </application>
   </appInfo>
  </encodingDesc>
 </meiHead>
 <music>
  <body>
   <mdiv xml:id="m1bw11u0">
    <score xml:id="s1e8csvx">
     <scoreDef xml:id="s1243lf6">
      <staffGrp xml:id="s2yfewm">
       <staffDef xml:id="P1" n="1" lines="5" ppq="2">
        <label xml:id="lcub6rs">Voice</label>
        <instrDef xml:id="ishd08x" midi.channel="0" midi.instrnum="68" midi.volume="78.00%" />
        <clef xml:id="c179d51n" shape="G" line="2" />
        <keySig xml:id="krg8o6i" sig="3f" />
        <meterSig xml:id="m1trm98q" count="12" unit="8" />
       </staffDef>
       <staffGrp xml:id="P2" bar.thru="true">
        <grpSym xml:id="g1uq68u5" symbol="brace" />
        <label xml:id="ljym9k3">Piano</label>
        <instrDef xml:id="isxkomj" midi.channel="1" midi.instrnum="0" midi.volume="78.00%" />
        <staffDef xml:id="s1ftr52m" n="2" lines="5" ppq="2">
         <clef xml:id="c1vu4k4d" shape="G" line="2" />
         <keySig xml:id="kk3mjo" sig="3f" />
         <meterSig xml:id="m8e5zn2" count="12" unit="8" />
        </staffDef>
        <staffDef xml:id="s19gukna" n="3" lines="5" ppq="2">
         <clef xml:id="c1oxattn" shape="F" line="4" />
         <keySig xml:id="kuqcv33" sig="3f" />
         <meterSig xml:id="mbb55qv" count="12" unit="8" />
        </staffDef>
       </staffGrp>
      </staffGrp>
     </scoreDef>
     <section xml:id="s1i4b12c">
      <pb xml:id="p4tclg4" />
      <measure xml:id="mpr2nit" n="1">
       <staff xml:id="s1sg6sgo" n="1">
        <layer xml:id="l361qyu" n="1">
         <mRest xml:id="m1mhojhs" />
        </layer>
       </staff>
       <staff xml:id="snnyf9g" n="2">
        <layer xml:id="ltx6lwu" n="1">
         <beam xml:id="bxqu0m0">
          <note xml:id="n15fnj1a" dur.ppq="1" dur="8" staff="3" oct="3" pname="g" stem.dir="up" />
          <note xml:id="n9ggfya" dur.ppq="1" dur="8" staff="3" oct="3" pname="b" stem.dir="up" accid.ges="f" />
          <note xml:id="nlxlrtg" dur.ppq="1" dur="8" oct="4" pname="e" stem.dir="down" accid.ges="f" />
          <note xml:id="nrh7dny" dur.ppq="1" dur="8" oct="4" pname="g" stem.dir="down" />
          <note xml:id="n1vppkqf" dur.ppq="1" dur="8" oct="4" pname="e" stem.dir="down" accid.ges="f" />
          <note xml:id="n1sv0ts7" dur.ppq="1" dur="8" staff="3" oct="3" pname="b" stem.dir="up" accid.ges="f" />
         </beam>
         <beam xml:id="b1q201x6">
          <note xml:id="n8idl89" dur.ppq="1" dur="8" staff="3" oct="3" pname="g" stem.dir="up" />
          <note xml:id="n10ctj8r" dur.ppq="1" dur="8" staff="3" oct="3" pname="b" stem.dir="up" accid.ges="f" />
          <note xml:id="nuiwvmo" dur.ppq="1" dur="8" oct="4" pname="e" stem.dir="down" accid.ges="f" />
          <note xml:id="nk2i1wy" dur.ppq="1" dur="8" oct="4" pname="g" stem.dir="down" />
          <note xml:id="n12290a7" dur.ppq="1" dur="8" oct="4" pname="e" stem.dir="down" accid.ges="f" />
          <note xml:id="n1476pkf" dur.ppq="1" dur="8" staff="3" oct="3" pname="b" stem.dir="up" accid.ges="f" />
         </beam>
        </layer>
       </staff>
       <staff xml:id="s1nglbtg" n="3">
        <layer xml:id="leaoo5a" n="5">
         <chord xml:id="c1dipk49" dots="1" dur.ppq="12" dur="1">
          <note xml:id="n1oom3sr" oct="2" pname="e" accid.ges="f" />
          <note xml:id="nm1uvb3" oct="3" pname="e" accid.ges="f" />
         </chord>
        </layer>
       </staff>
       <tempo xml:id="t1w6aqik" place="above" staff="1" tstamp="1.000000" xml:lang="it" midi.bpm="130.000000">
        <rend xml:id="rb19x10" fontweight="bold">Andante con moto</rend>
       </tempo>
      </measure>
      <measure xml:id="m1qzkccw" left="rptstart" n="2">
       <staff xml:id="sa80zb" n="1">
        <layer xml:id="l17f1eaz" n="1">
         <note xml:id="n1v4khv4" dots="1" dur.ppq="3" dur="4" oct="5" pname="e" stem.dir="down" accid.ges="f">
          <verse xml:id="var6yv4" n="1">
           <label xml:id="l37j8wf">1.</label>
           <syl xml:id="s122hi79" con="s" wordpos="s">Bräch</syl>
          </verse>
          <verse xml:id="vg0fzlt" n="2">
           <label xml:id="li5eenu"> 2.</label>
           <syl xml:id="s13eza8i" con="d" wordpos="i">Won</syl>
          </verse>
          <verse xml:id="vasrw4m" n="3">
           <label xml:id="l1v8gn4l">3.</label>
           <syl xml:id="s1f618x6" con="s" wordpos="s">Komm,</syl>
          </verse>
         </note>
         <note xml:id="n1wv2li3" dur.ppq="2" dur="4" oct="5" pname="e" stem.dir="down" accid.ges="f" />
         <note xml:id="n4j3j7y" dur.ppq="1" dur="8" oct="4" pname="g" stem.dir="up">
          <verse xml:id="v69of7f" n="1">
           <syl xml:id="s3n7rjt" con="s" wordpos="t">te</syl>
          </verse>
          <verse xml:id="v70motq" n="2">
           <syl xml:id="s1plfczb" con="s" wordpos="t">ne!</syl>
          </verse>
          <verse xml:id="v1i8gisj" n="3">
           <syl xml:id="s1o43glo" con="s" wordpos="s">dich</syl>
          </verse>
         </note>
         <note xml:id="nvqcq1t" dots="1" dur.ppq="3" dur="4" oct="4" pname="g" stem.dir="up">
          <verse xml:id="votx0es" n="1">
           <syl xml:id="slnks5y" con="s" wordpos="s">dich</syl>
          </verse>
          <verse xml:id="v10cf7x" n="2">
           <syl xml:id="sa1qaix" con="s" wordpos="s">sie</syl>
          </verse>
          <verse xml:id="v84xq0p" n="3">
           <syl xml:id="s16g4x5d" con="d" wordpos="i">ru</syl>
          </verse>
         </note>
         <note xml:id="n1yl3g3r" dur.ppq="2" dur="4" oct="4" pname="f" stem.dir="up">
          <verse xml:id="v10xa44b" n="1">
           <syl xml:id="s1pwuv4o" con="d" wordpos="i">mei</syl>
          </verse>
          <verse xml:id="vo12tsi" n="2">
           <syl xml:id="s2a42o1" con="s" wordpos="s">wird</syl>
          </verse>
          <verse xml:id="v1olh1dk" n="3">
           <syl xml:id="sp97rcd" con="s" wordpos="t">fet</syl>
          </verse>
         </note>
         <note xml:id="n28oq23" dur.ppq="1" dur="8" oct="4" pname="g" stem.dir="up">
          <verse xml:id="v1fhd1fm" n="1">
           <syl xml:id="sun2bf3" con="s" wordpos="t">nem</syl>
          </verse>
          <verse xml:id="vxbcwxx" n="2">
           <syl xml:id="s1luotcu" con="s" wordpos="s">mir</syl>
          </verse>
          <verse xml:id="v9hic45" n="3">
           <syl xml:id="s140eskp" con="s" wordpos="s">die</syl>
          </verse>
         </note>
        </layer>
       </staff>
       <staff xml:id="s1ysui8w" n="2">
        <layer xml:id="lzpp4zo" n="1">
         <chord xml:id="c1hhooof" dur.ppq="1" dur="8" staff="3" stem.dir="up">
          <note xml:id="nf54gkd" oct="3" pname="g" />
          <note xml:id="n1mtcdvc" oct="3" pname="b" accid.ges="f" />
         </chord>
         <note xml:id="n179puhd" dur.ppq="1" dur="8" oct="4" pname="d" stem.dir="down">
          <accid xml:id="actbotk" accid="f" />
         </note>
         <note xml:id="n16zcu4z" dur.ppq="1" dur="8" oct="4" pname="e" stem.dir="down" accid.ges="f" />
         <note xml:id="n1ef7tsv" dur.ppq="1" dur="8" oct="4" pname="g" stem.dir="down" />
         <note xml:id="n1w59314" dur.ppq="1" dur="8" oct="4" pname="e" stem.dir="down" accid.ges="f" />
         <note xml:id="ntinbjp" dur.ppq="1" dur="8" oct="4" pname="d" stem.dir="down" accid.ges="f" />
         <beam xml:id="b8jliiv">
          <note xml:id="nsbsh" dur.ppq="1" dur="8" oct="3" pname="b" stem.dir="up" accid.ges="f" />
          <note xml:id="nwflihs" dur.ppq="1" dur="8" oct="4" pname="d" stem.dir="up" accid.ges="f" />
          <note xml:id="nxllovv" dur.ppq="1" dur="8" oct="4" pname="e" stem.dir="up" accid.ges="f" />
          <note xml:id="nrw6qyx" dur.ppq="1" dur="8" oct="4" pname="g" stem.dir="up" />
          <note xml:id="n6mbc9m" dur.ppq="1" dur="8" oct="4" pname="e" stem.dir="up" accid.ges="f" />
          <note xml:id="nsfsw65" dur.ppq="1" dur="8" oct="4" pname="d" stem.dir="up" accid.ges="f" />
         </beam>
        </layer>
       </staff>
       <staff xml:id="s1saov7k" n="3">
        <layer xml:id="l1lsnde0" n="5">
         <chord xml:id="cyfdocr" dots="1" dur.ppq="12" dur="1">
          <note xml:id="nndyjbc" oct="2" pname="e" accid.ges="f" />
          <note xml:id="n1pfl2za" oct="3" pname="e" accid.ges="f" />
         </chord>
        </layer>
       </staff>
       <tie xml:id="tjbo6on" startid="#n1v4khv4" endid="#n1wv2li3" />
       <beamSpan xml:id="b1tusgpl" startid="#c1hhooof" endid="#ntinbjp" />
      </measure>
      <measure xml:id="m131vwrh" n="3">
       <staff xml:id="s4uwdrg" n="1">
        <layer xml:id="l2izsr9" n="1">
         <note xml:id="nv5hrb3" dots="1" dur.ppq="3" dur="4" oct="4" pname="a" stem.dir="up" accid.ges="f">
          <verse xml:id="vo7328v" n="1">
           <syl xml:id="s1xt5r9i" con="s" wordpos="s">Arm</syl>
          </verse>
          <verse xml:id="v8h3ekj" n="2">
           <syl xml:id="s1m23ioz" con="d" wordpos="i">Pa</syl>
          </verse>
          <verse xml:id="v118jol0" n="3">
           <syl xml:id="s3vqi2a" con="d" wordpos="i">Seh</syl>
          </verse>
         </note>
         <note xml:id="nmcr130" dots="1" dur.ppq="3" dur="4" oct="4" pname="b" stem.dir="down" accid.ges="f">
          <verse xml:id="v1tlm9rk" n="1">
           <syl xml:id="s1mgab2m" con="s" wordpos="s">der</syl>
          </verse>
          <verse xml:id="v46gso" n="2">
           <syl xml:id="spwqflo" con="d" wordpos="m">ra</syl>
          </verse>
          <verse xml:id="v81riyr" n="3">
           <syl xml:id="sxd9za7" con="d" wordpos="m">suchts</syl>
          </verse>
         </note>
         <note xml:id="n1s3qu6z" dots="1" dur.ppq="3" dur="4" oct="5" pname="c" stem.dir="down">
          <verse xml:id="vvsclro" n="1">
           <syl xml:id="s1e7g2s0" con="d" wordpos="i">näch</syl>
          </verse>
          <verse xml:id="v1tv0rqm" n="2">
           <syl xml:id="s15jdx0z" con="d" wordpos="m">die</syl>
          </verse>
          <verse xml:id="vy3yb30" n="3">
           <syl xml:id="s16tm59z" con="s" wordpos="t">thrän</syl>
          </verse>
         </note>
         <note xml:id="n1x0k8rl" dots="1" dur.ppq="3" dur="4" oct="5" pname="d" stem.dir="down">
          <verse xml:id="v68wpge" n="1">
           <syl xml:id="st6u7pw" con="s" wordpos="t">ste</syl>
          </verse>
          <verse xml:id="v1vfkaex" n="2">
           <syl xml:id="smj72aa" con="s" wordpos="t">se</syl>
          </verse>
          <verse xml:id="v1iopf8x" n="3">
           <syl xml:id="s4deqvq" con="s" wordpos="s">im</syl>
          </verse>
         </note>
        </layer>
       </staff>
       <staff xml:id="s1l8rqp2" n="2">
        <layer xml:id="l1ayjnjm" n="1">
         <beam xml:id="b151ttoo">
          <note xml:id="n1q6hqu4" dur.ppq="1" dur="8" oct="4" pname="c" stem.dir="up" />
          <note xml:id="nu8me18" dur.ppq="1" dur="8" oct="4" pname="e" stem.dir="up" accid.ges="f" />
          <note xml:id="n16ojm1m" dur.ppq="1" dur="8" oct="4" pname="a" stem.dir="up" accid.ges="f" />
          <note xml:id="n1qxzw0k" dur.ppq="1" dur="8" oct="3" pname="g" stem.dir="up" />
          <note xml:id="ngppyre" dur.ppq="1" dur="8" oct="4" pname="d" stem.dir="up">
           <accid xml:id="a1p473k4" accid="f" />
          </note>
          <note xml:id="n57sqk0" dur.ppq="1" dur="8" oct="4" pname="e" stem.dir="up" accid.ges="f" />
         </beam>
         <beam xml:id="b1hnramk">
          <note xml:id="n1pyc4tv" dur.ppq="1" dur="8" oct="3" pname="a" stem.dir="up" accid.ges="f" />
          <note xml:id="n142kssb" dur.ppq="1" dur="8" oct="4" pname="c" stem.dir="up" />
          <note xml:id="n1yn5k58" dur.ppq="1" dur="8" oct="4" pname="e" stem.dir="up" accid.ges="f" />
          <note xml:id="n2li649" dur.ppq="1" dur="8" oct="3" pname="a" stem.dir="up" accid.ges="f" />
          <note xml:id="ny8zpwb" dur.ppq="1" dur="8" oct="4" pname="c" stem.dir="up">
           <accid xml:id="ag8blew" accid="f" />
          </note>
          <note xml:id="n1cuy8cp" dur.ppq="1" dur="8" oct="4" pname="f" stem.dir="up" />
         </beam>
        </layer>
       </staff>
       <staff xml:id="slliav" n="3">
        <layer xml:id="lx58j2k" n="5">
         <chord xml:id="cx8vl4i" dots="1" dur.ppq="12" dur="1">
          <note xml:id="n10750f3" oct="2" pname="e" accid.ges="f" />
          <note xml:id="n1iji1p9" oct="3" pname="e" accid.ges="f" />
         </chord>
        </layer>
       </staff>
      </measure>
      <measure xml:id="mzyqc6" n="4">
       <staff xml:id="sfx9sw1" n="1">
        <layer xml:id="lkm0qqp" n="1">
         <note xml:id="nfnj700" dots="1" dur.ppq="3" dur="4" oct="5" pname="e" stem.dir="down" accid.ges="f">
          <verse xml:id="v3oljf1" n="1">
           <syl xml:id="s7i5skt" con="s" wordpos="s">Früh</syl>
          </verse>
          <verse xml:id="vhjo9r4" n="2">
           <syl xml:id="s4a2oqe" con="d" wordpos="i">zau</syl>
          </verse>
          <verse xml:id="v1h3ri3v" n="3">
           <syl xml:id="sxeux3h" con="d" wordpos="i">Au</syl>
          </verse>
         </note>
         <beam xml:id="b4gin7d">
          <note xml:id="n1x9nzb6" dur.ppq="1" dur="8" oct="5" pname="e" stem.dir="down" accid.ges="f" />
          <note xml:id="ny8shez" dur.ppq="1" dur="8" oct="5" pname="d" stem.dir="down" />
          <note xml:id="n138611h" dur.ppq="1" dur="8" oct="5" pname="c" stem.dir="down" />
         </beam>
         <note xml:id="n123vpo5" dots="1" dur.ppq="3" dur="4" oct="4" pname="b" stem.dir="down" accid.ges="f">
          <verse xml:id="vf4rxnh" n="1">
           <syl xml:id="s18wkaxg" con="s" wordpos="t">ling!</syl>
          </verse>
          <verse xml:id="vfwh6eq" n="2">
           <syl xml:id="sfbicu4" con="s" wordpos="t">bern!</syl>
          </verse>
          <verse xml:id="v13kud9q" n="3">
           <syl xml:id="scqqv57" con="s" wordpos="t">ge!</syl>
          </verse>
         </note>
         <rest xml:id="r18ywv0r" dots="1" dur.ppq="3" dur="4" />
        </layer>
       </staff>
       <staff xml:id="s1sax0vw" n="2">
        <layer xml:id="lb56cg2" n="1">
         <note xml:id="n1p7ac93" dur.ppq="1" dur="8" staff="3" oct="3" pname="g" stem.dir="up" />
         <note xml:id="nk3m2zc" dur.ppq="1" dur="8" staff="3" oct="3" pname="b" stem.dir="up" accid.ges="f" />
         <note xml:id="naoczcc" dur.ppq="1" dur="8" oct="4" pname="e" stem.dir="down" accid.ges="f" />
         <note xml:id="n1n3krq" dur.ppq="1" dur="8" staff="3" oct="3" pname="f" stem.dir="up" />
         <note xml:id="nt8kmqi" dur.ppq="1" dur="8" staff="3" oct="3" pname="a" stem.dir="up" accid.ges="f" />
         <note xml:id="n18tlwm2" dur.ppq="1" dur="8" oct="4" pname="e" stem.dir="down" accid.ges="f" />
         <beam xml:id="b1i1kse8">
          <note xml:id="n1i66djz" dur.ppq="1" dur="8" staff="3" oct="3" pname="g" stem.dir="up" />
          <note xml:id="n1id0m4e" dur.ppq="1" dur="8" staff="3" oct="3" pname="b" stem.dir="up" accid.ges="f" />
          <note xml:id="n38e43u" dur.ppq="1" dur="8" oct="4" pname="e" stem.dir="down" accid.ges="f" />
          <note xml:id="n161c0e5" dur.ppq="1" dur="8" oct="4" pname="g" stem.dir="down" />
          <note xml:id="nvixd9p" dur.ppq="1" dur="8" oct="4" pname="e" stem.dir="down" accid.ges="f" />
          <note xml:id="n1o1ulq1" dur.ppq="1" dur="8" staff="3" oct="3" pname="b" stem.dir="up" accid.ges="f" />
         </beam>
        </layer>
       </staff>
       <staff xml:id="s16ypbjn" n="3">
        <layer xml:id="l10hdox9" n="5">
         <chord xml:id="c1rkce0w" dots="1" dur.ppq="12" dur="1">
          <note xml:id="nsgpeaa" oct="2" pname="e" accid.ges="f" />
          <note xml:id="nc49oud" oct="3" pname="e" accid.ges="f" />
         </chord>
        </layer>
       </staff>
       <slur xml:id="s13zf197" startid="#nfnj700" endid="#n138611h" curvedir="above" />
       <tie xml:id="tkjyqay" startid="#nfnj700" endid="#n1x9nzb6" />
       <beamSpan xml:id="b1ogboda" startid="#n1p7ac93" endid="#n18tlwm2" />
      </measure>
      <sb xml:id="s1q5yve4" />
      <measure xml:id="muga1ym" n="5">
       <staff xml:id="so4dekg" n="1">
        <layer xml:id="l4zeidc" n="1">
         <note xml:id="n1jh6qj0" dots="1" dur.ppq="3" dur="4" oct="5" pname="e" stem.dir="down" accid.ges="f">
          <verse xml:id="v182n58l" n="1">
           <syl xml:id="s1a2ygru" con="d" wordpos="i">Tön</syl>
          </verse>
          <verse xml:id="v1x1bi5y" n="2">
           <syl xml:id="s14p1uk2" con="s" wordpos="s">wird</syl>
          </verse>
          <verse xml:id="vxxiddz" n="3">
           <syl xml:id="sbt7wd2" con="s" wordpos="s">dich</syl>
          </verse>
         </note>
         <note xml:id="n13nygul" dur.ppq="2" dur="4" oct="5" pname="e" stem.dir="down" accid.ges="f" />
         <note xml:id="n1nbfjby" dur.ppq="1" dur="8" oct="4" pname="g" stem.dir="up">
          <verse xml:id="vv1jsyp" n="1">
           <syl xml:id="s1ib3z7g" con="s" wordpos="t">ten</syl>
          </verse>
          <verse xml:id="vbw6oyt" n="2">
           <syl xml:id="s6p7ntf" con="d" wordpos="i">lust</syl>
          </verse>
          <verse xml:id="v9zxck8" n="3">
           <syl xml:id="s12xbs4d" con="s" wordpos="s">dies</syl>
          </verse>
         </note>
         <note xml:id="npguq8h" dots="1" dur.ppq="3" dur="4" oct="4" pname="g" stem.dir="up">
          <verse xml:id="v66flml" n="1">
           <syl xml:id="s1gjft2i" con="d" wordpos="i">Vö</syl>
          </verse>
          <verse xml:id="v1d22gpx" n="2">
           <syl xml:id="s17ghkob" con="d" wordpos="m">wand</syl>
          </verse>
          <verse xml:id="v1kwfai3" n="3">
           <syl xml:id="s4lr801" con="d" wordpos="i">wal</syl>
          </verse>
         </note>
         <note xml:id="n1me2k07" dur.ppq="2" dur="4" oct="4" pname="f" stem.dir="up">
          <verse xml:id="v1f7r11q" n="1">
           <syl xml:id="s1mxznd0" con="s" wordpos="t">gel</syl>
          </verse>
          <verse xml:id="v187vgx4" n="2">
           <syl xml:id="s1qcbvj6" con="s" wordpos="t">eln</syl>
          </verse>
          <verse xml:id="v1dm0yk" n="3">
           <syl xml:id="so8uigt" con="d" wordpos="m">len</syl>
          </verse>
         </note>
         <note xml:id="n1v4guyu" dur.ppq="1" dur="8" oct="4" pname="g" stem.dir="up">
          <verse xml:id="v4qdse3" n="1">
           <syl xml:id="sdz6lyq" con="s" wordpos="s">aus</syl>
          </verse>
          <verse xml:id="v1eqmknx" n="2">
           <syl xml:id="sfnzcgo" con="s" wordpos="s">mit</syl>
          </verse>
          <verse xml:id="v1x50bnj" n="3">
           <syl xml:id="siuxryh" con="s" wordpos="t">de</syl>
          </verse>
         </note>
        </layer>
       </staff>
       <staff xml:id="s167uf94" n="2">
        <layer xml:id="lj91v7g" n="1">
         <beam xml:id="buwp9l">
          <note xml:id="nya9z8w" dur.ppq="1" dur="8" staff="3" oct="3" pname="g" stem.dir="up" />
          <note xml:id="n4eb7fj" dur.ppq="1" dur="8" staff="3" oct="3" pname="b" stem.dir="up" accid.ges="f" />
          <note xml:id="n1306ou8" dur.ppq="1" dur="8" oct="4" pname="e" stem.dir="down" accid.ges="f" />
          <note xml:id="n15yuoxh" dur.ppq="1" dur="8" oct="4" pname="g" stem.dir="down" />
          <note xml:id="n1ul1nyc" dur.ppq="1" dur="8" oct="4" pname="e" stem.dir="down" accid.ges="f" />
          <note xml:id="n2q882h" dur.ppq="1" dur="8" staff="3" oct="3" pname="b" stem.dir="up" accid.ges="f" />
         </beam>
         <rest xml:id="r1wun8uy" dur.ppq="1" dur="8" ploc="d" oloc="5" />
         <beam xml:id="bghigrz">
          <note xml:id="n12h327f" dur.ppq="1" dur="8" staff="3" oct="3" pname="b" stem.dir="up" accid.ges="f" />
          <note xml:id="n1twghw7" dur.ppq="1" dur="8" oct="4" pname="e" stem.dir="down" accid.ges="f" />
          <note xml:id="n11ssovw" dur.ppq="1" dur="8" oct="4" pname="g" stem.dir="down" />
          <note xml:id="n1kmitn1" dur.ppq="1" dur="8" oct="4" pname="e" stem.dir="down" accid.ges="f" />
          <note xml:id="n1vc38i7" dur.ppq="1" dur="8" staff="3" oct="3" pname="b" stem.dir="up" accid.ges="f" />
         </beam>
        </layer>
        <layer xml:id="l9mbrgc" n="2">
         <note xml:id="n1p32fko" dots="1" dur.ppq="6" dur="2" oct="4" pname="d" stem.dir="up">
          <accid xml:id="anf92ir" accid="f" />
         </note>
         <note xml:id="npvqs8d" dots="1" dur.ppq="6" dur="2" oct="4" pname="d" stem.dir="up" accid.ges="f" />
        </layer>
       </staff>
       <staff xml:id="s5u5nh5" n="3">
        <layer xml:id="l1oihe6w" n="5">
         <chord xml:id="c1t0145o" dots="1" dur.ppq="12" dur="1">
          <note xml:id="n169ubo9" oct="2" pname="e" accid.ges="f" />
          <note xml:id="n41y442" oct="3" pname="e" accid.ges="f" />
         </chord>
        </layer>
       </staff>
       <tie xml:id="t1ularta" startid="#n1jh6qj0" endid="#n13nygul" />
      </measure>
      <measure xml:id="m1xvhdom" n="6">
       <staff xml:id="sdoas8r" n="1">
        <layer xml:id="l1rd41yj" n="1">
         <note xml:id="n1wk9iga" dots="1" dur.ppq="3" dur="4" oct="4" pname="a" stem.dir="up" accid.ges="f">
          <verse xml:id="vgfm0j1" n="1">
           <syl xml:id="syjv1by" con="d" wordpos="i">Blü</syl>
          </verse>
          <verse xml:id="vauqpan" n="2">
           <syl xml:id="s1quyyyk" con="s" wordpos="s">mir</syl>
          </verse>
          <verse xml:id="vvhbvrd" n="3">
           <syl xml:id="s1izuqmu" con="s" wordpos="s">Herz</syl>
          </verse>
         </note>
         <note xml:id="n13tavnh" dots="1" dur.ppq="3" dur="4" oct="4" pname="b" stem.dir="down" accid.ges="f">
          <verse xml:id="v1xrmb8s" n="1">
           <syl xml:id="sgmrxjd" con="s" wordpos="t">ten</syl>
          </verse>
          <verse xml:id="vqxzt9l" n="2">
           <syl xml:id="shclghj" con="s" wordpos="s">in</syl>
          </verse>
          <verse xml:id="v9ae6pb" n="3">
           <syl xml:id="sgs4iar" con="s" wordpos="s">voll</syl>
          </verse>
         </note>
         <note xml:id="n1tcpmni" dots="1" dur.ppq="3" dur="4" oct="5" pname="c" stem.dir="down">
          <accid xml:id="aqy9laa" accid="f" />
          <verse xml:id="vevpobb" n="1">
           <syl xml:id="s4wn1au" con="s" wordpos="s">mir</syl>
          </verse>
          <verse xml:id="v7c6apk" n="2">
           <syl xml:id="s6wx82" con="d" wordpos="i">Gär</syl>
          </verse>
          <verse xml:id="vojckd5" n="3">
           <syl xml:id="s1j22ky" con="d" wordpos="i">süs</syl>
          </verse>
         </note>
         <note xml:id="n1x58wey" dots="1" dur.ppq="3" dur="4" oct="4" pname="d" stem.dir="up">
          <verse xml:id="v1yvwdt5" n="1">
           <syl xml:id="smmekxr" con="s" wordpos="s">das</syl>
          </verse>
          <verse xml:id="vgeiier" n="2">
           <syl xml:id="s6m4phe" con="s" wordpos="t">ten</syl>
          </verse>
          <verse xml:id="vn2p0ay" n="3">
           <syl xml:id="s1xll0mo" con="s" wordpos="t">ser</syl>
          </verse>
         </note>
        </layer>
       </staff>
       <staff xml:id="scughaj" n="2">
        <layer xml:id="ljlctx9" n="1">
         <beam xml:id="bmermox">
          <note xml:id="npvf9mq" dur.ppq="1" dur="8" oct="4" pname="c" stem.dir="up">
           <accid xml:id="atoz658" accid="f" />
          </note>
          <note xml:id="n1lkp2xj" dur.ppq="1" dur="8" oct="4" pname="e" stem.dir="up" accid.ges="f" />
          <note xml:id="n9d68i5" dur.ppq="1" dur="8" oct="4" pname="a" stem.dir="up" accid.ges="f" />
          <note xml:id="n1sty7px" dur.ppq="1" dur="8" oct="3" pname="b" stem.dir="up" accid.ges="f" />
          <note xml:id="n1snvj2m" dur.ppq="1" dur="8" oct="4" pname="e" stem.dir="up" accid.ges="f" />
          <note xml:id="n4zjfj9" dur.ppq="1" dur="8" oct="4" pname="g" stem.dir="up" />
         </beam>
         <beam xml:id="b1glukbj">
          <note xml:id="ngsjksk" dur.ppq="1" dur="8" oct="3" pname="a" stem.dir="up" accid.ges="f" />
          <note xml:id="n1p8w7z7" dur.ppq="1" dur="8" oct="4" pname="c" stem.dir="up">
           <accid xml:id="aywlgzi" accid="f" />
          </note>
          <note xml:id="n1ih4ciy" dur.ppq="1" dur="8" oct="4" pname="f" stem.dir="up" />
          <note xml:id="nsa5yss" dur.ppq="1" dur="8" oct="3" pname="a" stem.dir="up" accid.ges="f" />
          <note xml:id="n1lhnpdm" dur.ppq="1" dur="8" oct="4" pname="c" stem.dir="up" accid.ges="f" />
          <note xml:id="n17mw9qo" dur.ppq="1" dur="8" oct="4" pname="f" stem.dir="up" />
         </beam>
        </layer>
       </staff>
       <staff xml:id="s1b21xr6" n="3">
        <layer xml:id="l163x3mg" n="5">
         <chord xml:id="c1kio6l3" dots="1" dur.ppq="12" dur="1">
          <note xml:id="n1mfg6un" oct="2" pname="e" accid.ges="f" />
          <note xml:id="n16y4i2j" oct="3" pname="e" accid.ges="f" />
         </chord>
        </layer>
       </staff>
      </measure>
      <measure xml:id="m1s2fjes" n="7">
       <staff xml:id="s1xkbkd9" n="1">
        <layer xml:id="lvnt375" n="1">
         <note xml:id="n5s70iq" dots="1" dur.ppq="3" dur="4" oct="4" pname="e" stem.dir="up" accid.ges="f">
          <verse xml:id="v1twrm3s" n="1">
           <syl xml:id="s71p7tt" con="d" wordpos="i">Braut</syl>
          </verse>
          <verse xml:id="vzmho5l" n="2">
           <syl xml:id="s10exbxk" con="d" wordpos="i">Got</syl>
          </verse>
          <verse xml:id="v1w8ezj8" n="3">
           <syl xml:id="s1rijeei" con="d" wordpos="i">Ahn</syl>
          </verse>
         </note>
         <beam xml:id="b1f0uo1e">
          <note xml:id="n4sc5ws" dur.ppq="1" dur="8" oct="4" pname="e" stem.dir="up" accid.ges="f" />
          <note xml:id="nfd821c" dur.ppq="1" dur="8" oct="4" pname="g" stem.dir="up" />
          <note xml:id="n1ks2sd3" dur.ppq="1" dur="8" oct="4" pname="f" stem.dir="up" />
         </beam>
         <note xml:id="n15k63xg" dots="1" dur.ppq="3" dur="4" oct="4" pname="e" stem.dir="up" accid.ges="f">
          <verse xml:id="v1xdnx9g" n="1">
           <syl xml:id="s1g3qgf2" con="s" wordpos="t">lied,</syl>
          </verse>
          <verse xml:id="v135z8zc" n="2">
           <syl xml:id="s158xa9u" con="s" wordpos="t">tes,</syl>
          </verse>
          <verse xml:id="vx47t8j" n="3">
           <syl xml:id="sf07mfr" con="s" wordpos="t">dung,</syl>
          </verse>
         </note>
         <rest xml:id="r14gmq0j" dots="1" dur.ppq="3" dur="4" />
        </layer>
       </staff>
       <staff xml:id="s33asf6" n="2">
        <layer xml:id="l1vbvk69" n="1">
         <note xml:id="naiyqpa" dur.ppq="1" dur="8" staff="3" oct="3" pname="g" stem.dir="up" />
         <note xml:id="n1g7zlrq" dur.ppq="1" dur="8" staff="3" oct="3" pname="b" stem.dir="up" accid.ges="f" />
         <note xml:id="n1a75mp1" dur.ppq="1" dur="8" oct="4" pname="e" stem.dir="down" accid.ges="f" />
         <note xml:id="n53hctg" dur.ppq="1" dur="8" staff="3" oct="3" pname="a" stem.dir="up" accid.ges="f" />
         <note xml:id="n19awkwd" dur.ppq="1" dur="8" staff="3" oct="4" pname="c" stem.dir="up">
          <accid xml:id="a1oi3ze0" accid="f" />
         </note>
         <note xml:id="n135s7yi" dur.ppq="1" dur="8" oct="4" pname="e" stem.dir="down" accid.ges="f" />
         <beam xml:id="b1ku8aq">
          <note xml:id="n128dwmz" dur.ppq="1" dur="8" staff="3" oct="3" pname="g" stem.dir="up" />
          <note xml:id="n8jjihq" dur.ppq="1" dur="8" staff="3" oct="3" pname="b" stem.dir="up" accid.ges="f" />
          <note xml:id="n1hsz5k2" dur.ppq="1" dur="8" oct="4" pname="e" stem.dir="down" accid.ges="f" />
          <note xml:id="nla6blx" dur.ppq="1" dur="8" oct="4" pname="g" stem.dir="down" />
          <note xml:id="nygnkno" dur.ppq="1" dur="8" oct="4" pname="e" stem.dir="down" accid.ges="f" />
          <note xml:id="n1evr2sm" dur.ppq="1" dur="8" staff="3" oct="3" pname="b" stem.dir="up" accid.ges="f" />
         </beam>
        </layer>
       </staff>
       <staff xml:id="s1u7fh3p" n="3">
        <layer xml:id="l1y72428" n="5">
         <chord xml:id="cdwymrh" dots="1" dur.ppq="12" dur="1">
          <note xml:id="n4usx7p" oct="2" pname="e" accid.ges="f" />
          <note xml:id="n1xznsrf" oct="3" pname="e" accid.ges="f" />
         </chord>
        </layer>
       </staff>
       <slur xml:id="s1wkjh2m" startid="#n5s70iq" endid="#n1ks2sd3" curvedir="below" />
       <tie xml:id="t3rd5j0" startid="#n5s70iq" endid="#n4sc5ws" />
       <beamSpan xml:id="b9fic1m" startid="#naiyqpa" endid="#n135s7yi" />
      </measure>
      <measure xml:id="m1gbwp4c" n="8">
       <staff xml:id="s16ssdy6" n="1">
        <layer xml:id="l19th456" n="1">
         <note xml:id="np9mtjj" dots="1" dur.ppq="3" dur="4" oct="4" pname="f" stem.dir="up">
          <verse xml:id="vi7yfbt" n="1">
           <syl xml:id="sw678g3" con="s" wordpos="s">dann,</syl>
          </verse>
          <verse xml:id="v1sxmzel" n="2">
           <syl xml:id="s1twch2w" con="s" wordpos="s">wird</syl>
          </verse>
          <verse xml:id="v1u53twm" n="3">
           <syl xml:id="s1onprxa" con="d" wordpos="i">trü</syl>
          </verse>
         </note>
         <rest xml:id="r1yv00pm" dur.ppq="2" dur="4" />
         <note xml:id="n1wvrvl" dur.ppq="1" dur="8" oct="4" pname="f" stem.dir="up">
          <verse xml:id="vqdnmxc" n="1">
           <syl xml:id="sz2v1w6" con="s" wordpos="s">dann</syl>
          </verse>
          <verse xml:id="v1xs0ar6" n="2">
           <syl xml:id="s19l5g85" con="s" wordpos="s">in</syl>
          </verse>
          <verse xml:id="vc1qpuy" n="3">
           <syl xml:id="s1ok5b3d" con="s" wordpos="t">be</syl>
          </verse>
         </note>
         <note xml:id="n1cqoqvs" dots="1" dur.ppq="3" dur="4" oct="4" pname="g" stem.dir="up">
          <accid xml:id="aqyedhf" accid="f" />
          <verse xml:id="v1701p53" n="1">
           <syl xml:id="s1lrbp1s" con="s" wordpos="s">hätt'</syl>
          </verse>
          <verse xml:id="v10y7i3o" n="2">
           <syl xml:id="s1s4u2vq" con="d" wordpos="i">mei</syl>
          </verse>
          <verse xml:id="v54fcnv" n="3">
           <syl xml:id="s1ya5qwn" con="s" wordpos="s">floss</syl>
          </verse>
         </note>
         <note xml:id="nqr48eo" dots="1" dur.ppq="3" dur="4" oct="4" pname="g" stem.dir="up" accid.ges="f">
          <verse xml:id="v91xw4l" n="1">
           <syl xml:id="svyljdl" con="s" wordpos="s">ich</syl>
          </verse>
          <verse xml:id="vug0ca5" n="2">
           <syl xml:id="s1koi564" con="s" wordpos="t">nen</syl>
          </verse>
          <verse xml:id="vycsvxp" n="3">
           <syl xml:id="s11ahvib" con="s" wordpos="s">mein</syl>
          </verse>
         </note>
        </layer>
       </staff>
       <staff xml:id="s2k810t" n="2">
        <layer xml:id="lbbk6bu" n="1">
         <beam xml:id="bfoai3">
          <note xml:id="n1lbomwh" dur.ppq="1" dur="8" staff="3" oct="3" pname="f" stem.dir="up" />
          <note xml:id="n1sgmytv" dur.ppq="1" dur="8" staff="3" oct="3" pname="b" stem.dir="up" accid.ges="f" />
          <note xml:id="nogwmaf" dur.ppq="1" dur="8" oct="4" pname="d" stem.dir="down" />
          <note xml:id="nzp6fq9" dur.ppq="1" dur="8" oct="4" pname="f" stem.dir="down" />
          <note xml:id="n11rx1sn" dur.ppq="1" dur="8" oct="4" pname="d" stem.dir="down" />
          <note xml:id="n4xdvdj" dur.ppq="1" dur="8" staff="3" oct="3" pname="b" stem.dir="up" accid.ges="f" />
         </beam>
         <beam xml:id="b1q9toit">
          <note xml:id="nlwy6r0" dur.ppq="1" dur="8" staff="3" oct="3" pname="g" stem.dir="up">
           <accid xml:id="a1ofi788" accid="f" />
          </note>
          <note xml:id="n11v9p79" dur.ppq="1" dur="8" staff="3" oct="3" pname="b" stem.dir="up" accid.ges="f" />
          <note xml:id="n1n7nmpl" dur.ppq="1" dur="8" oct="4" pname="e" stem.dir="down" accid.ges="f" />
          <note xml:id="n15yj259" dur.ppq="1" dur="8" oct="4" pname="g" stem.dir="down">
           <accid xml:id="a38u58x" accid="f" />
          </note>
          <note xml:id="n64n8s8" dur.ppq="1" dur="8" oct="4" pname="e" stem.dir="down" accid.ges="f" />
          <note xml:id="nttka77" dur.ppq="1" dur="8" staff="3" oct="3" pname="b" stem.dir="up" accid.ges="f" />
         </beam>
        </layer>
       </staff>
       <staff xml:id="scudmep" n="3">
        <layer xml:id="lbz653e" n="5">
         <note xml:id="n16ikmql" dots="1" dur.ppq="12" dur="1" oct="2" pname="b" accid.ges="f" />
        </layer>
       </staff>
      </measure>
      <measure xml:id="m1ax9a5p" n="9">
       <staff xml:id="shl24qr" n="1">
        <layer xml:id="l2ojkk4" n="1">
         <note xml:id="n1f5malb" dots="1" dur.ppq="3" dur="4" oct="4" pname="a" stem.dir="up">
          <accid xml:id="a17db30v" accid="n" />
          <verse xml:id="vke21wb" n="1">
           <syl xml:id="s1u8qcyy" con="d" wordpos="i">Se</syl>
          </verse>
          <verse xml:id="v1agmuml" n="2">
           <syl xml:id="slbgefh" con="d" wordpos="i">Ar</syl>
          </verse>
          <verse xml:id="v1o3ikxq" n="3">
           <syl xml:id="szgyvev" con="d" wordpos="i">Le</syl>
          </verse>
         </note>
         <note xml:id="n1p32j2w" dur.ppq="2" dur="4" oct="4" pname="a" stem.dir="up">
          <verse xml:id="v2biv1w" n="1">
           <syl xml:id="sg7cp4z" con="d" wordpos="m">li</syl>
          </verse>
          <verse xml:id="v14z86ls" n="2">
           <syl xml:id="sw6fawu" con="s" wordpos="t">men</syl>
          </verse>
          <verse xml:id="v13sjjmq" n="3">
           <syl xml:id="s1cqg9ii" con="s" wordpos="t">ben,</syl>
          </verse>
         </note>
         <note xml:id="n1u11l5h" dur.ppq="1" dur="8" oct="4" pname="a" stem.dir="up">
          <verse xml:id="v16jne9" n="1">
           <syl xml:id="s2ip10a" con="s" wordpos="t">ger</syl>
          </verse>
          <verse xml:id="vy6uiwo" n="2">
           <syl xml:id="s92r39z" con="d" wordpos="i">ge</syl>
          </verse>
          <verse xml:id="v1htzm3r" n="3">
           <syl xml:id="s1ip102r" con="s" wordpos="s">o</syl>
          </verse>
         </note>
         <note xml:id="nbv6att" dots="1" dur.ppq="3" dur="4" oct="4" pname="b" stem.dir="down" accid.ges="f">
          <verse xml:id="vc0buak" n="1">
           <syl xml:id="stnzua1" con="s" wordpos="s">schon</syl>
          </verse>
          <verse xml:id="vdhkkrk" n="2">
           <syl xml:id="s1hk6itv" con="s" wordpos="t">wiegt</syl>
          </verse>
          <verse xml:id="v1o0zpdj" n="3">
           <syl xml:id="s1n9udaa" con="d" wordpos="i">Him</syl>
          </verse>
         </note>
         <note xml:id="noonz4" dots="1" dur.ppq="3" dur="4" oct="5" pname="c" stem.dir="down">
          <verse xml:id="v1w9nbec" n="1">
           <syl xml:id="s11lt9s9" con="s" wordpos="s">auf</syl>
          </verse>
          <verse xml:id="v1wwxhvd" n="2">
           <syl xml:id="s1rq8mhl" con="s" wordpos="s">den</syl>
          </verse>
          <verse xml:id="v1vy48qp" n="3">
           <syl xml:id="s1bpyrvs" con="d" wordpos="m">mels</syl>
          </verse>
         </note>
        </layer>
       </staff>
       <staff xml:id="si2fs5e" n="2">
        <layer xml:id="l1idtyv6" n="1">
         <note xml:id="nly2mfw" dur.ppq="1" dur="8" staff="3" oct="3" pname="g" stem.dir="up">
          <accid xml:id="acsa62q" accid="f" />
         </note>
         <note xml:id="n18oyr0l" dur.ppq="1" dur="8" oct="4" pname="c" stem.dir="down" />
         <note xml:id="npb1t17" dur.ppq="1" dur="8" oct="4" pname="e" stem.dir="down" accid.ges="f" />
         <note xml:id="n6m60o0" dur.ppq="1" dur="8" oct="4" pname="g" stem.dir="down">
          <accid xml:id="a1m7vvqx" accid="f" />
         </note>
         <note xml:id="n9agryu" dur.ppq="1" dur="8" oct="4" pname="e" stem.dir="down" accid.ges="f" />
         <note xml:id="nxp7e1z" dur.ppq="1" dur="8" oct="4" pname="c" stem.dir="down" />
         <beam xml:id="bzuejbb">
          <note xml:id="n12q82kz" dur.ppq="1" dur="8" staff="3" oct="3" pname="f" stem.dir="up" />
          <note xml:id="n1wqxxbg" dur.ppq="1" dur="8" staff="3" oct="3" pname="b" stem.dir="up" accid.ges="f" />
          <note xml:id="n1482kz" dur.ppq="1" dur="8" oct="4" pname="d" stem.dir="down" />
          <note xml:id="nu0k8xr" dur.ppq="1" dur="8" oct="4" pname="f" stem.dir="down" />
          <note xml:id="nmbyhew" dur.ppq="1" dur="8" oct="4" pname="d" stem.dir="down" />
          <note xml:id="n1kle4fv" dur.ppq="1" dur="8" staff="3" oct="3" pname="b" stem.dir="up" accid.ges="f" />
         </beam>
        </layer>
       </staff>
       <staff xml:id="s1opyel9" n="3">
        <layer xml:id="l6vrigx" n="5">
         <note xml:id="ngqya0c" dots="1" dur.ppq="12" dur="1" oct="2" pname="b" accid.ges="f" />
        </layer>
        <layer xml:id="l16xxs14" n="6">
         <rest xml:id="r1aqhzr7" dots="1" dur.ppq="6" dur="2" ploc="a" oloc="3" />
         <note xml:id="nc1szke" dots="1" dur.ppq="6" dur="2" oct="3" pname="d" stem.dir="up" />
        </layer>
       </staff>
       <beamSpan xml:id="b1uwpt05" startid="#nly2mfw" endid="#nxp7e1z" />
      </measure>
      <sb xml:id="s1k4t4bj" />
      <measure xml:id="mka0n1b" n="10">
       <staff xml:id="s12s10il" n="1">
        <layer xml:id="l1nxcy6z" n="1">
         <note xml:id="n1l5qgig" dots="1" dur.ppq="3" dur="4" oct="5" pname="c" stem.dir="down">
          <verse xml:id="v1d2581" n="1">
           <syl xml:id="s16gyg73" con="d" wordpos="i">Er</syl>
          </verse>
          <verse xml:id="vdkvutt" n="2">
           <syl xml:id="s1nt5iug" con="d" wordpos="i">Früh</syl>
          </verse>
          <verse xml:id="v1pr8yxb" n="3">
           <syl xml:id="s1txce44" con="d" wordpos="m">bo</syl>
          </verse>
         </note>
         <note xml:id="n1ngdt9h" dots="1" dur.ppq="3" dur="4" oct="4" pname="b" stem.dir="down" accid.ges="f" />
         <note xml:id="n8yql76" dots="1" dur.ppq="3" dur="4" oct="5" pname="c" stem.dir="down">
          <verse xml:id="v1oye9b9" n="1">
           <syl xml:id="s1ue3i2s" con="s" wordpos="t">den</syl>
          </verse>
          <verse xml:id="v8ftwfg" n="2">
           <syl xml:id="s104alst" con="d" wordpos="m">lings</syl>
          </verse>
          <verse xml:id="vyg17ca" n="3">
           <syl xml:id="s119045w" con="s" wordpos="t">tin,</syl>
          </verse>
         </note>
         <note xml:id="n1s2u3a" dots="1" dur.ppq="3" dur="4" oct="5" pname="d" stem.dir="down" />
        </layer>
       </staff>
       <staff xml:id="s10owci0" n="2">
        <layer xml:id="l18f6cye" n="1">
         <note xml:id="neu00ha" dur.ppq="1" dur="8" staff="3" oct="3" pname="a" stem.dir="up" accid.ges="f" />
         <note xml:id="n8jv4tn" dur.ppq="1" dur="8" staff="3" oct="3" pname="b" stem.dir="up" accid.ges="f" />
         <note xml:id="n1d1ab6u" dur.ppq="1" dur="8" oct="4" pname="f" stem.dir="down" />
         <note xml:id="n1ffc1ks" dur.ppq="1" dur="8" oct="4" pname="a" stem.dir="down" accid.ges="f" />
         <note xml:id="nqu382f" dur.ppq="1" dur="8" oct="4" pname="f" stem.dir="down" />
         <note xml:id="n134yby4" dur.ppq="1" dur="8" oct="4" pname="d" stem.dir="down" />
         <beam xml:id="buiff1q">
          <note xml:id="n1wjz7ez" dur.ppq="1" dur="8" oct="3" pname="b" stem.dir="up" accid.ges="f" />
          <note xml:id="n1whtwrv" dur.ppq="1" dur="8" oct="4" pname="d" stem.dir="up" />
          <note xml:id="n1ybrnwm" dur.ppq="1" dur="8" oct="4" pname="f" stem.dir="up" />
          <note xml:id="ni3f0yi" dur.ppq="1" dur="8" oct="4" pname="b" stem.dir="up" accid.ges="f" />
          <note xml:id="n4vqit" dur.ppq="1" dur="8" oct="4" pname="f" stem.dir="up" />
          <note xml:id="n1rzmkd1" dur.ppq="1" dur="8" oct="4" pname="d" stem.dir="up" />
         </beam>
        </layer>
       </staff>
       <staff xml:id="s15dyprc" n="3">
        <layer xml:id="lqctyre" n="5">
         <chord xml:id="choba76" dots="1" dur.ppq="6" dur="2" stem.dir="down">
          <note xml:id="nv1n7s4" oct="2" pname="d" />
          <note xml:id="n1xnobhx" oct="2" pname="b" accid.ges="f" />
          <note xml:id="ns15sud" oct="3" pname="d" />
         </chord>
         <chord xml:id="c19f82rf" dots="1" dur.ppq="6" dur="2" stem.dir="down">
          <note xml:id="n3tokoj" oct="2" pname="a" accid.ges="f" />
          <note xml:id="nnmqgzm" oct="3" pname="a" accid.ges="f" />
         </chord>
        </layer>
       </staff>
       <slur xml:id="svrquun" startid="#n1l5qgig" endid="#n1ngdt9h" curvedir="above" />
       <slur xml:id="s11yegcg" startid="#n8yql76" endid="#n1s2u3a" curvedir="above" />
       <beamSpan xml:id="bgadbnc" startid="#neu00ha" endid="#n134yby4" />
      </measure>
      <measure xml:id="m1stnjix" n="11">
       <staff xml:id="s1nsy9oj" n="1">
        <layer xml:id="lajctld" n="1">
         <note xml:id="n1mek0fu" dots="1" dur.ppq="6" dur="2" oct="5" pname="e" stem.dir="down" accid.ges="f">
          <verse xml:id="v15qzehu" n="1">
           <syl xml:id="seb8uiw" con="d" wordpos="i">Won</syl>
          </verse>
          <verse xml:id="vz6ifks" n="2">
           <syl xml:id="s13tass6" con="d" wordpos="m">a</syl>
          </verse>
          <verse xml:id="v1trjxfg" n="3">
           <syl xml:id="s19ljkb3" con="u" wordpos="s">komm,</syl>
          </verse>
         </note>
         <beam xml:id="buve089">
          <note xml:id="nhixlty" dur.ppq="1" dur="8" oct="5" pname="e" stem.dir="down" accid.ges="f" />
          <note xml:id="n1hvph7m" dur.ppq="1" dur="8" oct="5" pname="a" stem.dir="down" accid.ges="f" />
          <note xml:id="n1a8sbed" dur.ppq="1" dur="8" oct="5" pname="g" stem.dir="down" />
         </beam>
         <beam xml:id="bdin5wf">
          <note xml:id="nz8oeh6" dur.ppq="1" dur="8" oct="5" pname="f" stem.dir="down">
           <verse xml:id="va8inyh" n="1">
            <syl xml:id="siqhu4z" con="s" wordpos="t">ne</syl>
           </verse>
           <verse xml:id="vqkw4ee" n="2">
            <syl xml:id="szbgf6l" con="s" wordpos="t">bend</syl>
           </verse>
           <verse xml:id="v70o3c5" n="3">
            <syl xml:id="sxynfo6" con="s" wordpos="s">es</syl>
           </verse>
          </note>
          <note xml:id="n1bouo1q" dur.ppq="1" dur="8" oct="5" pname="d" stem.dir="down" />
         </beam>
         <note xml:id="n64g9iq" dur.ppq="1" dur="8" oct="5" pname="e" stem.dir="down" accid.ges="f">
          <verse xml:id="v13hdaut" n="1">
           <syl xml:id="s1i57rst" con="s" wordpos="s">des</syl>
          </verse>
          <verse xml:id="v140yvh5" n="2">
           <syl xml:id="s1qsp6es" con="d" wordpos="i">be</syl>
          </verse>
          <verse xml:id="v1yqj9go" n="3">
           <syl xml:id="slmo8v" con="s" wordpos="s">zu</syl>
          </verse>
         </note>
        </layer>
       </staff>
       <staff xml:id="sy44if5" n="2">
        <layer xml:id="l1v7h05x" n="1">
         <beam xml:id="b1pooz50">
          <note xml:id="n5wzd5q" dur.ppq="1" dur="8" oct="3" pname="b" stem.dir="up" accid.ges="f" />
          <note xml:id="n1umtmd8" dur.ppq="1" dur="8" oct="4" pname="e" stem.dir="up" accid.ges="f" />
          <note xml:id="nfazx34" dur.ppq="1" dur="8" oct="4" pname="b" stem.dir="up" accid.ges="f" />
          <note xml:id="n147b2ls" dur.ppq="1" dur="8" oct="3" pname="b" stem.dir="up">
           <accid xml:id="a72w8de" accid="n" />
          </note>
          <note xml:id="nanyqaj" dur.ppq="1" dur="8" oct="4" pname="e" stem.dir="up" accid.ges="f" />
          <note xml:id="n1e7kr4s" dur.ppq="1" dur="8" oct="4" pname="b" stem.dir="up">
           <accid xml:id="a18es46q" accid="n" />
          </note>
         </beam>
         <beam xml:id="b1jb4s2f">
          <note xml:id="nyqjcnk" dur.ppq="1" dur="8" oct="4" pname="c" stem.dir="up" />
          <note xml:id="n1osyzdk" dur.ppq="1" dur="8" oct="4" pname="e" stem.dir="up" accid.ges="f" />
          <note xml:id="n1c9b9da" dur.ppq="1" dur="8" oct="4" pname="a" stem.dir="up" accid.ges="f" />
          <note xml:id="ngz48zw" dur.ppq="1" dur="8" oct="5" pname="c" stem.dir="up" />
          <note xml:id="nyw4f9w" dur.ppq="1" dur="8" oct="4" pname="a" stem.dir="up" accid.ges="f" />
          <note xml:id="njfba94" dur.ppq="1" dur="8" oct="4" pname="e" stem.dir="up" accid.ges="f" />
         </beam>
        </layer>
       </staff>
       <staff xml:id="s1fn20h5" n="3">
        <layer xml:id="lq33dr0" n="5">
         <chord xml:id="clfe7uj" dots="1" dur.ppq="6" dur="2" stem.dir="up">
          <note xml:id="nqzngww" oct="2" pname="g" />
          <note xml:id="ntoh49i" oct="3" pname="g" />
         </chord>
         <chord xml:id="c1te7m1o" dots="1" dur.ppq="6" dur="2" stem.dir="down">
          <note xml:id="n126lkyb" oct="2" pname="a" accid.ges="f" />
          <note xml:id="n1vlqk4o" oct="3" pname="a" accid.ges="f" />
         </chord>
        </layer>
       </staff>
       <slur xml:id="smtflp4" startid="#n1mek0fu" endid="#n1a8sbed" curvedir="above" />
       <tie xml:id="tn0ghhn" startid="#n1mek0fu" endid="#nhixlty" />
       <slur xml:id="sw6yju8" startid="#nz8oeh6" endid="#n1bouo1q" curvedir="above" />
      </measure>
      <measure xml:id="m18or31a" n="12">
       <staff xml:id="s1azwncu" n="1">
        <layer xml:id="lu4oftt" n="1">
         <note xml:id="n1x7vk2g" dots="1" dur.ppq="6" dur="2" oct="5" pname="e" stem.dir="down" accid.ges="f">
          <verse xml:id="vyxicay" n="1">
           <syl xml:id="s5fx4w5" con="d" wordpos="i">Him</syl>
          </verse>
          <verse xml:id="v1qyq9eq" n="2">
           <syl xml:id="s1ww4o1n" con="d" wordpos="m">flü</syl>
          </verse>
          <verse xml:id="v5ydopn" n="3">
           <syl xml:id="s1idtn2g" con="d" wordpos="i">hei</syl>
          </verse>
         </note>
         <note xml:id="n1vlou7s" dots="1" dur.ppq="6" dur="2" oct="4" pname="b" stem.dir="down" accid.ges="f" />
        </layer>
       </staff>
       <staff xml:id="s8esnn7" n="2">
        <layer xml:id="l5mhr15" n="1">
         <beam xml:id="bfbsnp">
          <chord xml:id="c141lw96" dur.ppq="1" dur="8" stem.dir="up">
           <note xml:id="naz9uvb" oct="3" pname="g" />
           <note xml:id="n1jzitbh" oct="4" pname="g" />
          </chord>
          <note xml:id="n1pgnjuc" dur.ppq="1" dur="8" oct="3" pname="b" stem.dir="up" accid.ges="f" />
          <note xml:id="niwu173" dur.ppq="1" dur="8" oct="4" pname="e" stem.dir="up" accid.ges="f" />
          <chord xml:id="c1sra7uj" dur.ppq="1" dur="8" stem.dir="up">
           <note xml:id="nw2y66x" oct="3" pname="g">
            <accid xml:id="a10694b5" accid="f" />
           </note>
           <note xml:id="n1vc42j8" oct="4" pname="g">
            <accid xml:id="a1yzr4rb" accid="f" />
           </note>
          </chord>
          <note xml:id="nyc0iow" dur.ppq="1" dur="8" oct="3" pname="b" stem.dir="up" accid.ges="f" />
          <note xml:id="n1n08ijf" dur.ppq="1" dur="8" oct="4" pname="e" stem.dir="up" accid.ges="f" />
         </beam>
         <note xml:id="n1fggqkz" dur.ppq="1" dur="8" staff="3" oct="3" pname="f" stem.dir="up" />
         <note xml:id="n1eh0fe0" dur.ppq="1" dur="8" staff="3" oct="3" pname="a" stem.dir="up" accid.ges="f" />
         <note xml:id="nsux3mo" dur.ppq="1" dur="8" oct="4" pname="e" stem.dir="down" accid.ges="f" />
         <note xml:id="nutehrb" dur.ppq="1" dur="8" staff="3" oct="3" pname="f" stem.dir="up" />
         <note xml:id="n1xz22ty" dur.ppq="1" dur="8" staff="3" oct="3" pname="a" stem.dir="up" accid.ges="f" />
         <note xml:id="ny9hxvg" dur.ppq="1" dur="8" oct="4" pname="d" stem.dir="down" />
        </layer>
        <layer xml:id="l1av4hr2" n="2">
         <space xml:id="s1elbtqm" dots="1" dur.ppq="6" dur="2" />
         <note xml:id="n19vixjd" dots="1" dur.ppq="3" dur="4" oct="4" pname="f" stem.dir="up" />
         <note xml:id="n7t3on7" dots="1" dur.ppq="3" dur="4" oct="4" pname="f" stem.dir="up" />
        </layer>
       </staff>
       <staff xml:id="spuzw5j" n="3">
        <layer xml:id="l164e8tr" n="5">
         <note xml:id="n4mp8ta" dots="1" dur.ppq="12" dur="1" oct="2" pname="b" accid.ges="f" />
        </layer>
       </staff>
       <slur xml:id="smpy8ao" startid="#n1x7vk2g" endid="#n1vlou7s" curvedir="above" />
       <beamSpan xml:id="brwojdq" startid="#n1fggqkz" endid="#ny9hxvg" />
      </measure>
      <measure xml:id="mvg38xn" right="rptend" n="13">
       <staff xml:id="s3tmg1w" n="1">
        <layer xml:id="lw9y7ks" n="1">
         <note xml:id="n43jwwn" dots="1" dur.ppq="3" dur="4" oct="4" pname="e" stem.dir="up" accid.ges="f">
          <verse xml:id="v10r41fw" n="1">
           <syl xml:id="s7ehlab" con="s" wordpos="t">mels.</syl>
          </verse>
          <verse xml:id="v1igizot" n="2">
           <syl xml:id="s15yspmy" con="s" wordpos="t">geln.</syl>
          </verse>
          <verse xml:id="vr9qgf1" n="3">
           <syl xml:id="syae7t5" con="s" wordpos="t">tern.</syl>
          </verse>
         </note>
         <rest xml:id="r13y8n7r" dur.ppq="2" dur="4" />
         <rest xml:id="r1cx2syd" dur.ppq="1" dur="8" />
         <rest xml:id="ry2hu3p" dots="1" dur.ppq="6" dur="2" />
        </layer>
       </staff>
       <staff xml:id="s1xhcw0s" n="2">
        <layer xml:id="ljj2sui" n="1">
         <beam xml:id="b1avks4r">
          <note xml:id="n143qlwf" dur.ppq="1" dur="8" staff="3" oct="3" pname="g" stem.dir="up" />
          <note xml:id="n178zmaz" dur.ppq="1" dur="8" staff="3" oct="3" pname="b" stem.dir="up" accid.ges="f" />
          <note xml:id="n10ak8tn" dur.ppq="1" dur="8" oct="4" pname="e" stem.dir="down" accid.ges="f" />
          <note xml:id="n1vx6vo2" dur.ppq="1" dur="8" oct="4" pname="g" stem.dir="down" />
          <note xml:id="n6ekgh7" dur.ppq="1" dur="8" oct="4" pname="e" stem.dir="down" accid.ges="f" />
          <note xml:id="n1gfrl7q" dur.ppq="1" dur="8" staff="3" oct="3" pname="b" stem.dir="up" accid.ges="f" />
         </beam>
         <beam xml:id="bqzaodl">
          <note xml:id="n1w8ounj" dur.ppq="1" dur="8" staff="3" oct="3" pname="g" stem.dir="up" />
          <note xml:id="nw5vedb" dur.ppq="1" dur="8" staff="3" oct="3" pname="b" stem.dir="up" accid.ges="f" />
          <note xml:id="n15yz8j3" dur.ppq="1" dur="8" oct="4" pname="e" stem.dir="down" accid.ges="f" />
          <note xml:id="nplxle0" dur.ppq="1" dur="8" oct="4" pname="g" stem.dir="down" />
          <note xml:id="n1xubem5" dur.ppq="1" dur="8" oct="4" pname="e" stem.dir="down" accid.ges="f" />
          <note xml:id="nxpfc2y" dur.ppq="1" dur="8" staff="3" oct="3" pname="b" stem.dir="up" accid.ges="f" />
         </beam>
        </layer>
        <layer xml:id="l1wkxbb8" n="2">
         <note xml:id="nwyiuqy" dots="1" dur.ppq="3" dur="4" oct="4" pname="e" stem.dir="up" accid.ges="f" />
         <rest xml:id="r2ytfz4" dur.ppq="2" dur="4" ploc="a" oloc="5" />
         <rest xml:id="rxh46tw" dur.ppq="1" dur="8" ploc="a" oloc="5" />
         <rest xml:id="r191bbwm" dots="1" dur.ppq="6" dur="2" ploc="f" oloc="5" />
        </layer>
       </staff>
       <staff xml:id="sxkjx0z" n="3">
        <layer xml:id="lvqtgum" n="5">
         <chord xml:id="c1qs24d2" dots="1" dur.ppq="12" dur="1">
          <note xml:id="n1n0xo20" oct="2" pname="e" accid.ges="f" />
          <note xml:id="nyz4mtf" oct="3" pname="e" accid.ges="f" />
         </chord>
        </layer>
       </staff>
      </measure>
      <measure xml:id="m590cmt" right="end" n="14">
       <staff xml:id="s1xsakp9" n="1">
        <layer xml:id="l7xv5zd" n="1">
         <mRest xml:id="m20d832" />
        </layer>
       </staff>
       <staff xml:id="s1093ai8" n="2">
        <layer xml:id="lcublk" n="1">
         <mRest xml:id="m12qgmka" />
        </layer>
       </staff>
       <staff xml:id="s14g695t" n="3">
        <layer xml:id="l1yfg3vm" n="5">
         <chord xml:id="c1mzgz47" dots="1" dur.ppq="12" dur="1">
          <note xml:id="new8dm8" oct="2" pname="e" accid.ges="f" />
          <note xml:id="n8u3i0e" oct="2" pname="b" accid.ges="f" />
          <note xml:id="n1nurnyz" oct="3" pname="e" accid.ges="f" />
          <note xml:id="ngla7yn" oct="3" pname="g" />
         </chord>
        </layer>
       </staff>
      </measure>
     </section>
    </score>
   </mdiv>
  </body>
 </music>
</mei>
