<?xml version="1.0" encoding="UTF-8" standalone="no"?>
<!DOCTYPE svg PUBLIC "-//W3C//DTD SVG 1.1//EN"
 "http://www.w3.org/Graphics/SVG/1.1/DTD/svg11.dtd">
<!-- Generated by graphviz version 2.43.0 (0)
 -->
<!-- Title: dependency&#45;cruiser output Pages: 1 -->
<svg width="762pt" height="898pt"
 viewBox="0.00 0.00 761.50 898.00" xmlns="http://www.w3.org/2000/svg" xmlns:xlink="http://www.w3.org/1999/xlink">
<g id="graph0" class="graph" transform="scale(1 1) rotate(0) translate(4 894)">
<title>dependency&#45;cruiser output</title>
<polygon fill="white" stroke="transparent" points="-4,4 -4,-894 757.5,-894 757.5,4 -4,4"/>
<g id="clust1" class="cluster">
<title>cluster_src</title>
<path fill="#ffffff" stroke="black" stroke-width="2" d="M20,-8C20,-8 733.5,-8 733.5,-8 739.5,-8 745.5,-14 745.5,-20 745.5,-20 745.5,-870 745.5,-870 745.5,-876 739.5,-882 733.5,-882 733.5,-882 20,-882 20,-882 14,-882 8,-876 8,-870 8,-870 8,-20 8,-20 8,-14 14,-8 20,-8"/>
<text text-anchor="middle" x="376.75" y="-870.8" font-family="Helvetica,sans-Serif" font-weight="bold" font-size="9.00">src</text>
</g>
<g id="clust2" class="cluster">
<title>cluster_src/components</title>
<path fill="#ffffff" stroke="black" stroke-width="2" d="M28,-16C28,-16 725.5,-16 725.5,-16 731.5,-16 737.5,-22 737.5,-28 737.5,-28 737.5,-844 737.5,-844 737.5,-850 731.5,-856 725.5,-856 725.5,-856 28,-856 28,-856 22,-856 16,-850 16,-844 16,-844 16,-28 16,-28 16,-22 22,-16 28,-16"/>
<text text-anchor="middle" x="376.75" y="-844.8" font-family="Helvetica,sans-Serif" font-weight="bold" font-size="9.00">components</text>
</g>
<g id="clust3" class="cluster">
<title>cluster_src/components/canvas&#45;addons</title>
<path fill="#ffffff" stroke="black" stroke-width="2" d="M137.5,-24C137.5,-24 345.5,-24 345.5,-24 351.5,-24 357.5,-30 357.5,-36 357.5,-36 357.5,-154 357.5,-154 357.5,-160 351.5,-166 345.5,-166 345.5,-166 137.5,-166 137.5,-166 131.5,-166 125.5,-160 125.5,-154 125.5,-154 125.5,-36 125.5,-36 125.5,-30 131.5,-24 137.5,-24"/>
<text text-anchor="middle" x="241.5" y="-154.8" font-family="Helvetica,sans-Serif" font-weight="bold" font-size="9.00">canvas&#45;addons</text>
</g>
<g id="clust4" class="cluster">
<title>cluster_src/components/canvas&#45;switchers</title>
<path fill="#ffffff" stroke="black" stroke-width="2" d="M136,-264C136,-264 369,-264 369,-264 375,-264 381,-270 381,-276 381,-276 381,-364 381,-364 381,-370 375,-376 369,-376 369,-376 136,-376 136,-376 130,-376 124,-370 124,-364 124,-364 124,-276 124,-276 124,-270 130,-264 136,-264"/>
<text text-anchor="middle" x="252.5" y="-364.8" font-family="Helvetica,sans-Serif" font-weight="bold" font-size="9.00">canvas&#45;switchers</text>
</g>
<g id="clust5" class="cluster">
<title>cluster_src/components/canvas</title>
<path fill="#ffffff" stroke="black" stroke-width="2" d="M269,-174C269,-174 708,-174 708,-174 714,-174 720,-180 720,-186 720,-186 720,-244 720,-244 720,-250 714,-256 708,-256 708,-256 269,-256 269,-256 263,-256 257,-250 257,-244 257,-244 257,-186 257,-186 257,-180 263,-174 269,-174"/>
<text text-anchor="middle" x="488.5" y="-244.8" font-family="Helvetica,sans-Serif" font-weight="bold" font-size="9.00">canvas</text>
</g>
<g id="clust6" class="cluster">
<title>cluster_src/components/players</title>
<path fill="#ffffff" stroke="black" stroke-width="2" d="M263,-384C263,-384 484,-384 484,-384 490,-384 496,-390 496,-396 496,-396 496,-454 496,-454 496,-460 490,-466 484,-466 484,-466 263,-466 263,-466 257,-466 251,-460 251,-454 251,-454 251,-396 251,-396 251,-390 257,-384 263,-384"/>
<text text-anchor="middle" x="373.5" y="-454.8" font-family="Helvetica,sans-Serif" font-weight="bold" font-size="9.00">players</text>
</g>
<g id="clust7" class="cluster">
<title>cluster_src/components/toolbars</title>
<path fill="#ffffff" stroke="black" stroke-width="2" d="M141.5,-474C141.5,-474 717.5,-474 717.5,-474 723.5,-474 729.5,-480 729.5,-486 729.5,-486 729.5,-818 729.5,-818 729.5,-824 723.5,-830 717.5,-830 717.5,-830 141.5,-830 141.5,-830 135.5,-830 129.5,-824 129.5,-818 129.5,-818 129.5,-486 129.5,-486 129.5,-480 135.5,-474 141.5,-474"/>
<text text-anchor="middle" x="429.5" y="-818.8" font-family="Helvetica,sans-Serif" font-weight="bold" font-size="9.00">toolbars</text>
</g>
<g id="clust8" class="cluster">
<title>cluster_src/components/toolbars/editing</title>
<path fill="#ffffff" stroke="black" stroke-width="2" d="M277.5,-482C277.5,-482 709.5,-482 709.5,-482 715.5,-482 721.5,-488 721.5,-494 721.5,-494 721.5,-702 721.5,-702 721.5,-708 715.5,-714 709.5,-714 709.5,-714 277.5,-714 277.5,-714 271.5,-714 265.5,-708 265.5,-702 265.5,-702 265.5,-494 265.5,-494 265.5,-488 271.5,-482 277.5,-482"/>
<text text-anchor="middle" x="493.5" y="-702.8" font-family="Helvetica,sans-Serif" font-weight="bold" font-size="9.00">editing</text>
</g>
<g id="clust9" class="cluster">
<title>cluster_src/components/toolbars/editing/editor&#45;fields</title>
<path fill="#ffffff" stroke="black" stroke-width="2" d="M401,-490C401,-490 701.5,-490 701.5,-490 707.5,-490 713.5,-496 713.5,-502 713.5,-502 713.5,-620 713.5,-620 713.5,-626 707.5,-632 701.5,-632 701.5,-632 401,-632 401,-632 395,-632 389,-626 389,-620 389,-620 389,-502 389,-502 389,-496 395,-490 401,-490"/>
<text text-anchor="middle" x="551.25" y="-620.8" font-family="Helvetica,sans-Serif" font-weight="bold" font-size="9.00">editor&#45;fields</text>
</g>
<g id="clust10" class="cluster">
<title>cluster_src/components/toolbars/toolbar&#45;container</title>
<path fill="#ffffff" stroke="black" stroke-width="2" d="M269,-722C269,-722 350,-722 350,-722 356,-722 362,-728 362,-734 362,-734 362,-792 362,-792 362,-798 356,-804 350,-804 350,-804 269,-804 269,-804 263,-804 257,-798 257,-792 257,-792 257,-734 257,-734 257,-728 263,-722 269,-722"/>
<text text-anchor="middle" x="309.5" y="-792.8" font-family="Helvetica,sans-Serif" font-weight="bold" font-size="9.00">toolbar&#45;container</text>
</g>
<g id="clust11" class="cluster">
<title>cluster_src/components/utils</title>
<path fill="#ffffff" stroke="black" stroke-width="2" d="M533.5,-414C533.5,-414 579.5,-414 579.5,-414 585.5,-414 591.5,-420 591.5,-426 591.5,-426 591.5,-454 591.5,-454 591.5,-460 585.5,-466 579.5,-466 579.5,-466 533.5,-466 533.5,-466 527.5,-466 521.5,-460 521.5,-454 521.5,-454 521.5,-426 521.5,-426 521.5,-420 527.5,-414 533.5,-414"/>
<text text-anchor="middle" x="556.5" y="-454.8" font-family="Helvetica,sans-Serif" font-weight="bold" font-size="9.00">utils</text>
</g>
<!-- src/components/AnalysisEditor.vue -->
<g id="node1" class="node">
<title>src/components/AnalysisEditor.vue</title>
<g id="a_node1"><a xlink:href="../../src/components/AnalysisEditor.vue" xlink:title="AnalysisEditor.vue">
<path fill="#41f083" stroke="black" d="M110,-166C110,-166 30,-166 30,-166 27,-166 24,-163 24,-160 24,-160 24,-154 24,-154 24,-151 27,-148 30,-148 30,-148 110,-148 110,-148 113,-148 116,-151 116,-154 116,-154 116,-160 116,-160 116,-163 113,-166 110,-166"/>
<text text-anchor="start" x="32" y="-154.8" font-family="Helvetica,sans-Serif" font-size="9.00">AnalysisEditor.vue</text>
</a>
</g>
</g>
<!-- src/components/canvas&#45;addons/CanvasScroller.vue -->
<g id="node2" class="node">
<title>src/components/canvas&#45;addons/CanvasScroller.vue</title>
<g id="a_node2"><a xlink:href="../../src/components/canvas-addons/CanvasScroller.vue" xlink:title="CanvasScroller.vue">
<path fill="#41f083" stroke="black" d="M225,-140C225,-140 140,-140 140,-140 137,-140 134,-137 134,-134 134,-134 134,-128 134,-128 134,-125 137,-122 140,-122 140,-122 225,-122 225,-122 228,-122 231,-125 231,-128 231,-128 231,-134 231,-134 231,-137 228,-140 225,-140"/>
<text text-anchor="start" x="142" y="-128.8" font-family="Helvetica,sans-Serif" font-size="9.00">CanvasScroller.vue</text>
</a>
</g>
</g>
<!-- src/components/AnalysisEditor.vue&#45;&gt;src/components/canvas&#45;addons/CanvasScroller.vue -->
<g id="edge1" class="edge">
<title>src/components/AnalysisEditor.vue&#45;&gt;src/components/canvas&#45;addons/CanvasScroller.vue</title>
<path fill="none" stroke="#000000" stroke-width="2" stroke-opacity="0.200000" d="M98.5,-147.91C98.5,-140.41 98.5,-131 98.5,-131 98.5,-131 127.64,-131 127.64,-131"/>
<polygon fill="#000000" fill-opacity="0.200000" stroke="#000000" stroke-width="2" stroke-opacity="0.200000" points="127.64,-133.1 133.64,-131 127.64,-128.9 127.64,-133.1"/>
</g>
<!-- src/components/canvas&#45;addons/ColorGenerator.vue -->
<g id="node3" class="node">
<title>src/components/canvas&#45;addons/ColorGenerator.vue</title>
<g id="a_node3"><a xlink:href="../../src/components/canvas-addons/ColorGenerator.vue" xlink:title="ColorGenerator.vue">
<path fill="#41f083" stroke="black" d="M225.5,-80C225.5,-80 139.5,-80 139.5,-80 136.5,-80 133.5,-77 133.5,-74 133.5,-74 133.5,-68 133.5,-68 133.5,-65 136.5,-62 139.5,-62 139.5,-62 225.5,-62 225.5,-62 228.5,-62 231.5,-65 231.5,-68 231.5,-68 231.5,-74 231.5,-74 231.5,-77 228.5,-80 225.5,-80"/>
<text text-anchor="start" x="141.5" y="-68.8" font-family="Helvetica,sans-Serif" font-size="9.00">ColorGenerator.vue</text>
</a>
</g>
</g>
<!-- src/components/AnalysisEditor.vue&#45;&gt;src/components/canvas&#45;addons/ColorGenerator.vue -->
<g id="edge2" class="edge">
<title>src/components/AnalysisEditor.vue&#45;&gt;src/components/canvas&#45;addons/ColorGenerator.vue</title>
<path fill="none" stroke="#000000" stroke-width="2" stroke-opacity="0.200000" d="M61.5,-147.8C61.5,-125.61 61.5,-71 61.5,-71 61.5,-71 127.28,-71 127.28,-71"/>
<polygon fill="#000000" fill-opacity="0.200000" stroke="#000000" stroke-width="2" stroke-opacity="0.200000" points="127.28,-73.1 133.28,-71 127.28,-68.9 127.28,-73.1"/>
</g>
<!-- src/components/canvas&#45;addons/Minimap.vue -->
<g id="node4" class="node">
<title>src/components/canvas&#45;addons/Minimap.vue</title>
<g id="a_node4"><a xlink:href="../../src/components/canvas-addons/Minimap.vue" xlink:title="Minimap.vue">
<path fill="#41f083" stroke="black" d="M211,-110C211,-110 154,-110 154,-110 151,-110 148,-107 148,-104 148,-104 148,-98 148,-98 148,-95 151,-92 154,-92 154,-92 211,-92 211,-92 214,-92 217,-95 217,-98 217,-98 217,-104 217,-104 217,-107 214,-110 211,-110"/>
<text text-anchor="start" x="156" y="-98.8" font-family="Helvetica,sans-Serif" font-size="9.00">Minimap.vue</text>
</a>
</g>
</g>
<!-- src/components/AnalysisEditor.vue&#45;&gt;src/components/canvas&#45;addons/Minimap.vue -->
<g id="edge3" class="edge">
<title>src/components/AnalysisEditor.vue&#45;&gt;src/components/canvas&#45;addons/Minimap.vue</title>
<path fill="none" stroke="#000000" stroke-width="2" stroke-opacity="0.200000" d="M79.5,-147.75C79.5,-131.85 79.5,-101 79.5,-101 79.5,-101 141.92,-101 141.92,-101"/>
<polygon fill="#000000" fill-opacity="0.200000" stroke="#000000" stroke-width="2" stroke-opacity="0.200000" points="141.92,-103.1 147.92,-101 141.92,-98.9 141.92,-103.1"/>
</g>
<!-- src/components/canvas&#45;addons/SourceScaler.vue -->
<g id="node5" class="node">
<title>src/components/canvas&#45;addons/SourceScaler.vue</title>
<g id="a_node5"><a xlink:href="../../src/components/canvas-addons/SourceScaler.vue" xlink:title="SourceScaler.vue">
<path fill="#41f083" stroke="black" d="M221,-50C221,-50 144,-50 144,-50 141,-50 138,-47 138,-44 138,-44 138,-38 138,-38 138,-35 141,-32 144,-32 144,-32 221,-32 221,-32 224,-32 227,-35 227,-38 227,-38 227,-44 227,-44 227,-47 224,-50 221,-50"/>
<text text-anchor="start" x="146" y="-38.8" font-family="Helvetica,sans-Serif" font-size="9.00">SourceScaler.vue</text>
</a>
</g>
</g>
<!-- src/components/AnalysisEditor.vue&#45;&gt;src/components/canvas&#45;addons/SourceScaler.vue -->
<g id="edge4" class="edge">
<title>src/components/AnalysisEditor.vue&#45;&gt;src/components/canvas&#45;addons/SourceScaler.vue</title>
<path fill="none" stroke="#000000" stroke-width="2" stroke-opacity="0.200000" d="M42.5,-147.9C42.5,-120.55 42.5,-41 42.5,-41 42.5,-41 131.82,-41 131.82,-41"/>
<polygon fill="#000000" fill-opacity="0.200000" stroke="#000000" stroke-width="2" stroke-opacity="0.200000" points="131.82,-43.1 137.82,-41 131.82,-38.9 131.82,-43.1"/>
</g>
<!-- src/components/canvas&#45;switchers/CanvasSwitcher.vue -->
<g id="node6" class="node">
<title>src/components/canvas&#45;switchers/CanvasSwitcher.vue</title>
<g id="a_node6"><a xlink:href="../../src/components/canvas-switchers/CanvasSwitcher.vue" xlink:title="CanvasSwitcher.vue">
<path fill="#41f083" stroke="black" d="M227,-305C227,-305 138,-305 138,-305 135,-305 132,-302 132,-299 132,-299 132,-293 132,-293 132,-290 135,-287 138,-287 138,-287 227,-287 227,-287 230,-287 233,-290 233,-293 233,-293 233,-299 233,-299 233,-302 230,-305 227,-305"/>
<text text-anchor="start" x="140" y="-293.8" font-family="Helvetica,sans-Serif" font-size="9.00">CanvasSwitcher.vue</text>
</a>
</g>
</g>
<!-- src/components/AnalysisEditor.vue&#45;&gt;src/components/canvas&#45;switchers/CanvasSwitcher.vue -->
<g id="edge5" class="edge">
<title>src/components/AnalysisEditor.vue&#45;&gt;src/components/canvas&#45;switchers/CanvasSwitcher.vue</title>
<path fill="none" stroke="#000000" stroke-width="2" stroke-opacity="0.200000" d="M93.5,-166.12C93.5,-197.04 93.5,-296 93.5,-296 93.5,-296 125.76,-296 125.76,-296"/>
<polygon fill="#000000" fill-opacity="0.200000" stroke="#000000" stroke-width="2" stroke-opacity="0.200000" points="125.76,-298.1 131.76,-296 125.76,-293.9 125.76,-298.1"/>
</g>
<!-- src/components/canvas/LabelCanvas.vue -->
<g id="node7" class="node">
<title>src/components/canvas/LabelCanvas.vue</title>
<g id="a_node7"><a xlink:href="../../src/components/canvas/LabelCanvas.vue" xlink:title="LabelCanvas.vue">
<path fill="#41f083" stroke="black" d="M348,-200C348,-200 271,-200 271,-200 268,-200 265,-197 265,-194 265,-194 265,-188 265,-188 265,-185 268,-182 271,-182 271,-182 348,-182 348,-182 351,-182 354,-185 354,-188 354,-188 354,-194 354,-194 354,-197 351,-200 348,-200"/>
<text text-anchor="start" x="273" y="-188.8" font-family="Helvetica,sans-Serif" font-size="9.00">LabelCanvas.vue</text>
</a>
</g>
</g>
<!-- src/components/AnalysisEditor.vue&#45;&gt;src/components/canvas/LabelCanvas.vue -->
<g id="edge6" class="edge">
<title>src/components/AnalysisEditor.vue&#45;&gt;src/components/canvas/LabelCanvas.vue</title>
<path fill="none" stroke="#000000" stroke-width="2" stroke-opacity="0.200000" d="M116.11,-157C182.33,-157 296.5,-157 296.5,-157 296.5,-157 296.5,-175.71 296.5,-175.71"/>
<polygon fill="#000000" fill-opacity="0.200000" stroke="#000000" stroke-width="2" stroke-opacity="0.200000" points="294.4,-175.71 296.5,-181.71 298.6,-175.71 294.4,-175.71"/>
</g>
<!-- src/components/players/PlayerContainer.vue -->
<g id="node8" class="node">
<title>src/components/players/PlayerContainer.vue</title>
<g id="a_node8"><a xlink:href="../../src/components/players/PlayerContainer.vue" xlink:title="PlayerContainer.vue">
<path fill="#41f083" stroke="black" d="M354,-410C354,-410 265,-410 265,-410 262,-410 259,-407 259,-404 259,-404 259,-398 259,-398 259,-395 262,-392 265,-392 265,-392 354,-392 354,-392 357,-392 360,-395 360,-398 360,-398 360,-404 360,-404 360,-407 357,-410 354,-410"/>
<text text-anchor="start" x="267" y="-398.8" font-family="Helvetica,sans-Serif" font-size="9.00">PlayerContainer.vue</text>
</a>
</g>
</g>
<!-- src/components/AnalysisEditor.vue&#45;&gt;src/components/players/PlayerContainer.vue -->
<g id="edge7" class="edge">
<title>src/components/AnalysisEditor.vue&#45;&gt;src/components/players/PlayerContainer.vue</title>
<path fill="none" stroke="#000000" stroke-width="2" stroke-opacity="0.200000" d="M70.5,-166.27C70.5,-210.84 70.5,-401 70.5,-401 70.5,-401 252.81,-401 252.81,-401"/>
<polygon fill="#000000" fill-opacity="0.200000" stroke="#000000" stroke-width="2" stroke-opacity="0.200000" points="252.81,-403.1 258.81,-401 252.81,-398.9 252.81,-403.1"/>
</g>
<!-- src/components/toolbars/AnalysisTools.vue -->
<g id="node9" class="node">
<title>src/components/toolbars/AnalysisTools.vue</title>
<g id="a_node9"><a xlink:href="../../src/components/toolbars/AnalysisTools.vue" xlink:title="AnalysisTools.vue">
<path fill="#41f083" stroke="black" d="M221.5,-658C221.5,-658 143.5,-658 143.5,-658 140.5,-658 137.5,-655 137.5,-652 137.5,-652 137.5,-646 137.5,-646 137.5,-643 140.5,-640 143.5,-640 143.5,-640 221.5,-640 221.5,-640 224.5,-640 227.5,-643 227.5,-646 227.5,-646 227.5,-652 227.5,-652 227.5,-655 224.5,-658 221.5,-658"/>
<text text-anchor="start" x="145.5" y="-646.8" font-family="Helvetica,sans-Serif" font-size="9.00">AnalysisTools.vue</text>
</a>
</g>
</g>
<!-- src/components/AnalysisEditor.vue&#45;&gt;src/components/toolbars/AnalysisTools.vue -->
<g id="edge8" class="edge">
<title>src/components/AnalysisEditor.vue&#45;&gt;src/components/toolbars/AnalysisTools.vue</title>
<path fill="none" stroke="#000000" stroke-width="2" stroke-opacity="0.200000" d="M47.5,-166.39C47.5,-234.41 47.5,-649 47.5,-649 47.5,-649 131.17,-649 131.17,-649"/>
<polygon fill="#000000" fill-opacity="0.200000" stroke="#000000" stroke-width="2" stroke-opacity="0.200000" points="131.17,-651.1 137.17,-649 131.17,-646.9 131.17,-651.1"/>
</g>
<!-- src/components/canvas&#45;addons/CssInjector.vue -->
<g id="node10" class="node">
<title>src/components/canvas&#45;addons/CssInjector.vue</title>
<g id="a_node10"><a xlink:href="../../src/components/canvas-addons/CssInjector.vue" xlink:title="CssInjector.vue">
<path fill="#41f083" stroke="black" d="M343.5,-80C343.5,-80 275.5,-80 275.5,-80 272.5,-80 269.5,-77 269.5,-74 269.5,-74 269.5,-68 269.5,-68 269.5,-65 272.5,-62 275.5,-62 275.5,-62 343.5,-62 343.5,-62 346.5,-62 349.5,-65 349.5,-68 349.5,-68 349.5,-74 349.5,-74 349.5,-77 346.5,-80 343.5,-80"/>
<text text-anchor="start" x="277.5" y="-68.8" font-family="Helvetica,sans-Serif" font-size="9.00">CssInjector.vue</text>
</a>
</g>
</g>
<!-- src/components/canvas&#45;addons/ColorGenerator.vue&#45;&gt;src/components/canvas&#45;addons/CssInjector.vue -->
<g id="edge9" class="edge">
<title>src/components/canvas&#45;addons/ColorGenerator.vue&#45;&gt;src/components/canvas&#45;addons/CssInjector.vue</title>
<path fill="none" stroke="#000000" stroke-width="2" stroke-opacity="0.200000" d="M231.6,-71C231.6,-71 263.16,-71 263.16,-71"/>
<polygon fill="#000000" fill-opacity="0.200000" stroke="#000000" stroke-width="2" stroke-opacity="0.200000" points="263.16,-73.1 269.16,-71 263.16,-68.9 263.16,-73.1"/>
</g>
<!-- src/components/canvas&#45;addons/Minimap.vue&#45;&gt;src/components/canvas/LabelCanvas.vue -->
<g id="edge10" class="edge">
<title>src/components/canvas&#45;addons/Minimap.vue&#45;&gt;src/components/canvas/LabelCanvas.vue</title>
<path fill="none" stroke="#000000" stroke-width="2" stroke-opacity="0.200000" d="M217.35,-101C259.11,-101 323.5,-101 323.5,-101 323.5,-101 323.5,-175.71 323.5,-175.71"/>
<polygon fill="#000000" fill-opacity="0.200000" stroke="#000000" stroke-width="2" stroke-opacity="0.200000" points="321.4,-175.71 323.5,-181.71 325.6,-175.71 321.4,-175.71"/>
</g>
<!-- src/components/canvas&#45;switchers/CanvasSwitcherButton.vue -->
<g id="node11" class="node">
<title>src/components/canvas&#45;switchers/CanvasSwitcherButton.vue</title>
<g id="a_node11"><a xlink:href="../../src/components/canvas-switchers/CanvasSwitcherButton.vue" xlink:title="CanvasSwitcherButton.vue">
<path fill="#41f083" stroke="black" d="M367,-290C367,-290 252,-290 252,-290 249,-290 246,-287 246,-284 246,-284 246,-278 246,-278 246,-275 249,-272 252,-272 252,-272 367,-272 367,-272 370,-272 373,-275 373,-278 373,-278 373,-284 373,-284 373,-287 370,-290 367,-290"/>
<text text-anchor="start" x="254" y="-278.8" font-family="Helvetica,sans-Serif" font-size="9.00">CanvasSwitcherButton.vue</text>
</a>
</g>
</g>
<!-- src/components/canvas&#45;switchers/CanvasSwitcher.vue&#45;&gt;src/components/canvas&#45;switchers/CanvasSwitcherButton.vue -->
<g id="edge11" class="edge">
<title>src/components/canvas&#45;switchers/CanvasSwitcher.vue&#45;&gt;src/components/canvas&#45;switchers/CanvasSwitcherButton.vue</title>
<path fill="none" stroke="#000000" stroke-width="2" stroke-opacity="0.200000" d="M182.5,-286.98C182.5,-283.13 182.5,-279.5 182.5,-279.5 182.5,-279.5 239.63,-279.5 239.63,-279.5"/>
<polygon fill="#000000" fill-opacity="0.200000" stroke="#000000" stroke-width="2" stroke-opacity="0.200000" points="239.63,-281.6 245.63,-279.5 239.63,-277.4 239.63,-281.6"/>
</g>
<!-- src/components/canvas&#45;switchers/CanvasSwitcherMenu.vue -->
<g id="node12" class="node">
<title>src/components/canvas&#45;switchers/CanvasSwitcherMenu.vue</title>
<g id="a_node12"><a xlink:href="../../src/components/canvas-switchers/CanvasSwitcherMenu.vue" xlink:title="CanvasSwitcherMenu.vue">
<path fill="#41f083" stroke="black" d="M365.5,-320C365.5,-320 253.5,-320 253.5,-320 250.5,-320 247.5,-317 247.5,-314 247.5,-314 247.5,-308 247.5,-308 247.5,-305 250.5,-302 253.5,-302 253.5,-302 365.5,-302 365.5,-302 368.5,-302 371.5,-305 371.5,-308 371.5,-308 371.5,-314 371.5,-314 371.5,-317 368.5,-320 365.5,-320"/>
<text text-anchor="start" x="255.5" y="-308.8" font-family="Helvetica,sans-Serif" font-size="9.00">CanvasSwitcherMenu.vue</text>
</a>
</g>
</g>
<!-- src/components/canvas&#45;switchers/CanvasSwitcher.vue&#45;&gt;src/components/canvas&#45;switchers/CanvasSwitcherMenu.vue -->
<g id="edge12" class="edge">
<title>src/components/canvas&#45;switchers/CanvasSwitcher.vue&#45;&gt;src/components/canvas&#45;switchers/CanvasSwitcherMenu.vue</title>
<path fill="none" stroke="#000000" stroke-width="2" stroke-opacity="0.200000" d="M197.5,-305.02C197.5,-308.87 197.5,-312.5 197.5,-312.5 197.5,-312.5 241.28,-312.5 241.28,-312.5"/>
<polygon fill="#000000" fill-opacity="0.200000" stroke="#000000" stroke-width="2" stroke-opacity="0.200000" points="241.28,-314.6 247.28,-312.5 241.28,-310.4 241.28,-314.6"/>
</g>
<!-- src/components/canvas&#45;switchers/CanvasSwitcherSelect.vue -->
<g id="node13" class="node">
<title>src/components/canvas&#45;switchers/CanvasSwitcherSelect.vue</title>
<g id="a_node13"><a xlink:href="../../src/components/canvas-switchers/CanvasSwitcherSelect.vue" xlink:title="CanvasSwitcherSelect.vue">
<path fill="#41f083" stroke="black" d="M366.5,-350C366.5,-350 252.5,-350 252.5,-350 249.5,-350 246.5,-347 246.5,-344 246.5,-344 246.5,-338 246.5,-338 246.5,-335 249.5,-332 252.5,-332 252.5,-332 366.5,-332 366.5,-332 369.5,-332 372.5,-335 372.5,-338 372.5,-338 372.5,-344 372.5,-344 372.5,-347 369.5,-350 366.5,-350"/>
<text text-anchor="start" x="254.5" y="-338.8" font-family="Helvetica,sans-Serif" font-size="9.00">CanvasSwitcherSelect.vue</text>
</a>
</g>
</g>
<!-- src/components/canvas&#45;switchers/CanvasSwitcher.vue&#45;&gt;src/components/canvas&#45;switchers/CanvasSwitcherSelect.vue -->
<g id="edge13" class="edge">
<title>src/components/canvas&#45;switchers/CanvasSwitcher.vue&#45;&gt;src/components/canvas&#45;switchers/CanvasSwitcherSelect.vue</title>
<path fill="none" stroke="#000000" stroke-width="2" stroke-opacity="0.200000" d="M167.5,-305.11C167.5,-318.26 167.5,-341 167.5,-341 167.5,-341 240.39,-341 240.39,-341"/>
<polygon fill="#000000" fill-opacity="0.200000" stroke="#000000" stroke-width="2" stroke-opacity="0.200000" points="240.39,-343.1 246.39,-341 240.39,-338.9 240.39,-343.1"/>
</g>
<!-- src/components/canvas/LabelGroupSvg.vue -->
<g id="node14" class="node">
<title>src/components/canvas/LabelGroupSvg.vue</title>
<g id="a_node14"><a xlink:href="../../src/components/canvas/LabelGroupSvg.vue" xlink:title="LabelGroupSvg.vue">
<path fill="#41f083" stroke="black" d="M484.5,-200C484.5,-200 398.5,-200 398.5,-200 395.5,-200 392.5,-197 392.5,-194 392.5,-194 392.5,-188 392.5,-188 392.5,-185 395.5,-182 398.5,-182 398.5,-182 484.5,-182 484.5,-182 487.5,-182 490.5,-185 490.5,-188 490.5,-188 490.5,-194 490.5,-194 490.5,-197 487.5,-200 484.5,-200"/>
<text text-anchor="start" x="400.5" y="-188.8" font-family="Helvetica,sans-Serif" font-size="9.00">LabelGroupSvg.vue</text>
</a>
</g>
</g>
<!-- src/components/canvas/LabelCanvas.vue&#45;&gt;src/components/canvas/LabelGroupSvg.vue -->
<g id="edge14" class="edge">
<title>src/components/canvas/LabelCanvas.vue&#45;&gt;src/components/canvas/LabelGroupSvg.vue</title>
<path fill="none" stroke="#000000" stroke-width="2" stroke-opacity="0.200000" d="M354.19,-191C354.19,-191 386.32,-191 386.32,-191"/>
<polygon fill="#000000" fill-opacity="0.200000" stroke="#000000" stroke-width="2" stroke-opacity="0.200000" points="386.32,-193.1 392.32,-191 386.32,-188.9 386.32,-193.1"/>
</g>
<!-- src/components/canvas/SelectionArrows.vue -->
<g id="node15" class="node">
<title>src/components/canvas/SelectionArrows.vue</title>
<g id="a_node15"><a xlink:href="../../src/components/canvas/SelectionArrows.vue" xlink:title="SelectionArrows.vue">
<path fill="#41f083" stroke="black" d="M601,-230C601,-230 512,-230 512,-230 509,-230 506,-227 506,-224 506,-224 506,-218 506,-218 506,-215 509,-212 512,-212 512,-212 601,-212 601,-212 604,-212 607,-215 607,-218 607,-218 607,-224 607,-224 607,-227 604,-230 601,-230"/>
<text text-anchor="start" x="514" y="-218.8" font-family="Helvetica,sans-Serif" font-size="9.00">SelectionArrows.vue</text>
</a>
</g>
</g>
<!-- src/components/canvas/LabelCanvas.vue&#45;&gt;src/components/canvas/SelectionArrows.vue -->
<g id="edge15" class="edge">
<title>src/components/canvas/LabelCanvas.vue&#45;&gt;src/components/canvas/SelectionArrows.vue</title>
<path fill="none" stroke="#000000" stroke-width="2" stroke-opacity="0.200000" d="M309.5,-200.16C309.5,-208.99 309.5,-221 309.5,-221 309.5,-221 499.92,-221 499.92,-221"/>
<polygon fill="#000000" fill-opacity="0.200000" stroke="#000000" stroke-width="2" stroke-opacity="0.200000" points="499.92,-223.1 505.92,-221 499.92,-218.9 499.92,-223.1"/>
</g>
<!-- src/components/players/FilePlayer.vue -->
<g id="node18" class="node">
<title>src/components/players/FilePlayer.vue</title>
<g id="a_node18"><a xlink:href="../../src/components/players/FilePlayer.vue" xlink:title="FilePlayer.vue">
<path fill="#41f083" stroke="black" d="M473,-410C473,-410 410,-410 410,-410 407,-410 404,-407 404,-404 404,-404 404,-398 404,-398 404,-395 407,-392 410,-392 410,-392 473,-392 473,-392 476,-392 479,-395 479,-398 479,-398 479,-404 479,-404 479,-407 476,-410 473,-410"/>
<text text-anchor="start" x="412" y="-398.8" font-family="Helvetica,sans-Serif" font-size="9.00">FilePlayer.vue</text>
</a>
</g>
</g>
<!-- src/components/players/PlayerContainer.vue&#45;&gt;src/components/players/FilePlayer.vue -->
<g id="edge20" class="edge">
<title>src/components/players/PlayerContainer.vue&#45;&gt;src/components/players/FilePlayer.vue</title>
<path fill="none" stroke="#000000" stroke-width="2" stroke-opacity="0.200000" d="M360.16,-398C360.16,-398 397.89,-398 397.89,-398"/>
<polygon fill="#000000" fill-opacity="0.200000" stroke="#000000" stroke-width="2" stroke-opacity="0.200000" points="397.89,-400.1 403.89,-398 397.89,-395.9 397.89,-400.1"/>
</g>
<!-- src/components/players/YoutubePlayer.vue -->
<g id="node20" class="node">
<title>src/components/players/YoutubePlayer.vue</title>
<g id="a_node20"><a xlink:href="../../src/components/players/YoutubePlayer.vue" xlink:title="YoutubePlayer.vue">
<path fill="#41f083" stroke="black" d="M482,-440C482,-440 401,-440 401,-440 398,-440 395,-437 395,-434 395,-434 395,-428 395,-428 395,-425 398,-422 401,-422 401,-422 482,-422 482,-422 485,-422 488,-425 488,-428 488,-428 488,-434 488,-434 488,-437 485,-440 482,-440"/>
<text text-anchor="start" x="403" y="-428.8" font-family="Helvetica,sans-Serif" font-size="9.00">YoutubePlayer.vue</text>
</a>
</g>
</g>
<!-- src/components/players/PlayerContainer.vue&#45;&gt;src/components/players/YoutubePlayer.vue -->
<g id="edge21" class="edge">
<title>src/components/players/PlayerContainer.vue&#45;&gt;src/components/players/YoutubePlayer.vue</title>
<path fill="none" stroke="#000000" stroke-width="2" stroke-opacity="0.200000" d="M360.02,-404C380.54,-404 399.5,-404 399.5,-404 399.5,-404 399.5,-415.86 399.5,-415.86"/>
<polygon fill="#000000" fill-opacity="0.200000" stroke="#000000" stroke-width="2" stroke-opacity="0.200000" points="397.4,-415.86 399.5,-421.86 401.6,-415.86 397.4,-415.86"/>
</g>
<!-- src/components/toolbars/editing/CreationBar.vue -->
<g id="node21" class="node">
<title>src/components/toolbars/editing/CreationBar.vue</title>
<g id="a_node21"><a xlink:href="../../src/components/toolbars/editing/CreationBar.vue" xlink:title="CreationBar.vue">
<path fill="#41f083" stroke="black" d="M477,-658C477,-658 406,-658 406,-658 403,-658 400,-655 400,-652 400,-652 400,-646 400,-646 400,-643 403,-640 406,-640 406,-640 477,-640 477,-640 480,-640 483,-643 483,-646 483,-646 483,-652 483,-652 483,-655 480,-658 477,-658"/>
<text text-anchor="start" x="408" y="-646.8" font-family="Helvetica,sans-Serif" font-size="9.00">CreationBar.vue</text>
</a>
</g>
</g>
<!-- src/components/toolbars/AnalysisTools.vue&#45;&gt;src/components/toolbars/editing/CreationBar.vue -->
<g id="edge23" class="edge">
<title>src/components/toolbars/AnalysisTools.vue&#45;&gt;src/components/toolbars/editing/CreationBar.vue</title>
<path fill="none" stroke="#000000" stroke-width="2" stroke-opacity="0.200000" d="M227.61,-647.2C227.61,-647.2 393.9,-647.2 393.9,-647.2"/>
<polygon fill="#000000" fill-opacity="0.200000" stroke="#000000" stroke-width="2" stroke-opacity="0.200000" points="393.9,-649.3 399.9,-647.2 393.9,-645.1 393.9,-649.3"/>
</g>
<!-- src/components/toolbars/editing/EditorBar.vue -->
<g id="node22" class="node">
<title>src/components/toolbars/editing/EditorBar.vue</title>
<g id="a_node22"><a xlink:href="../../src/components/toolbars/editing/EditorBar.vue" xlink:title="EditorBar.vue">
<path fill="#41f083" stroke="black" d="M339.5,-557C339.5,-557 279.5,-557 279.5,-557 276.5,-557 273.5,-554 273.5,-551 273.5,-551 273.5,-545 273.5,-545 273.5,-542 276.5,-539 279.5,-539 279.5,-539 339.5,-539 339.5,-539 342.5,-539 345.5,-542 345.5,-545 345.5,-545 345.5,-551 345.5,-551 345.5,-554 342.5,-557 339.5,-557"/>
<text text-anchor="start" x="281.5" y="-545.8" font-family="Helvetica,sans-Serif" font-size="9.00">EditorBar.vue</text>
</a>
</g>
</g>
<!-- src/components/toolbars/AnalysisTools.vue&#45;&gt;src/components/toolbars/editing/EditorBar.vue -->
<g id="edge24" class="edge">
<title>src/components/toolbars/AnalysisTools.vue&#45;&gt;src/components/toolbars/editing/EditorBar.vue</title>
<path fill="none" stroke="#000000" stroke-width="2" stroke-opacity="0.200000" d="M227.56,-643.6C257.94,-643.6 292.5,-643.6 292.5,-643.6 292.5,-643.6 292.5,-563.17 292.5,-563.17"/>
<polygon fill="#000000" fill-opacity="0.200000" stroke="#000000" stroke-width="2" stroke-opacity="0.200000" points="294.6,-563.17 292.5,-557.17 290.4,-563.17 294.6,-563.17"/>
</g>
<!-- src/components/toolbars/toolbar&#45;container/BarContainer.vue -->
<g id="node23" class="node">
<title>src/components/toolbars/toolbar&#45;container/BarContainer.vue</title>
<g id="a_node23"><a xlink:href="../../src/components/toolbars/toolbar-container/BarContainer.vue" xlink:title="BarContainer.vue">
<path fill="#41f083" stroke="black" d="M348,-778C348,-778 271,-778 271,-778 268,-778 265,-775 265,-772 265,-772 265,-766 265,-766 265,-763 268,-760 271,-760 271,-760 348,-760 348,-760 351,-760 354,-763 354,-766 354,-766 354,-772 354,-772 354,-775 351,-778 348,-778"/>
<text text-anchor="start" x="273" y="-766.8" font-family="Helvetica,sans-Serif" font-size="9.00">BarContainer.vue</text>
</a>
</g>
</g>
<!-- src/components/toolbars/AnalysisTools.vue&#45;&gt;src/components/toolbars/toolbar&#45;container/BarContainer.vue -->
<g id="edge25" class="edge">
<title>src/components/toolbars/AnalysisTools.vue&#45;&gt;src/components/toolbars/toolbar&#45;container/BarContainer.vue</title>
<path fill="none" stroke="#000000" stroke-width="2" stroke-opacity="0.200000" d="M227.53,-654.4C248.76,-654.4 269.5,-654.4 269.5,-654.4 269.5,-654.4 269.5,-753.62 269.5,-753.62"/>
<polygon fill="#000000" fill-opacity="0.200000" stroke="#000000" stroke-width="2" stroke-opacity="0.200000" points="267.4,-753.62 269.5,-759.62 271.6,-753.62 267.4,-753.62"/>
</g>
<!-- src/components/toolbars/toolbar&#45;container/BarTabs.vue -->
<g id="node24" class="node">
<title>src/components/toolbars/toolbar&#45;container/BarTabs.vue</title>
<g id="a_node24"><a xlink:href="../../src/components/toolbars/toolbar-container/BarTabs.vue" xlink:title="BarTabs.vue">
<path fill="#41f083" stroke="black" d="M337.5,-748C337.5,-748 281.5,-748 281.5,-748 278.5,-748 275.5,-745 275.5,-742 275.5,-742 275.5,-736 275.5,-736 275.5,-733 278.5,-730 281.5,-730 281.5,-730 337.5,-730 337.5,-730 340.5,-730 343.5,-733 343.5,-736 343.5,-736 343.5,-742 343.5,-742 343.5,-745 340.5,-748 337.5,-748"/>
<text text-anchor="start" x="283.5" y="-736.8" font-family="Helvetica,sans-Serif" font-size="9.00">BarTabs.vue</text>
</a>
</g>
</g>
<!-- src/components/toolbars/AnalysisTools.vue&#45;&gt;src/components/toolbars/toolbar&#45;container/BarTabs.vue -->
<g id="edge26" class="edge">
<title>src/components/toolbars/AnalysisTools.vue&#45;&gt;src/components/toolbars/toolbar&#45;container/BarTabs.vue</title>
<path fill="none" stroke="#000000" stroke-width="2" stroke-opacity="0.200000" d="M227.63,-650.8C264.14,-650.8 309.5,-650.8 309.5,-650.8 309.5,-650.8 309.5,-723.89 309.5,-723.89"/>
<polygon fill="#000000" fill-opacity="0.200000" stroke="#000000" stroke-width="2" stroke-opacity="0.200000" points="307.4,-723.89 309.5,-729.89 311.6,-723.89 307.4,-723.89"/>
</g>
<!-- src/components/canvas/LabelSvg.vue -->
<g id="node16" class="node">
<title>src/components/canvas/LabelSvg.vue</title>
<g id="a_node16"><a xlink:href="../../src/components/canvas/LabelSvg.vue" xlink:title="LabelSvg.vue">
<path fill="#41f083" stroke="black" d="M587,-200C587,-200 526,-200 526,-200 523,-200 520,-197 520,-194 520,-194 520,-188 520,-188 520,-185 523,-182 526,-182 526,-182 587,-182 587,-182 590,-182 593,-185 593,-188 593,-188 593,-194 593,-194 593,-197 590,-200 587,-200"/>
<text text-anchor="start" x="528" y="-188.8" font-family="Helvetica,sans-Serif" font-size="9.00">LabelSvg.vue</text>
</a>
</g>
</g>
<!-- src/components/canvas/LabelGroupSvg.vue&#45;&gt;src/components/canvas/LabelSvg.vue -->
<g id="edge16" class="edge">
<title>src/components/canvas/LabelGroupSvg.vue&#45;&gt;src/components/canvas/LabelSvg.vue</title>
<path fill="none" stroke="#000000" stroke-width="2" stroke-opacity="0.200000" d="M490.6,-191C490.6,-191 513.74,-191 513.74,-191"/>
<polygon fill="#000000" fill-opacity="0.200000" stroke="#000000" stroke-width="2" stroke-opacity="0.200000" points="513.74,-193.1 519.74,-191 513.74,-188.9 513.74,-193.1"/>
</g>
<!-- src/components/canvas/LabelWatcher.vue -->
<g id="node17" class="node">
<title>src/components/canvas/LabelWatcher.vue</title>
<g id="a_node17"><a xlink:href="../../src/components/canvas/LabelWatcher.vue" xlink:title="LabelWatcher.vue">
<path fill="#41f083" stroke="black" d="M706,-215C706,-215 628,-215 628,-215 625,-215 622,-212 622,-209 622,-209 622,-203 622,-203 622,-200 625,-197 628,-197 628,-197 706,-197 706,-197 709,-197 712,-200 712,-203 712,-203 712,-209 712,-209 712,-212 709,-215 706,-215"/>
<text text-anchor="start" x="630" y="-203.8" font-family="Helvetica,sans-Serif" font-size="9.00">LabelWatcher.vue</text>
</a>
</g>
</g>
<!-- src/components/canvas/SelectionArrows.vue&#45;&gt;src/components/canvas/LabelWatcher.vue -->
<g id="edge18" class="edge">
<title>src/components/canvas/SelectionArrows.vue&#45;&gt;src/components/canvas/LabelWatcher.vue</title>
<path fill="none" stroke="#000000" stroke-width="2" stroke-opacity="0.200000" d="M600.5,-211.83C600.5,-209.68 600.5,-208 600.5,-208 600.5,-208 615.91,-208 615.91,-208"/>
<polygon fill="#000000" fill-opacity="0.200000" stroke="#000000" stroke-width="2" stroke-opacity="0.200000" points="615.91,-210.1 621.91,-208 615.91,-205.9 615.91,-210.1"/>
</g>
<!-- src/components/canvas/LabelSvg.vue&#45;&gt;src/components/canvas/LabelWatcher.vue -->
<g id="edge17" class="edge">
<title>src/components/canvas/LabelSvg.vue&#45;&gt;src/components/canvas/LabelWatcher.vue</title>
<path fill="none" stroke="#000000" stroke-width="2" stroke-opacity="0.200000" d="M556.5,-200.17C556.5,-202.32 556.5,-204 556.5,-204 556.5,-204 615.74,-204 615.74,-204"/>
<polygon fill="#000000" fill-opacity="0.200000" stroke="#000000" stroke-width="2" stroke-opacity="0.200000" points="615.74,-206.1 621.74,-204 615.74,-201.9 615.74,-206.1"/>
</g>
<!-- src/components/utils/Fab.vue -->
<g id="node19" class="node">
<title>src/components/utils/Fab.vue</title>
<g id="a_node19"><a xlink:href="../../src/components/utils/Fab.vue" xlink:title="Fab.vue">
<path fill="#41f083" stroke="black" d="M577.5,-440C577.5,-440 535.5,-440 535.5,-440 532.5,-440 529.5,-437 529.5,-434 529.5,-434 529.5,-428 529.5,-428 529.5,-425 532.5,-422 535.5,-422 535.5,-422 577.5,-422 577.5,-422 580.5,-422 583.5,-425 583.5,-428 583.5,-428 583.5,-434 583.5,-434 583.5,-437 580.5,-440 577.5,-440"/>
<text text-anchor="start" x="539.5" y="-428.8" font-family="Helvetica,sans-Serif" font-size="9.00">Fab.vue</text>
</a>
</g>
</g>
<!-- src/components/players/FilePlayer.vue&#45;&gt;src/components/utils/Fab.vue -->
<g id="edge19" class="edge">
<title>src/components/players/FilePlayer.vue&#45;&gt;src/components/utils/Fab.vue</title>
<path fill="none" stroke="#000000" stroke-width="2" stroke-opacity="0.200000" d="M479.16,-401C512.69,-401 556.5,-401 556.5,-401 556.5,-401 556.5,-415.84 556.5,-415.84"/>
<polygon fill="#000000" fill-opacity="0.200000" stroke="#000000" stroke-width="2" stroke-opacity="0.200000" points="554.4,-415.84 556.5,-421.84 558.6,-415.84 554.4,-415.84"/>
</g>
<!-- src/components/players/YoutubePlayer.vue&#45;&gt;src/components/utils/Fab.vue -->
<g id="edge22" class="edge">
<title>src/components/players/YoutubePlayer.vue&#45;&gt;src/components/utils/Fab.vue</title>
<path fill="none" stroke="#000000" stroke-width="2" stroke-opacity="0.200000" d="M488.27,-428C488.27,-428 523.25,-428 523.25,-428"/>
<polygon fill="#000000" fill-opacity="0.200000" stroke="#000000" stroke-width="2" stroke-opacity="0.200000" points="523.25,-430.1 529.25,-428 523.25,-425.9 523.25,-430.1"/>
</g>
<!-- src/components/toolbars/editing/CreationBar.vue&#45;&gt;src/components/utils/Fab.vue -->
<g id="edge30" class="edge">
<title>src/components/toolbars/editing/CreationBar.vue&#45;&gt;src/components/utils/Fab.vue</title>
<path fill="none" stroke="#000000" stroke-width="2" stroke-opacity="0.200000" d="M483.08,-644.5C491.33,-644.5 497.5,-644.5 497.5,-644.5 497.5,-644.5 497.5,-434 497.5,-434 497.5,-434 523.42,-434 523.42,-434"/>
<polygon fill="#000000" fill-opacity="0.200000" stroke="#000000" stroke-width="2" stroke-opacity="0.200000" points="523.42,-436.1 529.42,-434 523.42,-431.9 523.42,-436.1"/>
</g>
<!-- src/components/toolbars/editing/ButtonEditor.vue -->
<g id="node25" class="node">
<title>src/components/toolbars/editing/ButtonEditor.vue</title>
<g id="a_node25"><a xlink:href="../../src/components/toolbars/editing/ButtonEditor.vue" xlink:title="ButtonEditor.vue">
<path fill="#41f083" stroke="black" d="M592.5,-688C592.5,-688 520.5,-688 520.5,-688 517.5,-688 514.5,-685 514.5,-682 514.5,-682 514.5,-676 514.5,-676 514.5,-673 517.5,-670 520.5,-670 520.5,-670 592.5,-670 592.5,-670 595.5,-670 598.5,-673 598.5,-676 598.5,-676 598.5,-682 598.5,-682 598.5,-685 595.5,-688 592.5,-688"/>
<text text-anchor="start" x="522.5" y="-676.8" font-family="Helvetica,sans-Serif" font-size="9.00">ButtonEditor.vue</text>
</a>
</g>
</g>
<!-- src/components/toolbars/editing/CreationBar.vue&#45;&gt;src/components/toolbars/editing/ButtonEditor.vue -->
<g id="edge27" class="edge">
<title>src/components/toolbars/editing/CreationBar.vue&#45;&gt;src/components/toolbars/editing/ButtonEditor.vue</title>
<path fill="none" stroke="#000000" stroke-width="2" stroke-opacity="0.200000" d="M441.5,-658.16C441.5,-666.99 441.5,-679 441.5,-679 441.5,-679 508.33,-679 508.33,-679"/>
<polygon fill="#000000" fill-opacity="0.200000" stroke="#000000" stroke-width="2" stroke-opacity="0.200000" points="508.33,-681.1 514.33,-679 508.33,-676.9 508.33,-681.1"/>
</g>
<!-- src/components/toolbars/editing/CreationButton.vue -->
<g id="node26" class="node">
<title>src/components/toolbars/editing/CreationButton.vue</title>
<g id="a_node26"><a xlink:href="../../src/components/toolbars/editing/CreationButton.vue" xlink:title="CreationButton.vue">
<path fill="#41f083" stroke="black" d="M598,-658C598,-658 515,-658 515,-658 512,-658 509,-655 509,-652 509,-652 509,-646 509,-646 509,-643 512,-640 515,-640 515,-640 598,-640 598,-640 601,-640 604,-643 604,-646 604,-646 604,-652 604,-652 604,-655 601,-658 598,-658"/>
<text text-anchor="start" x="517" y="-646.8" font-family="Helvetica,sans-Serif" font-size="9.00">CreationButton.vue</text>
</a>
</g>
</g>
<!-- src/components/toolbars/editing/CreationBar.vue&#45;&gt;src/components/toolbars/editing/CreationButton.vue -->
<g id="edge28" class="edge">
<title>src/components/toolbars/editing/CreationBar.vue&#45;&gt;src/components/toolbars/editing/CreationButton.vue</title>
<path fill="none" stroke="#000000" stroke-width="2" stroke-opacity="0.200000" d="M483.02,-653.5C483.02,-653.5 502.79,-653.5 502.79,-653.5"/>
<polygon fill="#000000" fill-opacity="0.200000" stroke="#000000" stroke-width="2" stroke-opacity="0.200000" points="502.79,-655.6 508.79,-653.5 502.79,-651.4 502.79,-655.6"/>
</g>
<!-- src/components/toolbars/editing/editor&#45;fields/TagField.vue -->
<g id="node27" class="node">
<title>src/components/toolbars/editing/editor&#45;fields/TagField.vue</title>
<g id="a_node27"><a xlink:href="../../src/components/toolbars/editing/editor-fields/TagField.vue" xlink:title="TagField.vue">
<path fill="#41f083" stroke="black" d="M585,-576C585,-576 528,-576 528,-576 525,-576 522,-573 522,-570 522,-570 522,-564 522,-564 522,-561 525,-558 528,-558 528,-558 585,-558 585,-558 588,-558 591,-561 591,-564 591,-564 591,-570 591,-570 591,-573 588,-576 585,-576"/>
<text text-anchor="start" x="530" y="-564.8" font-family="Helvetica,sans-Serif" font-size="9.00">TagField.vue</text>
</a>
</g>
</g>
<!-- src/components/toolbars/editing/CreationBar.vue&#45;&gt;src/components/toolbars/editing/editor&#45;fields/TagField.vue -->
<g id="edge29" class="edge">
<title>src/components/toolbars/editing/CreationBar.vue&#45;&gt;src/components/toolbars/editing/editor&#45;fields/TagField.vue</title>
<path fill="none" stroke="#000000" stroke-width="2" stroke-opacity="0.200000" d="M483.17,-649C493.41,-649 501.5,-649 501.5,-649 501.5,-649 501.5,-567.33 501.5,-567.33 501.5,-567.33 515.98,-567.33 515.98,-567.33"/>
<polygon fill="#000000" fill-opacity="0.200000" stroke="#000000" stroke-width="2" stroke-opacity="0.200000" points="515.98,-569.43 521.98,-567.33 515.98,-565.23 515.98,-569.43"/>
</g>
<!-- src/components/toolbars/editing/EditorBar.vue&#45;&gt;src/components/utils/Fab.vue -->
<g id="edge37" class="edge">
<title>src/components/toolbars/editing/EditorBar.vue&#45;&gt;src/components/utils/Fab.vue</title>
<path fill="none" stroke="#000000" stroke-width="2" stroke-opacity="0.200000" d="M291.5,-538.94C291.5,-518.19 291.5,-469 291.5,-469 291.5,-469 556.5,-469 556.5,-469 556.5,-469 556.5,-446.2 556.5,-446.2"/>
<polygon fill="#000000" fill-opacity="0.200000" stroke="#000000" stroke-width="2" stroke-opacity="0.200000" points="558.6,-446.2 556.5,-440.2 554.4,-446.2 558.6,-446.2"/>
</g>
<!-- src/components/toolbars/editing/EditorBar.vue&#45;&gt;src/components/toolbars/editing/editor&#45;fields/TagField.vue -->
<g id="edge35" class="edge">
<title>src/components/toolbars/editing/EditorBar.vue&#45;&gt;src/components/toolbars/editing/editor&#45;fields/TagField.vue</title>
<path fill="none" stroke="#000000" stroke-width="2" stroke-opacity="0.200000" d="M345.6,-547.33C411.71,-547.33 545.5,-547.33 545.5,-547.33 545.5,-547.33 545.5,-551.63 545.5,-551.63"/>
<polygon fill="#000000" fill-opacity="0.200000" stroke="#000000" stroke-width="2" stroke-opacity="0.200000" points="543.4,-551.63 545.5,-557.63 547.6,-551.63 543.4,-551.63"/>
</g>
<!-- src/components/toolbars/editing/editor&#45;fields/CommentField.vue -->
<g id="node28" class="node">
<title>src/components/toolbars/editing/editor&#45;fields/CommentField.vue</title>
<g id="a_node28"><a xlink:href="../../src/components/toolbars/editing/editor-fields/CommentField.vue" xlink:title="CommentField.vue">
<path fill="#41f083" stroke="black" d="M597.5,-516C597.5,-516 515.5,-516 515.5,-516 512.5,-516 509.5,-513 509.5,-510 509.5,-510 509.5,-504 509.5,-504 509.5,-501 512.5,-498 515.5,-498 515.5,-498 597.5,-498 597.5,-498 600.5,-498 603.5,-501 603.5,-504 603.5,-504 603.5,-510 603.5,-510 603.5,-513 600.5,-516 597.5,-516"/>
<text text-anchor="start" x="517.5" y="-504.8" font-family="Helvetica,sans-Serif" font-size="9.00">CommentField.vue</text>
</a>
</g>
</g>
<!-- src/components/toolbars/editing/EditorBar.vue&#45;&gt;src/components/toolbars/editing/editor&#45;fields/CommentField.vue -->
<g id="edge31" class="edge">
<title>src/components/toolbars/editing/EditorBar.vue&#45;&gt;src/components/toolbars/editing/editor&#45;fields/CommentField.vue</title>
<path fill="none" stroke="#000000" stroke-width="2" stroke-opacity="0.200000" d="M309.5,-538.9C309.5,-526.82 309.5,-507 309.5,-507 309.5,-507 503.46,-507 503.46,-507"/>
<polygon fill="#000000" fill-opacity="0.200000" stroke="#000000" stroke-width="2" stroke-opacity="0.200000" points="503.46,-509.1 509.46,-507 503.46,-504.9 503.46,-509.1"/>
</g>
<!-- src/components/toolbars/editing/editor&#45;fields/DurationField.vue -->
<g id="node29" class="node">
<title>src/components/toolbars/editing/editor&#45;fields/DurationField.vue</title>
<g id="a_node29"><a xlink:href="../../src/components/toolbars/editing/editor-fields/DurationField.vue" xlink:title="DurationField.vue">
<path fill="#41f083" stroke="black" d="M480,-602C480,-602 403,-602 403,-602 400,-602 397,-599 397,-596 397,-596 397,-590 397,-590 397,-587 400,-584 403,-584 403,-584 480,-584 480,-584 483,-584 486,-587 486,-590 486,-590 486,-596 486,-596 486,-599 483,-602 480,-602"/>
<text text-anchor="start" x="405" y="-590.8" font-family="Helvetica,sans-Serif" font-size="9.00">DurationField.vue</text>
</a>
</g>
</g>
<!-- src/components/toolbars/editing/EditorBar.vue&#45;&gt;src/components/toolbars/editing/editor&#45;fields/DurationField.vue -->
<g id="edge32" class="edge">
<title>src/components/toolbars/editing/EditorBar.vue&#45;&gt;src/components/toolbars/editing/editor&#45;fields/DurationField.vue</title>
<path fill="none" stroke="#000000" stroke-width="2" stroke-opacity="0.200000" d="M326.5,-557.11C326.5,-570.26 326.5,-593 326.5,-593 326.5,-593 390.71,-593 390.71,-593"/>
<polygon fill="#000000" fill-opacity="0.200000" stroke="#000000" stroke-width="2" stroke-opacity="0.200000" points="390.71,-595.1 396.71,-593 390.71,-590.9 390.71,-595.1"/>
</g>
<!-- src/components/toolbars/editing/editor&#45;fields/OffsetField.vue -->
<g id="node30" class="node">
<title>src/components/toolbars/editing/editor&#45;fields/OffsetField.vue</title>
<g id="a_node30"><a xlink:href="../../src/components/toolbars/editing/editor-fields/OffsetField.vue" xlink:title="OffsetField.vue">
<path fill="#41f083" stroke="black" d="M474,-572C474,-572 409,-572 409,-572 406,-572 403,-569 403,-566 403,-566 403,-560 403,-560 403,-557 406,-554 409,-554 409,-554 474,-554 474,-554 477,-554 480,-557 480,-560 480,-560 480,-566 480,-566 480,-569 477,-572 474,-572"/>
<text text-anchor="start" x="411" y="-560.8" font-family="Helvetica,sans-Serif" font-size="9.00">OffsetField.vue</text>
</a>
</g>
</g>
<!-- src/components/toolbars/editing/EditorBar.vue&#45;&gt;src/components/toolbars/editing/editor&#45;fields/OffsetField.vue -->
<g id="edge33" class="edge">
<title>src/components/toolbars/editing/EditorBar.vue&#45;&gt;src/components/toolbars/editing/editor&#45;fields/OffsetField.vue</title>
<path fill="none" stroke="#000000" stroke-width="2" stroke-opacity="0.200000" d="M345.57,-550C384.65,-550 441.5,-550 441.5,-550 441.5,-550 441.5,-550.38 441.5,-550.38"/>
<polygon fill="#000000" fill-opacity="0.200000" stroke="#000000" stroke-width="2" stroke-opacity="0.200000" points="439.4,-547.83 441.5,-553.83 443.6,-547.83 439.4,-547.83"/>
</g>
<!-- src/components/toolbars/editing/editor&#45;fields/OnsetField.vue -->
<g id="node31" class="node">
<title>src/components/toolbars/editing/editor&#45;fields/OnsetField.vue</title>
<g id="a_node31"><a xlink:href="../../src/components/toolbars/editing/editor-fields/OnsetField.vue" xlink:title="OnsetField.vue">
<path fill="#41f083" stroke="black" d="M474.5,-542C474.5,-542 408.5,-542 408.5,-542 405.5,-542 402.5,-539 402.5,-536 402.5,-536 402.5,-530 402.5,-530 402.5,-527 405.5,-524 408.5,-524 408.5,-524 474.5,-524 474.5,-524 477.5,-524 480.5,-527 480.5,-530 480.5,-530 480.5,-536 480.5,-536 480.5,-539 477.5,-542 474.5,-542"/>
<text text-anchor="start" x="410.5" y="-530.8" font-family="Helvetica,sans-Serif" font-size="9.00">OnsetField.vue</text>
</a>
</g>
</g>
<!-- src/components/toolbars/editing/EditorBar.vue&#45;&gt;src/components/toolbars/editing/editor&#45;fields/OnsetField.vue -->
<g id="edge34" class="edge">
<title>src/components/toolbars/editing/EditorBar.vue&#45;&gt;src/components/toolbars/editing/editor&#45;fields/OnsetField.vue</title>
<path fill="none" stroke="#000000" stroke-width="2" stroke-opacity="0.200000" d="M327.5,-538.98C327.5,-535.13 327.5,-531.5 327.5,-531.5 327.5,-531.5 396.27,-531.5 396.27,-531.5"/>
<polygon fill="#000000" fill-opacity="0.200000" stroke="#000000" stroke-width="2" stroke-opacity="0.200000" points="396.27,-533.6 402.27,-531.5 396.27,-529.4 396.27,-533.6"/>
</g>
<!-- src/components/toolbars/editing/editor&#45;fields/TypeField.vue -->
<g id="node32" class="node">
<title>src/components/toolbars/editing/editor&#45;fields/TypeField.vue</title>
<g id="a_node32"><a xlink:href="../../src/components/toolbars/editing/editor-fields/TypeField.vue" xlink:title="TypeField.vue">
<path fill="#41f083" stroke="black" d="M587.5,-606C587.5,-606 525.5,-606 525.5,-606 522.5,-606 519.5,-603 519.5,-600 519.5,-600 519.5,-594 519.5,-594 519.5,-591 522.5,-588 525.5,-588 525.5,-588 587.5,-588 587.5,-588 590.5,-588 593.5,-591 593.5,-594 593.5,-594 593.5,-600 593.5,-600 593.5,-603 590.5,-606 587.5,-606"/>
<text text-anchor="start" x="527.5" y="-594.8" font-family="Helvetica,sans-Serif" font-size="9.00">TypeField.vue</text>
</a>
</g>
</g>
<!-- src/components/toolbars/editing/EditorBar.vue&#45;&gt;src/components/toolbars/editing/editor&#45;fields/TypeField.vue -->
<g id="edge36" class="edge">
<title>src/components/toolbars/editing/EditorBar.vue&#45;&gt;src/components/toolbars/editing/editor&#45;fields/TypeField.vue</title>
<path fill="none" stroke="#000000" stroke-width="2" stroke-opacity="0.200000" d="M345.61,-548.67C399.45,-548.67 494.5,-548.67 494.5,-548.67 494.5,-548.67 494.5,-592.67 494.5,-592.67 494.5,-592.67 513.36,-592.67 513.36,-592.67"/>
<polygon fill="#000000" fill-opacity="0.200000" stroke="#000000" stroke-width="2" stroke-opacity="0.200000" points="513.36,-594.77 519.36,-592.67 513.36,-590.57 513.36,-594.77"/>
</g>
<!-- src/components/toolbars/editing/editor&#45;fields/LabelField.vue -->
<g id="node33" class="node">
<title>src/components/toolbars/editing/editor&#45;fields/LabelField.vue</title>
<g id="a_node33"><a xlink:href="../../src/components/toolbars/editing/editor-fields/LabelField.vue" xlink:title="LabelField.vue">
<path fill="#41f083" stroke="black" d="M699.5,-561C699.5,-561 634.5,-561 634.5,-561 631.5,-561 628.5,-558 628.5,-555 628.5,-555 628.5,-549 628.5,-549 628.5,-546 631.5,-543 634.5,-543 634.5,-543 699.5,-543 699.5,-543 702.5,-543 705.5,-546 705.5,-549 705.5,-549 705.5,-555 705.5,-555 705.5,-558 702.5,-561 699.5,-561"/>
<text text-anchor="start" x="636.5" y="-549.8" font-family="Helvetica,sans-Serif" font-size="9.00">LabelField.vue</text>
</a>
</g>
</g>
<!-- src/components/toolbars/editing/editor&#45;fields/TagField.vue&#45;&gt;src/components/toolbars/editing/editor&#45;fields/LabelField.vue -->
<g id="edge43" class="edge">
<title>src/components/toolbars/editing/editor&#45;fields/TagField.vue&#45;&gt;src/components/toolbars/editing/editor&#45;fields/LabelField.vue</title>
<path fill="none" stroke="#000000" stroke-width="2" stroke-opacity="0.200000" d="M568.5,-557.84C568.5,-555.03 568.5,-552.67 568.5,-552.67 568.5,-552.67 622.35,-552.67 622.35,-552.67"/>
<polygon fill="#000000" fill-opacity="0.200000" stroke="#000000" stroke-width="2" stroke-opacity="0.200000" points="622.35,-554.77 628.35,-552.67 622.35,-550.57 622.35,-554.77"/>
</g>
<!-- src/components/toolbars/editing/editor&#45;fields/CommentField.vue&#45;&gt;src/components/toolbars/editing/editor&#45;fields/LabelField.vue -->
<g id="edge38" class="edge">
<title>src/components/toolbars/editing/editor&#45;fields/CommentField.vue&#45;&gt;src/components/toolbars/editing/editor&#45;fields/LabelField.vue</title>
<path fill="none" stroke="#000000" stroke-width="2" stroke-opacity="0.200000" d="M603.57,-507C633.83,-507 667.5,-507 667.5,-507 667.5,-507 667.5,-536.89 667.5,-536.89"/>
<polygon fill="#000000" fill-opacity="0.200000" stroke="#000000" stroke-width="2" stroke-opacity="0.200000" points="665.4,-536.89 667.5,-542.89 669.6,-536.89 665.4,-536.89"/>
</g>
<!-- src/components/toolbars/editing/editor&#45;fields/MusicalTimeField.vue -->
<g id="node34" class="node">
<title>src/components/toolbars/editing/editor&#45;fields/MusicalTimeField.vue</title>
<g id="a_node34"><a xlink:href="../../src/components/toolbars/editing/editor-fields/MusicalTimeField.vue" xlink:title="MusicalTimeField.vue">
<path fill="#41f083" stroke="black" d="M603,-546C603,-546 510,-546 510,-546 507,-546 504,-543 504,-540 504,-540 504,-534 504,-534 504,-531 507,-528 510,-528 510,-528 603,-528 603,-528 606,-528 609,-531 609,-534 609,-534 609,-540 609,-540 609,-543 606,-546 603,-546"/>
<text text-anchor="start" x="512" y="-534.8" font-family="Helvetica,sans-Serif" font-size="9.00">MusicalTimeField.vue</text>
</a>
</g>
</g>
<!-- src/components/toolbars/editing/editor&#45;fields/DurationField.vue&#45;&gt;src/components/toolbars/editing/editor&#45;fields/MusicalTimeField.vue -->
<g id="edge39" class="edge">
<title>src/components/toolbars/editing/editor&#45;fields/DurationField.vue&#45;&gt;src/components/toolbars/editing/editor&#45;fields/MusicalTimeField.vue</title>
<path fill="none" stroke="#000000" stroke-width="2" stroke-opacity="0.200000" d="M486.43,-597.33C502.4,-597.33 516.5,-597.33 516.5,-597.33 516.5,-597.33 516.5,-552.16 516.5,-552.16"/>
<polygon fill="#000000" fill-opacity="0.200000" stroke="#000000" stroke-width="2" stroke-opacity="0.200000" points="518.6,-552.16 516.5,-546.16 514.4,-552.16 518.6,-552.16"/>
</g>
<!-- src/components/toolbars/editing/editor&#45;fields/OffsetField.vue&#45;&gt;src/components/toolbars/editing/editor&#45;fields/MusicalTimeField.vue -->
<g id="edge41" class="edge">
<title>src/components/toolbars/editing/editor&#45;fields/OffsetField.vue&#45;&gt;src/components/toolbars/editing/editor&#45;fields/MusicalTimeField.vue</title>
<path fill="none" stroke="#000000" stroke-width="2" stroke-opacity="0.200000" d="M480.32,-562.67C496.9,-562.67 512.5,-562.67 512.5,-562.67 512.5,-562.67 512.5,-552.27 512.5,-552.27"/>
<polygon fill="#000000" fill-opacity="0.200000" stroke="#000000" stroke-width="2" stroke-opacity="0.200000" points="514.6,-552.27 512.5,-546.27 510.4,-552.27 514.6,-552.27"/>
</g>
<!-- src/components/toolbars/editing/editor&#45;fields/OnsetField.vue&#45;&gt;src/components/toolbars/editing/editor&#45;fields/MusicalTimeField.vue -->
<g id="edge42" class="edge">
<title>src/components/toolbars/editing/editor&#45;fields/OnsetField.vue&#45;&gt;src/components/toolbars/editing/editor&#45;fields/MusicalTimeField.vue</title>
<path fill="none" stroke="#000000" stroke-width="2" stroke-opacity="0.200000" d="M480.75,-535C480.75,-535 497.79,-535 497.79,-535"/>
<polygon fill="#000000" fill-opacity="0.200000" stroke="#000000" stroke-width="2" stroke-opacity="0.200000" points="497.79,-537.1 503.79,-535 497.79,-532.9 497.79,-537.1"/>
</g>
<!-- src/components/toolbars/editing/editor&#45;fields/TypeField.vue&#45;&gt;src/components/toolbars/editing/editor&#45;fields/LabelField.vue -->
<g id="edge44" class="edge">
<title>src/components/toolbars/editing/editor&#45;fields/TypeField.vue&#45;&gt;src/components/toolbars/editing/editor&#45;fields/LabelField.vue</title>
<path fill="none" stroke="#000000" stroke-width="2" stroke-opacity="0.200000" d="M593.77,-597C626.02,-597 667.5,-597 667.5,-597 667.5,-597 667.5,-567.11 667.5,-567.11"/>
<polygon fill="#000000" fill-opacity="0.200000" stroke="#000000" stroke-width="2" stroke-opacity="0.200000" points="669.6,-567.11 667.5,-561.11 665.4,-567.11 669.6,-567.11"/>
</g>
<!-- src/components/toolbars/editing/editor&#45;fields/MusicalTimeField.vue&#45;&gt;src/components/toolbars/editing/editor&#45;fields/LabelField.vue -->
<g id="edge40" class="edge">
<title>src/components/toolbars/editing/editor&#45;fields/MusicalTimeField.vue&#45;&gt;src/components/toolbars/editing/editor&#45;fields/LabelField.vue</title>
<path fill="none" stroke="#000000" stroke-width="2" stroke-opacity="0.200000" d="M599.5,-546.16C599.5,-548.97 599.5,-551.33 599.5,-551.33 599.5,-551.33 622.13,-551.33 622.13,-551.33"/>
<polygon fill="#000000" fill-opacity="0.200000" stroke="#000000" stroke-width="2" stroke-opacity="0.200000" points="622.13,-553.43 628.13,-551.33 622.13,-549.23 622.13,-553.43"/>
</g>
</g>
</svg>
