{
  "id": "4986023",
  "sources": {
    "images": [
      {
        "image": "sources/images/4986023-svg/4986023-svg.svg",
        "type": "score",
        "name": "vector",
        "positions": "sources/images/4986023-svg/positions.json"
      }
    ],
    "audios": [
      {
        "yt-id": "zwf69PSKfpw",
        "ref:url": "https://www.youtube.com/watch?v=zwf69PSKfpw",
        "file": "sources/audios/4986023-0-yt/4986023-0-yt.mp3",
        "onset-date": "sources/audios/4986023-0-yt/synchro.json",
        "images": [
          {
            "image": "sources/audios/4986023-0-yt/images/4986023-0-yt/4986023-0-yt.png",
            "type": "wave",
            "name": "4986023-0-yt",
            "positions": "sources/audios/4986023-0-yt/images/4986023-0-yt/positions.json"
          }
        ]
      }
    ]
  },
  "opus": {
    "collection": "6 Lieder, Op.9",
    "contributors": {
      "composer": "Fanny Mendelssohn",
      "lyricist": "Ludwig Christoph Heinrich Hölty"
    },
    "id": "OpenScore/Lieder/4986023",
    "key": "Eb major",
    "measure-map": "/local-corpus/4986023/mm/lc4986023.measures.mm.json",
    "opus": "Op.9",
    "ref:imslp#": "113581",
    "ref:musescore": "openscore-lieder-corpus/scores/4986023",
    "ref:wikipedia": "Fanny_Mendelssohn",
    "title": "Die Ersehnte",
    "year": "1805-1847"
  },
  "ytId": "zwf69PSKfpw",
  "analysis:default": "analysis_dez_format.dez",
  "analysis:grid": "analysis_dez_format.dez"
}