{
  "id": "R171_0",
  "sources": {
    "images": [
      {
        "image": "sources/images/R171_0-svg/R171_0-svg.svg",
        "type": "score",
        "name": "MEI ANR CollabScore",
        "info": "Aurélien Balland Chatignon",
        "positions": "sources/images/R171_0-svg/positions.json"
      },
      {
        "image": "sources/images/scan/image-0-jpg.jpg",
        "type": "3d",
        "name": "Enoch Père & Fils, Paris (1873)",
        "info": "Baudon grav.",
        "positions": "sources/images/scan/positions.json"
      }
    ]
  },
  "analysis:default": "macabre-demo.dez",
  "opus": {
    "measure-map": [
      {
        "count": 1,
        "qstamp": 0,
        "number": 0,
        "time_signature": "3/4",
        "nominal_length": 3,
        "actual_length": 3,
        "start_repeat": false,
        "end_repeat": false,
        "next": [
          1
        ]
      }
    ],
    "collection": "CollabScore",
    "title": "Danse macabre (voix, piano)",
    "contributors":
    {
      "composer": "Camille Saint-Saëns",
      "lyricist": "Henri Cazalis"
    },
    "year": "1872",
    "ref:collabscore": "all:collabscore:saintsaens-ref:R171_0"
  }
}