{
  "pieces": {
    "op21": {
      "opus": {
        "piece:nickname": "",
        "ref:musicbrainz": "eb4cf616-0bcb-4f4b-9fda-03a87f89941e",
        "symphony:num": "1",
        "year": "1800"
      }
    },
    "op21.1": {
      "opus": {
        "key": "C Major",
        "movement:title": "Adagio molto - Allegro con brio"
      },

      "quality:annotation": "3",
      "quality:audio:synchro": "0",
      "quality:audio": "1",
      "quality:metadata": "5",
      "quality:musical-time": "1",
      "quality:score": "3",

      "sources": [
        {
          "ref:musescore": "user/1680641/scores/8154528",
          "licence": "CC0-1.0"
        },
        {},
        {
          "audio": "https://imslp.eu/files/imglnks/euimg/1/1c/IMSLP729155-PMLP1582-01.01._Symphony_No._1_In_C_Major,_Op._21-_1st_Movement_-_Adagio_Molto;_Allegro_Con_Brio.mp3"
        }
      ],
      "time-signature": "4/4"
    },
    "op36": {
      "opus": {
        "piece:nickname": "",
        "ref:musicbrainz": "3c33b26a-6683-3b37-84e1-42f3f5221322",
        "symphony:num": "2",
        "year": "1803"
      }
    },
    "op36.1": {
      "opus": {
        "key": "D Major",
        "movement:title": "Adagio molto - Allegro con brio"
      },

      "quality:annotation": "3",
      "quality:audio:synchro": "0",
      "quality:audio": "1",
      "quality:metadata": "5",
      "quality:musical-time": "0",
      "quality:score": "0",

      "sources": [
        {},
        {},
        {
          "audio": "https://imslp.eu/files/imglnks/euimg/c/c3/IMSLP729167-PMLP2580-02.01._Symphony_No._2_In_D_Major,_Op._36-_First_Movement_-_Adagio_Molto;_Allegro_Con_Brio.mp3"
        }
      ],
      "time-signature": "3/4",
      "time-signature-upbeat": "0.125"
    },
    "op55": {
      "opus": {
        "piece:nickname": "Eroica",
        "ref:musicbrainz": "80737426-8ef3-3a9c-a3a6-9507afb93e93",
        "symphony:num": "3",
        "year": "1805"
      }
    },
    "op55.1": {
      "opus": {
        "key": "Eb Major",
        "movement:title": "Allegro con brio"
      },

      "quality:annotation": "3",
      "quality:audio:synchro": "0",
      "quality:audio": "1",
      "quality:metadata": "5",
      "quality:musical-time": "3",
      "quality:score": "4",

      "sources": [
        {
          "ref:musescore": "user/41033328/scores/10952683",
          "licence": "CC0-1.0"
        },
        {},
        {
          "audio": "https://imslp.eu/files/imglnks/euimg/4/42/IMSLP729159-PMLP2581-03.01._Symphony_No._3_In_E-Flat_Major,_Op._55_(%22Eroica%22)-_First_Movement_-_Allegro_Con_Brio.mp3"
        }
      ],
      "time-signature": "3/4"
    },
    "op60": {
      "opus": {
        "piece:nickname": "",
        "ref:musicbrainz": "273fea50-59bf-4711-81c8-035502b40c24",
        "symphony:num": "4",
        "year": "1807"
      }
    },
    "op60.1": {
      "opus": {
        "key": "Bb Major",
        "movement:title": "Adagio - Allegro vivace"
      },

      "quality:annotation": "3",
      "quality:audio:synchro": "0",
      "quality:audio": "1",
      "quality:metadata": "5",
      "quality:musical-time": "3",
      "quality:score": "3",

      "sources": [
        {
          "ref:musescore": "user/28768210/scores/15235927",
          "licence": "CC-BY-NC-SA-4.0"
        },
        {},
        {
          "audio": "https://imslp.eu/files/imglnks/euimg/8/80/IMSLP729163-PMLP1585-05.01._Symphony_No._4_In_B-Flat_Major,_Op._60-_First_Movement_-_Adagio;_Allegro_Vivace.mp3"
        }
      ],
      "time-signature": "2/2"
    },
    "op67": {
      "opus": {
        "piece:nickname": "",
        "ref:musicbrainz": "d03bff61-26fc-301b-98ac-4d8e85771cbc",
        "symphony:num": "5",
        "year": "1808"
      }
    },
    "op67.1": {
      "opus": {
        "key": "C minor",
        "movement:title": "Allegro con brio"
      },

      "quality:annotation": "3",
      "quality:audio:synchro": "0",
      "quality:audio": "1",
      "quality:metadata": "5",
      "quality:musical-time": "3",
      "quality:score": "3",

      "sources": [
        {
          "ref:musescore": "user/41033328/scores/7878515",
          "licence": "CC0-1.0"
        },
        {},
        {
          "audio": "https://imslp.eu/files/imglnks/euimg/d/d1/IMSLP729213-PMLP1586-06.01._Symphony_No._5_In_C_Minor,_Op._67-_First_Movement_-_Allegro_Con_Brio.mp3"
        }
      ],
      "time-signature": "2/4"
    },
    "op68": {
      "opus": {
        "piece:nickname": "Pastorale",
        "ref:musicbrainz": "60e1dcf6-e728-35be-8948-ba74500b6c6e",
        "symphony:num": "6",
        "year": "1808"
      }
    },
    "op68.1": {
      "opus": {
        "key": "F Major",
        "movement:title": "Allegro ma non troppo \u201cAwakening of cheerful feelings upon arrival in the country"
      },

      "quality:annotation": "3",
      "quality:audio:synchro": "0",
      "quality:audio": "1",
      "quality:metadata": "5",
      "quality:musical-time": "3",
      "quality:score": "3",

      "sources": [
        {
          "ref:musescore": "user/41033328/scores/8584493",
          "licence": "CC0-1.0"
        },
        {},
        {
          "audio": "https://imslp.eu/files/imglnks/euimg/7/76/IMSLP729184-PMLP1595-07.01._Symphony_No._6_In_F_Major,_Op._68_(%22Pastoral%22)-_First_Movement_-_Allegro_Ma_Non_Troppo_(Cheerful_Impressions_Awakened_By_Arrival_In_The_Country).mp3"
        }
      ],
      "time-signature": "2/4"
    },
    "op92": {
      "opus": {
        "piece:nickname": "",
        "ref:musicbrainz": "c7caedf2-954f-394b-9601-5878b76577ac",
        "symphony:num": "7",
        "year": "1813"
      }
    },
    "op92.1": {
      "opus": {
        "key": "A Major",
        "movement:title": "Poco sostenuto - Vivace"
      },

      "quality:annotation": "3",
      "quality:audio:synchro": "0",
      "quality:audio": "1",
      "quality:metadata": "5",
      "quality:musical-time": "1",
      "quality:score": "4",

      "sources": [
        {
          "ref:musescore": "user/879881/scores/6325970",
          "licence": "CC0-1.0"
        },
        {},
        {
          "audio": "https://imslp.eu/files/imglnks/euimg/8/80/IMSLP729188-PMLP1600-09.01._Symphony_No._7_In_A_Major,_Op._92-_First_Movement_-_Poco_Sostenuto;_Vivace.mp3"
        }
      ],
      "time-signature": "4/4"
    },
    "op93": {
      "opus": {
        "piece:nickname": "",
        "ref:musicbrainz": "256f32ec-94c5-44e8-b3fc-a027d92eec09",
        "symphony:num": "8",
        "year": "1814"
      }
    },
    "op93.1": {
      "opus": {
        "key": "A Major",
        "movement:title": "Allegro vivace e con brio"
      },

      "quality:annotation": "3",
      "quality:audio:synchro": "0",
      "quality:audio": "1",
      "quality:metadata": "5",
      "quality:musical-time": "0",
      "quality:score": "0",

      "sources": [
        {},
        {},
        {
          "audio": "https://imslp.eu/files/imglnks/euimg/7/7c/IMSLP729180-PMLP1605-11.01._Symphony_No._8_In_F_Major,_Op._93-_First_Movement_-_Allegro_Vivace_E_Con_Brio.mp3"
        }
      ],
      "time-signature": "3/4"
    },
    "op125": {
      "opus": {
        "piece:nickname": "Choral",
        "ref:musicbrainz": "c35b4956-d4f8-321a-865b-5b13d9ed192b",
        "symphony:num": "9",
        "year": "1824"
      }
    },
    "op125.1": {
      "opus": {
        "key": "D minor",
        "movement:title": "Allegro ma non troppo, un poco maestoso"
      },

      "quality:annotation": "3",
      "quality:audio:synchro": "0",
      "quality:audio": "1",
      "quality:metadata": "5",
      "quality:musical-time": 0,
      "quality:score": 0,

      "sources": [
        {
          "ref:musescore": "openscore/scores/5733014",
          "licence": "CC0-1.0"
        },
        {},
        {
          "audio": "https://imslp.eu/files/imglnks/euimg/2/2d/IMSLP729208-PMLP1607-12.01._Symphony_No._9_In_D_Major,_Op._125_(%22Choral%22)-_First_Movement_-_Allegro_Ma_Non_Troppo,_Un_Poco_Maestoso.mp3"
        }
      ],
      "time-signature": "2/4"
    }
  },
  "template": {
    "opus": {
      "..settings.score-minimap": false,

      "..sources.0.score": "https://gitlab.com/algomus.fr/orchestration/-/raw/main/scores/beethoven/beethoven_op{opusnum}-{mvt}.mscz",

      "..sources.1.analysis": "https://gitlab.com/algomus.fr/orchestration/-/raw/main/annotations/beethoven/beethoven-symph{symphony_num}-op{opusnum}-mvt{mvt}.dez",
      "..analysis:default": "beethoven-symph{symphony_num}-op{opusnum}-mvt{mvt}.dez",

      "..sources.2.album": "The Nine Symphonies Of Beethoven",
      "..sources.2.contributors.performer": "The Royal Philharmonic Orchestra, Ren\u00e9 Leibowitz, The Beecham Choral Society",
      "..sources.2.year": "1961",
      "..sources.2.license": "Public Domain",

      "contributors.composer": "Ludwig van Beethoven",
      "corpus": "Beethoven symphonies",
      "corpus:fr": "Symphonies de Beethoven",
      "genre": "Symphony",
      "id": "beethoven/{KEY}",
      "movement:num": "{mvt}",
      "opus": "op. {opusnum}",
      "piece:title": "Symphony no {symphony_num}, {piece_nickname}",
      "piece:title:fr": "Symphonie n\u00b0{symphony_num}, {piece_nickname}",
      "ref": "https://musescore.com/user/19710/sets/1213311",
      "ref:wikipedia": "Symphony_No._{symphony_num}_(Beethoven)",
      "title": "{piece_title}, {mvt}. {movement_title}"
    }
  }
}