{
  "corpus": {
    "availability": "Bach's Well-Tempered Clavier has been extensively studied, and systematic analyses of Bach’s fugues have been published by Prout (1910), Tovey (1924), Keller (1965), and Bruhn. [Giraud et al (2015)](https://hal.archives-ouvertes.fr/hal-01113520) published an annotation dataset detailing the 24 fugues of the first book, together with algorithms for fugue analysis. The Dezrann corpus contains these 24 annotated fugues, with scores synchronized to open recordings by [Kimiko Ishizaka](https://www.welltemperedclavier.org/) as well as performances recorded by the [Bach Netherlands Society](https://www.bachvereniging.nl/en/allofbach)",
    "availability:de": "Bachs Wohltemperiertes Klavier wurde ausführlich untersucht und systematische Analysen von Bachs Fugen wurden von Prout (1910), Tovey (1924), Keller (1965) und Bruhn veröffentlicht. [Giraud et al. (2015)](https://hal.archives-ouvertes.fr/hal-01113520) haben einen Annotationsdatensatz veröffentlicht, der die 24 Fugen des ersten Buchs im Detail beschreibt, zusammen mit Algorithmen für die Fugenanalyse. Der Dezrann-Korpus enthält diese 24 annotierten Fugenpartituren, synchronisiert mit den gemeinfreien Aufnahmen von [Kimiko Ishizaka](https://www.welltemperedclavier.org/).",
    "availability:el": "Το Καλά θερισμένο πιάνο του Bach έχει εκτενώς μελετηθεί, και συστηματικές αναλύσεις των φούγκων του Bach έχουν δημοσιευθεί από τους Prout (1910), Tovey (1924), Keller (1965) και Bruhn. Οι [Giraud et al (2015)](https://hal.archives-ouvertes.fr/hal-01113520) δημοσίευσαν ένα σύνολο δεδομένων σχολιασμένων φούγκων που καταγράφει λεπτομερώς τις 24 φούγκες του πρώτου βιβλίου, μαζί με αλγόριθμους για την ανάλυση φούγκας. Το σύνολο δεδομένων του Dezrann περιλαμβάνει αυτές τις 24 σχολιασμένες φούγκες, με σημειώσεις συγχρονισμένες με τις ανοικτές ηχογραφήσεις της [Kimiko Ishizaka](https://www.welltemperedclavier.org/).",
    "availability:fr": "Le *Clavier bien tempéré* de Bach a souvent été l'objet d'études. Des analyses systématiques des fugues de Bach ont été publiées par Prout (1910), Tovey (1924), Keller (1965) et Bruhn. [Giraud et al (2015)](https://hal.archives-ouvertes.fr/hal-01113520) ont publié des données d'annotations sur ces 24 fugues, ainsi que des algorithmes pour l'analyse des fugues. Le corpus Dezrann contient ces 24 fugues annotées, les partitions étant synchronisées aux enregistrements libres de [Kimiko Ishizaka](https://www.welltemperedclavier.org/).",
    "availability:hr": "Analize Bachova *Dobro ugođenog klavira* objavili su Prout (1910), Tovey (1924), Keller (1965) i Bruhn (1993). [Giraud je sa suradnicima (2015)](https://hal.archives-ouvertes.fr/hal-01113520) objavio anotiranu zbirku podataka s detaljima o 24 fuge prvog sveska te algoritame za njihovu analizu. Dezrannov korpus obuhvaća vizualizaciju analiza fuga prvog sveska te notne zapise sinkronizirane s besplatno dostupnim snimkama [Kimiko Ishizaka](https://www.welltemperedclavier.org/).",
    "availability:it": "Il clavicembalo ben temperato di Bach è stato studiato ampiamente. Analisi sistematiche delle fughe di Bach sono state pubblicate da Prout (1910), Tovey (1924), Keller (1965) e Bruhn. [Giraud et al (2015)](https://hal.archives-ouvertes.fr/hal-01113520) hanno pubblicato un dataset di annotazioni dettagliate sulle 24 fughe del primo libro, insieme ad algoritmi per l'analisi delle fughe. Il corpus Dezrann contiene queste 24 fughe annotate, con partiture sincronizzate alle registrazioni di pubblico dominio di [Kimiko Ishizaka](https://www.welltemperedclavier.org/).",
    "availability:sl": "Analize Bachovega *Dobro uglašenega klavirja* so objavili Prout (1910), Tovey (1924), Keller (1965), Bruhn (1993), in drugi. [Giraud et al. (2015)](https://hal.archives-ouvertes.fr/hal-01113520) so objavili podatkovno zbirko 24 fug iz prvega zvezka z rezutati analiz, pridobljenih s prav tako objavljenimi algoritmi. Dezrannov korpus vključuje vizualizacijo analiziranih partitur, usklajenih s prosto dostopnimi posnetki pianistke Kimiko Ishizake ([povezava](https://www.welltemperedclavier.org/)).",
    "contributors": {
      "analyst": "Mathieu Giraud, Richard Groult, Florence Levé",
      "composer": "Johann Sebastian Bach",
      "composer:fr": "Jean-Sébastien Bach",
      "maintainer": "Florence Levé <florence.leve@u-picardie.fr>, Mathieu Giraud <mathieu@algomus.fr>"
    },
    "genre": "Fuga",
    "id": "bach-fugues",
    "image": "http://algomus.fr/images/wtc-07-autograph-crop.jpg",
    "image:card": "https://ws.dezrann.net/resources/corpus/images/Bach-BWV852-zoom.jpg",
    "license": "? (scores), CC-BY-3.0 (audio), ODbL-1.0 (annotations)",
    "motto": "The 24 annotated fugues from the Book I of *The Well-Tempered Clavier*, with some video recordings from Kimiko Ishizaka and the Netherlands Bach Society",
    "motto:de": "Die 24 annotierten Fugen aus Buch I des *Wohltemperierten Klaviers* mit gemeinfreien Aufnahmen",
    "motto:el": "Οι 24 σχολιασμένες φούγκες από το Βιβλίο I του *Καλά θερισμένου πιάνου*, με ελεύθερες ηχογραφήσεις",
    "motto:fr": "Les 24 fugues annotées du premier livre du *Clavier bien tempéré*, avec des enregistrements vidéo de Kimiko Ishizaka et du projet All of Bach",
    "motto:hr": "24 fuge prvog svezka *Dobro ugođenog klavira* s vizualiziranim anotacijama i besplatno dostupnim snimkama",
    "motto:it": "Le 24 fughe dal Libro I de *Il clavicembalo ben temperato*, con annotazioni e con registrazioni di pubblico dominio",
    "motto:sl": "24 fug iz prvega zvezka *Dobro uglašenega klavirja* z vizualizacijo analize s prosto dostopnimi posnetki.",
    "opus": "BWV 846-869",
    "quality:corpus": 4,
    "quality:corpus:metadata": 4,
    "ref": "http://algomus.fr/data/",
    "ref:imslp": "Das_wohltemperierte_Klavier_I,_BWV_846-869_(Bach,_Johann_Sebastian)",
    "ref:musicbrainz": "dce85d48-7ce6-4bd6-b21e-a7c1be6eb1b4",
    "ref:publication": "https://hal.archives-ouvertes.fr/hal-01113520",
    "ref:wikipedia": "The_Well-Tempered_Clavier",
    "ref:wikipedia:fr": "Le_Clavier_bien_tempéré",
    "shorttitle:de": "Bach Fugen",
    "shorttitle:el": "Φούγκες του Bach",
    "shorttitle:en": "Bach Fugues",
    "shorttitle:fr": "Fugues de J.-S. Bach",
    "shorttitle:hr": "Fuge J. S. Bacha",
    "shorttitle:it": "Fughe di Bach",
    "showcase": [
      "bwv847",
      "bwv848"
    ],
    "status": "✅ The corpus is in good condition, with only minor issues. For the majority of pieces, the score are well presented, include analyses, and are synchronized with two videos.",
    "text": "The two books of J. S. Bach's *Well-Tempered Clavier* are a particularly consistent corpus in their exploration of the 24 major and minor tonalities in 48 pairs of preludes and fugues.  The Italian word *fuga* is related to the Latin words *fugere* (to flee) and *fugare* (to chase): The themes (*subject* and *counter-subjects*) are played by each voice, one following the other in succession. They occur either in their initial form or, more often, altered or transposed, building a complex harmonic texture.",
    "text:de": "Die beiden Bücher von J. S. Bachs *Wohltemperiertem Klavier* bilden durch ihre Erkundung der 24 Dur- und Molltonarten in 48 gepaarten Präludien und Fugen einen besonders konsistenten Korpus. Das italienische Wort *Fuga* ist verwandt mit den lateinischen Wörtern *fugere* (fliehen) und *fugare* (verfolgen): Die Themen (*Subjekt* und *Kontrasubjekt*) erklingen in jeder Stimme nacheinander. Sie erscheinen entweder in ihrer ursprünglichen Form oder, häufiger, verändert oder transponiert und bilden so eine komplexe harmonische Textur.",
    "text:el": "Τα δύο βιβλία του *Καλά θερισμένου πιάνου* του J. S.      αποτελούν ένα ιδιαίτερα συνεκτικό σώμα έργου στην έρευνα των 24 μεγάλων και μικρών τονικοτήτων σε 48 ζεύγη προλετούδων και φούγκων. Η ιταλική λέξη *fuga* σχετίζεται με τις λατινικές λέξεις *fugere* (να φεύγει) και *fugare* (να κυνηγά): Τα θέματα (*υποκείμενο* και *αντι-υποκείμενα*) παίζονται από κάθε φωνή, μια ακολουθώντας την άλλη διαδοχικά. Εμφανίζονται είτε στην αρχική τους μορφή είτε, πιο συχνά, αλλοιωμένα ή μετατοπισμένα, δημιουργώντας ένα πολύπλοκο αρμονικό ύφος.",
    "text:fr": "Les deux livres du *Clavier bien tempéré* de J. S. Bach forment un corpus particulièrement cohérent dans leur exploration des 24 tonalités majeures et mineures, en 48 paires de préludes et de fugues. Le mot italien *fuga* est lié aux mots latins *fugere* (fuir) et *fugare* (pourchasser). Les thèmes, *sujets* et *contre-sujets*, sont joués par chaque voix, l'une suivant l'autre en succession. Ils apparaissent soit dans leur forme initiale, soit, le plus souvent, modifiés ou transposés, créant ainsi une texture harmonique complexe.",
    "text:hr": "*Dobro ugođeni klavir* Johanna Sebastiana Bacha (1685-1750) obuhvaća 48 parova preludija i fuga jednako raspoređenih u dva sveska. Parovi preludija i fuga u istom su tonalitetu, njihov redoslijed slijedi nizu kromatične ljestvice, a napisani su u sva 24 tonaliteta dura i mola. Fuga je polifoni glazbeni oblik započet jednoglasnim izlaganjem teme, koju potom preuzme drugi glas u drugom tonalitetu, dok prvi glas uvodi kontrapunktsku pratnju. Tema prelazi iz glasa u glas, mijenja tonalitete te „bježi“ pred kontrapunktskom pratnjom, zato je dobila ime po latinskoj riječi za bijeg (*fugere*) ili ganjanje (*fugare*).",
    "text:it": "I due libri de *Il clavicembalo ben temperato* di J. S. Bach costituiscono un corpus particolarmente coerente in cui l'autore eplora le 24 tonalità maggiori e minori in 48 coppie di preludi e fughe. Il termine *fuga* è legato etimologicamente ai verbi latini *fugere* (fuggire) e *fugare* (inseguire): i temi (*soggetto* e *controsoggetto*) sono suonati da ogni voce, una dopo l'altra in successione. Si presentano sia nella loro forma iniziale, sia, più spesso, alterati o trasposti, costruendo una complessa trama armonica.",
    "text:sl": "Zbirka *Dobro uglašeni klavir* J. S. Bacha (1685-1750) sestoji iz dveh zvezkov, v vsakem po 24 parov preludijev in fug. Zaporedje teh parov, ki so napisani v eni izmed 24 durovih oz. molovih tonalitet, sledi nizu tonov kromatične lestvice. Fuga je polifona glasbena oblika, ki se začne z enoglasno predstavitvijo teme, nato pa temo prevzame drugi glas v drugi tonaliteti, prvi glas pa uvede kontrapunktno spremljavo. Ker se tema premika iz glasu v glas, spreminja tonalitete in »beži« pred kontrapunktsko spremljavo, je glasbena oblika fuga dobila ime po latinski besedi za beg (fugere) ali zasledovanje (fugare).",
    "title": "Das wohltemperierte Klavier, Buch I",
    "title:de": "Das Wohltemperierte Klavier, Buch I",
    "title:el": "Το καλά θερισμένο πιάνο, Βιβλίο I",
    "title:en": "The Well-Tempered Clavier, Book I",
    "title:fr": "Le clavier bien tempéré, Livre I",
    "title:hr": "Dobro ugođeni klavir, I. svezak",
    "title:it": "Il clavicembalo ben temperato, Libro I",
    "title:sl": "Fuge J. S. Bacha",
    "year": "1722"
  },
  "pieces": {
    "bwv846": {
      "analysis:default": "01-bwv846-ref.dez",
      "opus": {
        "collection": "The Well-Tempered Clavier, Book I",
        "collection:fr": "Le clavier bien tempéré, Livre I",
        "contributors": {
          "composer": "Johann Sebastian Bach",
          "composer:fr": "Jean-Sébastien Bach"
        },
        "genre": "Fuga",
        "git:synchro": "https://gitlab.com/algomus.fr/dezrann/dezrann-corpus/-/raw/main/corpus/bach-fugues/synchro",
        "id": "bwv846",
        "key": "C major",
        "movement:num": "2",
        "opus": "BWV 846",
        "ref:imslp": "Das_wohltemperierte_Klavier_I,_BWV_846-869_(Bach,_Johann_Sebastian)",
        "ref:musicbrainz": "dce85d48-7ce6-4bd6-b21e-a7c1be6eb1b4",
        "ref:wikipedia": "The_Well-Tempered_Clavier",
        "title": "Fuga #1 in C major",
        "title:fr": "Fugue n°1, C major",
        "year": "1722"
      },
      "quality:annotation": "5",
      "quality:audio": "4",
      "quality:audio:synchro": "4",
      "quality:metadata": "3",
      "quality:musical-time": "3",
      "quality:score": "3",
      "sources": [
        {
          "contributors": {
            "editor": "KernScores, WhenInRome",
            "encoder": "David Huron"
          },
          "name": "KernScores",
          "ref": "https://github.com/humdrum-tools/tree/master/bach-wtc-fugues/master/kern/wtc1f01.krn",
          "score": "https://raw.githubusercontent.com/humdrum-tools/bach-wtc-fugues/master/kern/wtc1f01.krn"
        },
        {
          "analysis": "https://gitlab.com/algomus.fr/algomus-data/-/raw/master/fugues/bach-wtc-i/01-bwv846-ref.dez",
          "contributors": {
            "analyst": "Mathieu Giraud, Richard Groult, Florence Levé"
          },
          "license": "OdBL-1.0",
          "ref": "http://algomus.fr/data/",
          "ref:doi": "10.1162/COMJ_a_00300"
        },
        {
          "contributors": {
            "editor": "The Netherlands Bach Society",
            "performer": "Siebe Henstra"
          },
          "name": "The Netherlands Bach Society",
          "ref": "https://www.bachvereniging.nl/en/about-allofbach",
          "synchro": "https://gitlab.com/algomus.fr/dezrann/dezrann-corpus/-/raw/main/corpus/bach-fugues/synchro/bwv846-AllOfBach.synchro.json",
          "video:yt": "xCqWH9bKzQE"
        },
        {
          "audio": "http://alb.algomus.net:8080/resources/corpus/audio/open-well-tempered-clavier/bwv846.mp3",
          "contributors": {
            "editor": "Open Well-Tempered Clavier",
            "performer": "Kimiko Ishakaza"
          },
          "license": "CC-BY-3.0",
          "name": "Open Well-Tempered Clavier",
          "ref": "https://www.welltemperedclavier.org/",
          "synchro": "https://gitlab.com/algomus.fr/dezrann/dezrann-corpus/-/raw/main/corpus/bach-fugues/synchro/bwv846-Ishizaka.synchro.json"
        }
      ]
    },
    "bwv847": {
      "analysis:default": "02-bwv847-ref.dez",
      "opus": {
        "collection": "The Well-Tempered Clavier, Book I",
        "collection:fr": "Le clavier bien tempéré, Livre I",
        "contributors": {
          "composer": "Johann Sebastian Bach",
          "composer:fr": "Jean-Sébastien Bach"
        },
        "genre": "Fuga",
        "git:synchro": "https://gitlab.com/algomus.fr/dezrann/dezrann-corpus/-/raw/main/corpus/bach-fugues/synchro",
        "id": "bwv847",
        "key": "C minor",
        "movement:num": "2",
        "opus": "BWV 847",
        "ref:imslp": "Das_wohltemperierte_Klavier_I,_BWV_846-869_(Bach,_Johann_Sebastian)",
        "ref:musicbrainz": "dce85d48-7ce6-4bd6-b21e-a7c1be6eb1b4",
        "ref:wikipedia": "The_Well-Tempered_Clavier",
        "title": "Fuga #2 in C minor",
        "title:fr": "Fugue n°2, C minor",
        "year": "1722"
      },
      "quality:annotation": "5",
      "quality:audio": "4",
      "quality:audio:synchro": "4",
      "quality:metadata": "3",
      "quality:musical-time": "3",
      "quality:score": "3",
      "sources": [
        {
          "contributors": {
            "editor": "KernScores, WhenInRome",
            "encoder": "David Huron"
          },
          "name": "KernScores",
          "ref": "https://github.com/humdrum-tools/tree/master/bach-wtc-fugues/master/kern/wtc1f02.krn",
          "score": "https://raw.githubusercontent.com/humdrum-tools/bach-wtc-fugues/master/kern/wtc1f02.krn"
        },
        {
          "analysis": "https://gitlab.com/algomus.fr/algomus-data/-/raw/master/fugues/bach-wtc-i/02-bwv847-ref.dez",
          "contributors": {
            "analyst": "Mathieu Giraud, Richard Groult, Florence Levé"
          },
          "license": "OdBL-1.0",
          "ref": "http://algomus.fr/data/",
          "ref:doi": "10.1162/COMJ_a_00300"
        },
        {
          "contributors": {
            "editor": "The Netherlands Bach Society",
            "performer": "Masato Suzuki"
          },
          "name": "The Netherlands Bach Society",
          "ref": "https://www.bachvereniging.nl/en/about-allofbach",
          "synchro": "https://gitlab.com/algomus.fr/dezrann/dezrann-corpus/-/raw/main/corpus/bach-fugues/synchro/bwv847-AllOfBach.synchro.json",
          "video:yt": "XkSJq_W58TU"
        },
        {
          "audio": "http://alb.algomus.net:8080/resources/corpus/audio/open-well-tempered-clavier/bwv847.mp3",
          "contributors": {
            "editor": "Open Well-Tempered Clavier",
            "performer": "Kimiko Ishizaka"
          },
          "license": "CC-BY-3.0",
          "name": "Open Well-Tempered Clavier",
          "ref": "https://www.welltemperedclavier.org/",
          "synchro": "https://gitlab.com/algomus.fr/dezrann/dezrann-corpus/-/raw/main/corpus/bach-fugues/synchro/bwv847-Ishizaka-yt.synchro.json",
          "video:yt": "vxZL0Fizx-E"
        }
      ]
    },
    "bwv848": {
      "analysis:default": "03-bwv848-ref.dez",
      "opus": {
        "collection": "The Well-Tempered Clavier, Book I",
        "collection:fr": "Le clavier bien tempéré, Livre I",
        "contributors": {
          "composer": "Johann Sebastian Bach",
          "composer:fr": "Jean-Sébastien Bach"
        },
        "genre": "Fuga",
        "git:synchro": "https://gitlab.com/algomus.fr/dezrann/dezrann-corpus/-/raw/main/corpus/bach-fugues/synchro",
        "id": "bwv848",
        "key": "C♯ major",
        "movement:num": "2",
        "opus": "BWV 848",
        "ref:imslp": "Das_wohltemperierte_Klavier_I,_BWV_846-869_(Bach,_Johann_Sebastian)",
        "ref:musicbrainz": "dce85d48-7ce6-4bd6-b21e-a7c1be6eb1b4",
        "ref:wikipedia": "The_Well-Tempered_Clavier",
        "title": "Fuga #3 in C♯ major",
        "title:fr": "Fugue n°3, C♯ major",
        "year": "1722"
      },
      "quality:annotation": "5",
      "quality:audio": "4",
      "quality:audio:synchro": "4",
      "quality:metadata": "3",
      "quality:musical-time": "3",
      "quality:score": "3",
      "sources": [
        {
          "contributors": {
            "editor": "KernScores, WhenInRome",
            "encoder": "David Huron"
          },
          "name": "KernScores",
          "ref": "https://github.com/humdrum-tools/tree/master/bach-wtc-fugues/master/kern/wtc1f03.krn",
          "score": "https://raw.githubusercontent.com/humdrum-tools/bach-wtc-fugues/master/kern/wtc1f03.krn"
        },
        {
          "analysis": "https://gitlab.com/algomus.fr/algomus-data/-/raw/master/fugues/bach-wtc-i/03-bwv848-ref.dez",
          "contributors": {
            "analyst": "Mathieu Giraud, Richard Groult, Florence Levé"
          },
          "license": "OdBL-1.0",
          "ref": "http://algomus.fr/data/",
          "ref:doi": "10.1162/COMJ_a_00300"
        },
        {
          "contributors": {
            "editor": "The Netherlands Bach Society",
            "performer": "Patrick Ayrton"
          },
          "name": "The Netherlands Bach Society",
          "ref": "https://www.bachvereniging.nl/en/about-allofbach",
          "synchro": "https://gitlab.com/algomus.fr/dezrann/dezrann-corpus/-/raw/main/corpus/bach-fugues/synchro/bwv848-AllOfBach.synchro.json",
          "video:yt": "d_DFyOgtCzw"
        },
        {
          "audio": "http://alb.algomus.net:8080/resources/corpus/audio/open-well-tempered-clavier/bwv848.mp3",
          "contributors": {
            "editor": "Open Well-Tempered Clavier",
            "performer": "Kimiko Ishakaza"
          },
          "license": "CC-BY-3.0",
          "name": "Open Well-Tempered Clavier",
          "ref": "https://www.welltemperedclavier.org/",
          "synchro": "https://gitlab.com/algomus.fr/dezrann/dezrann-corpus/-/raw/main/corpus/bach-fugues/synchro/bwv848-Ishizaka.synchro.json"
        }
      ]
    },
    "bwv849": {
      "analysis:default": "04-bwv849-ref.dez",
      "opus": {
        "collection": "The Well-Tempered Clavier, Book I",
        "collection:fr": "Le clavier bien tempéré, Livre I",
        "contributors": {
          "composer": "Johann Sebastian Bach",
          "composer:fr": "Jean-Sébastien Bach"
        },
        "genre": "Fuga",
        "git:synchro": "https://gitlab.com/algomus.fr/dezrann/dezrann-corpus/-/raw/main/corpus/bach-fugues/synchro",
        "id": "bwv849",
        "key": "C♯ minor",
        "movement:num": "2",
        "opus": "BWV 849",
        "ref:imslp": "Das_wohltemperierte_Klavier_I,_BWV_846-869_(Bach,_Johann_Sebastian)",
        "ref:musicbrainz": "dce85d48-7ce6-4bd6-b21e-a7c1be6eb1b4",
        "ref:wikipedia": "The_Well-Tempered_Clavier",
        "title": "Fuga #4 in C♯ minor",
        "title:fr": "Fugue n°4, C♯ minor",
        "year": "1722"
      },
      "quality:annotation": "5",
      "quality:audio": "4",
      "quality:audio:synchro": "4",
      "quality:metadata": "3",
      "quality:musical-time": "3",
      "quality:score": "3",
      "sources": [
        {
          "contributors": {
            "editor": "KernScores, WhenInRome",
            "encoder": "David Huron"
          },
          "name": "KernScores",
          "ref": "https://github.com/humdrum-tools/tree/master/bach-wtc-fugues/master/kern/wtc1f04.krn",
          "score": "https://raw.githubusercontent.com/humdrum-tools/bach-wtc-fugues/master/kern/wtc1f04.krn"
        },
        {
          "analysis": "https://gitlab.com/algomus.fr/algomus-data/-/raw/master/fugues/bach-wtc-i/04-bwv849-ref.dez",
          "contributors": {
            "analyst": "Mathieu Giraud, Richard Groult, Florence Levé"
          },
          "license": "OdBL-1.0",
          "ref": "http://algomus.fr/data/",
          "ref:doi": "10.1162/COMJ_a_00300"
        },
        {
          "contributors": {
            "editor": "The Netherlands Bach Society",
            "performer": "Bertrand Cuiller"
          },
          "name": "The Netherlands Bach Society",
          "ref": "https://www.bachvereniging.nl/en/about-allofbach",
          "synchro": "https://gitlab.com/algomus.fr/dezrann/dezrann-corpus/-/raw/main/corpus/bach-fugues/synchro/bwv849-AllOfBach.synchro.json",
          "video:yt": "pbZkfxboS7Y"
        },
        {
          "audio": "http://alb.algomus.net:8080/resources/corpus/audio/open-well-tempered-clavier/bwv849.mp3",
          "contributors": {
            "editor": "Open Well-Tempered Clavier",
            "performer": "Kimiko Ishakaza"
          },
          "license": "CC-BY-3.0",
          "name": "Open Well-Tempered Clavier",
          "ref": "https://www.welltemperedclavier.org/",
          "synchro": "https://gitlab.com/algomus.fr/dezrann/dezrann-corpus/-/raw/main/corpus/bach-fugues/synchro/bwv849-Ishizaka.synchro.json"
        }
      ]
    },
    "bwv850": {
      "analysis:default": "05-bwv850-ref.dez",
      "opus": {
        "collection": "The Well-Tempered Clavier, Book I",
        "collection:fr": "Le clavier bien tempéré, Livre I",
        "contributors": {
          "composer": "Johann Sebastian Bach",
          "composer:fr": "Jean-Sébastien Bach"
        },
        "genre": "Fuga",
        "git:synchro": "https://gitlab.com/algomus.fr/dezrann/dezrann-corpus/-/raw/main/corpus/bach-fugues/synchro",
        "id": "bwv850",
        "key": "D major",
        "movement:num": "2",
        "opus": "BWV 850",
        "ref:imslp": "Das_wohltemperierte_Klavier_I,_BWV_846-869_(Bach,_Johann_Sebastian)",
        "ref:musicbrainz": "dce85d48-7ce6-4bd6-b21e-a7c1be6eb1b4",
        "ref:wikipedia": "The_Well-Tempered_Clavier",
        "title": "Fuga #5 in D major",
        "title:fr": "Fugue n°5, D major",
        "year": "1722"
      },
      "quality:annotation": "5",
      "quality:audio": "4",
      "quality:audio:synchro": "4",
      "quality:metadata": "3",
      "quality:musical-time": "3",
      "quality:score": "3",
      "sources": [
        {
          "contributors": {
            "editor": "KernScores, WhenInRome",
            "encoder": "David Huron"
          },
          "name": "KernScores",
          "ref": "https://github.com/humdrum-tools/tree/master/bach-wtc-fugues/master/kern/wtc1f05.krn",
          "score": "https://raw.githubusercontent.com/humdrum-tools/bach-wtc-fugues/master/kern/wtc1f05.krn"
        },
        {
          "analysis": "https://gitlab.com/algomus.fr/algomus-data/-/raw/master/fugues/bach-wtc-i/05-bwv850-ref.dez",
          "contributors": {
            "analyst": "Mathieu Giraud, Richard Groult, Florence Levé"
          },
          "license": "OdBL-1.0",
          "ref": "http://algomus.fr/data/",
          "ref:doi": "10.1162/COMJ_a_00300"
        },
        {
          "contributors": {
            "editor": "The Netherlands Bach Society",
            "performer": "Guillermo Brachetta"
          },
          "name": "The Netherlands Bach Society",
          "ref": "https://www.bachvereniging.nl/en/about-allofbach",
          "synchro": "https://gitlab.com/algomus.fr/dezrann/dezrann-corpus/-/raw/main/corpus/bach-fugues/synchro/bwv850-AllOfBach.synchro.json",
          "video:yt": "aZpop0EPey0"
        },
        {
          "audio": "http://alb.algomus.net:8080/resources/corpus/audio/open-well-tempered-clavier/bwv850.mp3",
          "contributors": {
            "editor": "Open Well-Tempered Clavier",
            "performer": "Kimiko Ishakaza"
          },
          "license": "CC-BY-3.0",
          "name": "Open Well-Tempered Clavier",
          "ref": "https://www.welltemperedclavier.org/",
          "synchro": "https://gitlab.com/algomus.fr/dezrann/dezrann-corpus/-/raw/main/corpus/bach-fugues/synchro/bwv850-Ishizaka.synchro.json"
        }
      ]
    },
    "bwv851": {
      "analysis:default": "06-bwv851-ref.dez",
      "opus": {
        "collection": "The Well-Tempered Clavier, Book I",
        "collection:fr": "Le clavier bien tempéré, Livre I",
        "contributors": {
          "composer": "Johann Sebastian Bach",
          "composer:fr": "Jean-Sébastien Bach"
        },
        "genre": "Fuga",
        "git:synchro": "https://gitlab.com/algomus.fr/dezrann/dezrann-corpus/-/raw/main/corpus/bach-fugues/synchro",
        "id": "bwv851",
        "key": "D minor",
        "movement:num": "2",
        "opus": "BWV 851",
        "ref:imslp": "Das_wohltemperierte_Klavier_I,_BWV_846-869_(Bach,_Johann_Sebastian)",
        "ref:musicbrainz": "dce85d48-7ce6-4bd6-b21e-a7c1be6eb1b4",
        "ref:wikipedia": "The_Well-Tempered_Clavier",
        "title": "Fuga #6 in D minor",
        "title:fr": "Fugue n°6, D minor",
        "year": "1722"
      },
      "quality:annotation": "5",
      "quality:audio": "4",
      "quality:audio:synchro": "4",
      "quality:metadata": "3",
      "quality:musical-time": "3",
      "quality:score": "3",
      "sources": [
        {
          "contributors": {
            "editor": "KernScores, WhenInRome",
            "encoder": "David Huron"
          },
          "name": "KernScores",
          "ref": "https://github.com/humdrum-tools/tree/master/bach-wtc-fugues/master/kern/wtc1f06.krn",
          "score": "https://raw.githubusercontent.com/humdrum-tools/bach-wtc-fugues/master/kern/wtc1f06.krn"
        },
        {
          "analysis": "https://gitlab.com/algomus.fr/algomus-data/-/raw/master/fugues/bach-wtc-i/06-bwv851-ref.dez",
          "contributors": {
            "analyst": "Mathieu Giraud, Richard Groult, Florence Levé"
          },
          "license": "OdBL-1.0",
          "ref": "http://algomus.fr/data/",
          "ref:doi": "10.1162/COMJ_a_00300"
        },
        {
          "contributors": {
            "editor": "The Netherlands Bach Society",
            "performer": "Tineke Steenbrick"
          },
          "name": "The Netherlands Bach Society",
          "ref": "https://www.bachvereniging.nl/en/about-allofbach",
          "synchro": "https://gitlab.com/algomus.fr/dezrann/dezrann-corpus/-/raw/main/corpus/bach-fugues/synchro/bwv851-AllOfBach.synchro.json",
          "video:yt": "nz7JakMMG-c"
        },
        {
          "audio": "http://alb.algomus.net:8080/resources/corpus/audio/open-well-tempered-clavier/bwv851.mp3",
          "contributors": {
            "editor": "Open Well-Tempered Clavier",
            "performer": "Kimiko Ishakaza"
          },
          "license": "CC-BY-3.0",
          "name": "Open Well-Tempered Clavier",
          "ref": "https://www.welltemperedclavier.org/",
          "synchro": "https://gitlab.com/algomus.fr/dezrann/dezrann-corpus/-/raw/main/corpus/bach-fugues/synchro/bwv851-Ishizaka.synchro.json"
        }
      ]
    },
    "bwv852": {
      "analysis:default": "07-bwv852-ref.dez",
      "opus": {
        "collection": "The Well-Tempered Clavier, Book I",
        "collection:fr": "Le clavier bien tempéré, Livre I",
        "contributors": {
          "composer": "Johann Sebastian Bach",
          "composer:fr": "Jean-Sébastien Bach"
        },
        "genre": "Fuga",
        "git:synchro": "https://gitlab.com/algomus.fr/dezrann/dezrann-corpus/-/raw/main/corpus/bach-fugues/synchro",
        "id": "bwv852",
        "key": "E♭ major",
        "movement:num": "2",
        "opus": "BWV 852",
        "ref:imslp": "Das_wohltemperierte_Klavier_I,_BWV_846-869_(Bach,_Johann_Sebastian)",
        "ref:musicbrainz": "dce85d48-7ce6-4bd6-b21e-a7c1be6eb1b4",
        "ref:wikipedia": "The_Well-Tempered_Clavier",
        "title": "Fuga #7 in E♭ major",
        "title:fr": "Fugue n°7, E♭ major",
        "year": "1722"
      },
      "quality:annotation": "5",
      "quality:audio": "4",
      "quality:audio:synchro": "4",
      "quality:metadata": "3",
      "quality:musical-time": "3",
      "quality:score": "3",
      "sources": [
        {
          "contributors": {
            "editor": "KernScores, WhenInRome",
            "encoder": "David Huron"
          },
          "name": "KernScores",
          "ref": "https://github.com/humdrum-tools/tree/master/bach-wtc-fugues/master/kern/wtc1f07.krn",
          "score": "https://raw.githubusercontent.com/humdrum-tools/bach-wtc-fugues/master/kern/wtc1f07.krn"
        },
        {
          "analysis": "https://gitlab.com/algomus.fr/algomus-data/-/raw/master/fugues/bach-wtc-i/07-bwv852-ref.dez",
          "contributors": {
            "analyst": "Mathieu Giraud, Richard Groult, Florence Levé"
          },
          "license": "OdBL-1.0",
          "ref": "http://algomus.fr/data/",
          "ref:doi": "10.1162/COMJ_a_00300"
        },
        {
          "contributors": {
            "editor": "The Netherlands Bach Society",
            "performer": "Pieter-Jan Belder"
          },
          "name": "The Netherlands Bach Society",
          "ref": "https://www.bachvereniging.nl/en/about-allofbach",
          "synchro": "https://gitlab.com/algomus.fr/dezrann/dezrann-corpus/-/raw/main/corpus/bach-fugues/synchro/bwv852-AllOfBach.synchro.json",
          "video:yt": "kvJRRWbsgSE"
        },
        {
          "audio": "http://alb.algomus.net:8080/resources/corpus/audio/open-well-tempered-clavier/bwv852.mp3",
          "contributors": {
            "editor": "Open Well-Tempered Clavier",
            "performer": "Kimiko Ishizaka"
          },
          "license": "CC-BY-3.0",
          "name": "Open Well-Tempered Clavier",
          "ref": "https://www.welltemperedclavier.org/",
          "synchro": "https://gitlab.com/algomus.fr/dezrann/dezrann-corpus/-/raw/main/corpus/bach-fugues/synchro/bwv852-Ishizaka-yt.synchro.json",
          "video:yt": "csr5EyjIKB4"
        }
      ]
    },
    "bwv853": {
      "analysis:default": "08-bwv853-ref.dez",
      "opus": {
        "collection": "The Well-Tempered Clavier, Book I",
        "collection:fr": "Le clavier bien tempéré, Livre I",
        "contributors": {
          "composer": "Johann Sebastian Bach",
          "composer:fr": "Jean-Sébastien Bach"
        },
        "genre": "Fuga",
        "git:synchro": "https://gitlab.com/algomus.fr/dezrann/dezrann-corpus/-/raw/main/corpus/bach-fugues/synchro",
        "id": "bwv853",
        "key": "D♯ minor",
        "movement:num": "2",
        "opus": "BWV 853",
        "ref:imslp": "Das_wohltemperierte_Klavier_I,_BWV_846-869_(Bach,_Johann_Sebastian)",
        "ref:musicbrainz": "dce85d48-7ce6-4bd6-b21e-a7c1be6eb1b4",
        "ref:wikipedia": "The_Well-Tempered_Clavier",
        "title": "Fuga #8 in D♯ minor",
        "title:fr": "Fugue n°8, D♯ minor",
        "year": "1722"
      },
      "quality:annotation": "5",
      "quality:audio": "4",
      "quality:audio:synchro": "4",
      "quality:metadata": "3",
      "quality:musical-time": "3",
      "quality:score": "3",
      "sources": [
        {
          "contributors": {
            "editor": "KernScores, WhenInRome",
            "encoder": "David Huron"
          },
          "name": "KernScores",
          "ref": "https://github.com/humdrum-tools/tree/master/bach-wtc-fugues/master/kern/wtc1f08.krn",
          "score": "https://raw.githubusercontent.com/humdrum-tools/bach-wtc-fugues/master/kern/wtc1f08.krn"
        },
        {
          "analysis": "https://gitlab.com/algomus.fr/algomus-data/-/raw/master/fugues/bach-wtc-i/08-bwv853-ref.dez",
          "contributors": {
            "analyst": "Mathieu Giraud, Richard Groult, Florence Levé"
          },
          "license": "OdBL-1.0",
          "ref": "http://algomus.fr/data/",
          "ref:doi": "10.1162/COMJ_a_00300"
        },
        {
          "contributors": {
            "editor": "The Netherlands Bach Society",
            "performer": "Bart Jacobs"
          },
          "name": "The Netherlands Bach Society",
          "ref": "https://www.bachvereniging.nl/en/about-allofbach",
          "synchro": "https://gitlab.com/algomus.fr/dezrann/dezrann-corpus/-/raw/main/corpus/bach-fugues/synchro/bwv853-AllOfBach.synchro.json",
          "video:yt": "su9NVEb6qEY"
        },
        {
          "audio": "http://alb.algomus.net:8080/resources/corpus/audio/open-well-tempered-clavier/bwv853.mp3",
          "contributors": {
            "editor": "Open Well-Tempered Clavier",
            "performer": "Kimiko Ishizaka"
          },
          "license": "CC-BY-3.0",
          "name": "Open Well-Tempered Clavier",
          "ref": "https://www.welltemperedclavier.org/",
          "synchro": "https://gitlab.com/algomus.fr/dezrann/dezrann-corpus/-/raw/main/corpus/bach-fugues/synchro/bwv853-Ishizaka-yt.synchro.json",
          "video:yt": "OGvu4uxDpZ4"
        }
      ]
    },
    "bwv854": {
      "analysis:default": "09-bwv854-ref.dez",
      "opus": {
        "collection": "The Well-Tempered Clavier, Book I",
        "collection:fr": "Le clavier bien tempéré, Livre I",
        "contributors": {
          "composer": "Johann Sebastian Bach",
          "composer:fr": "Jean-Sébastien Bach"
        },
        "genre": "Fuga",
        "git:synchro": "https://gitlab.com/algomus.fr/dezrann/dezrann-corpus/-/raw/main/corpus/bach-fugues/synchro",
        "id": "bwv854",
        "key": "E major",
        "movement:num": "2",
        "opus": "BWV 854",
        "ref:imslp": "Das_wohltemperierte_Klavier_I,_BWV_846-869_(Bach,_Johann_Sebastian)",
        "ref:musicbrainz": "dce85d48-7ce6-4bd6-b21e-a7c1be6eb1b4",
        "ref:wikipedia": "The_Well-Tempered_Clavier",
        "title": "Fuga #9 in E major",
        "title:fr": "Fugue n°9, E major",
        "year": "1722"
      },
      "quality:annotation": "5",
      "quality:audio": "4",
      "quality:audio:synchro": "4",
      "quality:metadata": "3",
      "quality:musical-time": "3",
      "quality:score": "3",
      "sources": [
        {
          "contributors": {
            "editor": "KernScores, WhenInRome",
            "encoder": "David Huron"
          },
          "name": "KernScores",
          "ref": "https://github.com/humdrum-tools/tree/master/bach-wtc-fugues/master/kern/wtc1f09.krn",
          "score": "https://raw.githubusercontent.com/humdrum-tools/bach-wtc-fugues/master/kern/wtc1f09.krn"
        },
        {
          "analysis": "https://gitlab.com/algomus.fr/algomus-data/-/raw/master/fugues/bach-wtc-i/09-bwv854-ref.dez",
          "contributors": {
            "analyst": "Mathieu Giraud, Richard Groult, Florence Levé"
          },
          "license": "OdBL-1.0",
          "ref": "http://algomus.fr/data/",
          "ref:doi": "10.1162/COMJ_a_00300"
        },
        {
          "contributors": {
            "editor": "The Netherlands Bach Society",
            "performer": "Christian Rieger"
          },
          "name": "The Netherlands Bach Society",
          "ref": "https://www.bachvereniging.nl/en/about-allofbach",
          "synchro": "https://gitlab.com/algomus.fr/dezrann/dezrann-corpus/-/raw/main/corpus/bach-fugues/synchro/bwv854-AllOfBach.synchro.json",
          "video:yt": "5gf-QYR1Ap0"
        },
        {
          "audio": "http://alb.algomus.net:8080/resources/corpus/audio/open-well-tempered-clavier/bwv854.mp3",
          "contributors": {
            "editor": "Open Well-Tempered Clavier",
            "performer": "Kimiko Ishizaka"
          },
          "license": "CC-BY-3.0",
          "name": "Open Well-Tempered Clavier",
          "ref": "https://www.welltemperedclavier.org/",
          "synchro": "https://gitlab.com/algomus.fr/dezrann/dezrann-corpus/-/raw/main/corpus/bach-fugues/synchro/bwv854-Ishizaka-yt.synchro.json",
          "video:yt": "KXqPYdpBalQ"
        }
      ]
    },
    "bwv855": {
      "analysis:default": "10-bwv855-ref.dez",
      "opus": {
        "collection": "The Well-Tempered Clavier, Book I",
        "collection:fr": "Le clavier bien tempéré, Livre I",
        "contributors": {
          "composer": "Johann Sebastian Bach",
          "composer:fr": "Jean-Sébastien Bach"
        },
        "genre": "Fuga",
        "git:synchro": "https://gitlab.com/algomus.fr/dezrann/dezrann-corpus/-/raw/main/corpus/bach-fugues/synchro",
        "id": "bwv855",
        "key": "E minor",
        "movement:num": "2",
        "opus": "BWV 855",
        "ref:imslp": "Das_wohltemperierte_Klavier_I,_BWV_846-869_(Bach,_Johann_Sebastian)",
        "ref:musicbrainz": "dce85d48-7ce6-4bd6-b21e-a7c1be6eb1b4",
        "ref:wikipedia": "The_Well-Tempered_Clavier",
        "title": "Fuga #10 in E minor",
        "title:fr": "Fugue n°10, E minor",
        "year": "1722"
      },
      "quality:annotation": "5",
      "quality:audio": "4",
      "quality:audio:synchro": "0",
      "quality:metadata": "3",
      "quality:musical-time": "3",
      "quality:score": "3",
      "sources": [
        {
          "contributors": {
            "editor": "KernScores, WhenInRome",
            "encoder": "David Huron"
          },
          "name": "KernScores",
          "ref": "https://github.com/humdrum-tools/tree/master/bach-wtc-fugues/master/kern/wtc1f10.krn",
          "score": "https://raw.githubusercontent.com/humdrum-tools/bach-wtc-fugues/master/kern/wtc1f10.krn"
        },
        {
          "analysis": "https://gitlab.com/algomus.fr/algomus-data/-/raw/master/fugues/bach-wtc-i/10-bwv855-ref.dez",
          "contributors": {
            "analyst": "Mathieu Giraud, Richard Groult, Florence Levé"
          },
          "license": "OdBL-1.0",
          "ref": "http://algomus.fr/data/",
          "ref:doi": "10.1162/COMJ_a_00300"
        },
        {
          "contributors": {
            "editor": "The Netherlands Bach Society",
            "performer": "Frédérick Haas"
          },
          "name": "The Netherlands Bach Society",
          "ref": "https://www.bachvereniging.nl/en/about-allofbach",
          "synchro": "https://gitlab.com/algomus.fr/dezrann/dezrann-corpus/-/raw/main/corpus/bach-fugues/synchro/bwv855-AllOfBach.synchro.json",
          "video:yt": "uVAPgZyXPNE"
        },
        {
          "audio": "http://alb.algomus.net:8080/resources/corpus/audio/open-well-tempered-clavier/bwv855.mp3",
          "contributors": {
            "editor": "Open Well-Tempered Clavier",
            "performer": "Kimiko Ishizaka"
          },
          "license": "CC-BY-3.0",
          "name": "Open Well-Tempered Clavier",
          "ref": "https://www.welltemperedclavier.org/",
          "synchro": "https://gitlab.com/algomus.fr/dezrann/dezrann-corpus/-/raw/main/corpus/bach-fugues/synchro/bwv855-Ishizaka-yt.synchro.json",
          "video:yt": "y5JwfJkjjts"
        }
      ]
    },
    "bwv856": {
      "analysis:default": "11-bwv856-ref.dez",
      "opus": {
        "collection": "The Well-Tempered Clavier, Book I",
        "collection:fr": "Le clavier bien tempéré, Livre I",
        "contributors": {
          "composer": "Johann Sebastian Bach",
          "composer:fr": "Jean-Sébastien Bach"
        },
        "genre": "Fuga",
        "git:synchro": "https://gitlab.com/algomus.fr/dezrann/dezrann-corpus/-/raw/main/corpus/bach-fugues/synchro",
        "id": "bwv856",
        "key": "F major",
        "movement:num": "2",
        "opus": "BWV 856",
        "ref:imslp": "Das_wohltemperierte_Klavier_I,_BWV_846-869_(Bach,_Johann_Sebastian)",
        "ref:musicbrainz": "dce85d48-7ce6-4bd6-b21e-a7c1be6eb1b4",
        "ref:wikipedia": "The_Well-Tempered_Clavier",
        "title": "Fuga #11 in F major",
        "title:fr": "Fugue n°11, F major",
        "year": "1722"
      },
      "quality:annotation": "0",
      "quality:audio": "4",
      "quality:audio:synchro": "4",
      "quality:metadata": "3",
      "quality:musical-time": "3",
      "quality:score": "3",
      "sources": [
        {
          "contributors": {
            "editor": "KernScores, WhenInRome",
            "encoder": "David Huron"
          },
          "name": "KernScores",
          "ref": "https://github.com/humdrum-tools/tree/master/bach-wtc-fugues/master/kern/wtc1f11.krn",
          "score": "https://raw.githubusercontent.com/humdrum-tools/bach-wtc-fugues/master/kern/wtc1f11.krn"
        },
        {
          "analysis": "https://gitlab.com/algomus.fr/algomus-data/-/raw/master/fugues/bach-wtc-i/11-bwv856-ref.dez",
          "contributors": {
            "analyst": "Mathieu Giraud, Richard Groult, Florence Levé"
          },
          "license": "OdBL-1.0",
          "ref": "http://algomus.fr/data/",
          "ref:doi": "10.1162/COMJ_a_00300"
        },
        {
          "contributors": {
            "editor": "The Netherlands Bach Society",
            "performer": "Ursula Dütschler"
          },
          "name": "The Netherlands Bach Society",
          "ref": "https://www.bachvereniging.nl/en/about-allofbach",
          "synchro": "https://gitlab.com/algomus.fr/dezrann/dezrann-corpus/-/raw/main/corpus/bach-fugues/synchro/bwv856-AllOfBach.synchro.json",
          "video:yt": "DF8bGzcrWkY"
        },
        {
          "audio": "http://alb.algomus.net:8080/resources/corpus/audio/open-well-tempered-clavier/bwv856.mp3",
          "contributors": {
            "editor": "Open Well-Tempered Clavier",
            "performer": "Kimiko Ishizaka"
          },
          "license": "CC-BY-3.0",
          "name": "Open Well-Tempered Clavier",
          "ref": "https://www.welltemperedclavier.org/",
          "synchro": "https://gitlab.com/algomus.fr/dezrann/dezrann-corpus/-/raw/main/corpus/bach-fugues/synchro/bwv856-Ishizaka-yt.synchro.json",
          "video:yt": "bCtrPSf93Yg"
        }
      ]
    },
    "bwv857": {
      "analysis:default": "12-bwv857-ref.dez",
      "opus": {
        "collection": "The Well-Tempered Clavier, Book I",
        "collection:fr": "Le clavier bien tempéré, Livre I",
        "contributors": {
          "composer": "Johann Sebastian Bach",
          "composer:fr": "Jean-Sébastien Bach"
        },
        "genre": "Fuga",
        "git:synchro": "https://gitlab.com/algomus.fr/dezrann/dezrann-corpus/-/raw/main/corpus/bach-fugues/synchro",
        "id": "bwv857",
        "key": "F minor",
        "movement:num": "2",
        "opus": "BWV 857",
        "ref:imslp": "Das_wohltemperierte_Klavier_I,_BWV_846-869_(Bach,_Johann_Sebastian)",
        "ref:musicbrainz": "dce85d48-7ce6-4bd6-b21e-a7c1be6eb1b4",
        "ref:wikipedia": "The_Well-Tempered_Clavier",
        "title": "Fuga #12 in F minor",
        "title:fr": "Fugue n°12, F minor",
        "year": "1722"
      },
      "quality:annotation": "5",
      "quality:audio": "4",
      "quality:audio:synchro": "4",
      "quality:metadata": "3",
      "quality:musical-time": "3",
      "quality:score": "3",
      "sources": [
        {
          "contributors": {
            "editor": "KernScores, WhenInRome",
            "encoder": "David Huron"
          },
          "name": "KernScores",
          "ref": "https://github.com/humdrum-tools/tree/master/bach-wtc-fugues/master/kern/wtc1f12.krn",
          "score": "https://raw.githubusercontent.com/humdrum-tools/bach-wtc-fugues/master/kern/wtc1f12.krn"
        },
        {
          "analysis": "https://gitlab.com/algomus.fr/algomus-data/-/raw/master/fugues/bach-wtc-i/12-bwv857-ref.dez",
          "contributors": {
            "analyst": "Mathieu Giraud, Richard Groult, Florence Levé"
          },
          "license": "OdBL-1.0",
          "ref": "http://algomus.fr/data/",
          "ref:doi": "10.1162/COMJ_a_00300"
        },
        {
          "contributors": {
            "editor": "The Netherlands Bach Society",
            "performer": "Pieter Dirksen"
          },
          "name": "The Netherlands Bach Society",
          "ref": "https://www.bachvereniging.nl/en/about-allofbach",
          "synchro": "https://gitlab.com/algomus.fr/dezrann/dezrann-corpus/-/raw/main/corpus/bach-fugues/synchro/bwv857-AllOfBach.synchro.json",
          "video:yt": "74suFWTO8P0"
        },
        {
          "audio": "http://alb.algomus.net:8080/resources/corpus/audio/open-well-tempered-clavier/bwv857.mp3",
          "contributors": {
            "editor": "Open Well-Tempered Clavier",
            "performer": "Kimiko Ishizaka"
          },
          "license": "CC-BY-3.0",
          "name": "Open Well-Tempered Clavier",
          "ref": "https://www.welltemperedclavier.org/",
          "synchro": "https://gitlab.com/algomus.fr/dezrann/dezrann-corpus/-/raw/main/corpus/bach-fugues/synchro/bwv857-Ishizaka-yt.synchro.json",
          "video:yt": "4x0HsEGODZo"
        }
      ]
    },
    "bwv858": {
      "analysis:default": "13-bwv858-ref.dez",
      "opus": {
        "collection": "The Well-Tempered Clavier, Book I",
        "collection:fr": "Le clavier bien tempéré, Livre I",
        "contributors": {
          "composer": "Johann Sebastian Bach",
          "composer:fr": "Jean-Sébastien Bach"
        },
        "genre": "Fuga",
        "git:synchro": "https://gitlab.com/algomus.fr/dezrann/dezrann-corpus/-/raw/main/corpus/bach-fugues/synchro",
        "id": "bwv858",
        "key": "F♯ major",
        "movement:num": "2",
        "opus": "BWV 858",
        "ref:imslp": "Das_wohltemperierte_Klavier_I,_BWV_846-869_(Bach,_Johann_Sebastian)",
        "ref:musicbrainz": "dce85d48-7ce6-4bd6-b21e-a7c1be6eb1b4",
        "ref:wikipedia": "The_Well-Tempered_Clavier",
        "title": "Fuga #13 in F♯ major",
        "title:fr": "Fugue n°13, F♯ major",
        "year": "1722"
      },
      "quality:annotation": "5",
      "quality:audio": "4",
      "quality:audio:synchro": "4",
      "quality:metadata": "3",
      "quality:musical-time": "3",
      "quality:score": "3",
      "sources": [
        {
          "contributors": {
            "editor": "KernScores, WhenInRome",
            "encoder": "David Huron"
          },
          "name": "KernScores",
          "ref": "https://github.com/humdrum-tools/tree/master/bach-wtc-fugues/master/kern/wtc1f13.krn",
          "score": "https://raw.githubusercontent.com/humdrum-tools/bach-wtc-fugues/master/kern/wtc1f13.krn"
        },
        {
          "analysis": "https://gitlab.com/algomus.fr/algomus-data/-/raw/master/fugues/bach-wtc-i/13-bwv858-ref.dez",
          "contributors": {
            "analyst": "Mathieu Giraud, Richard Groult, Florence Levé"
          },
          "license": "OdBL-1.0",
          "ref": "http://algomus.fr/data/",
          "ref:doi": "10.1162/COMJ_a_00300"
        },
        {
          "contributors": {
            "editor": "The Netherlands Bach Society",
            "performer": "Menno van Delft"
          },
          "name": "The Netherlands Bach Society",
          "ref": "https://www.bachvereniging.nl/en/about-allofbach",
          "synchro": "https://gitlab.com/algomus.fr/dezrann/dezrann-corpus/-/raw/main/corpus/bach-fugues/synchro/bwv858-AllOfBach.synchro.json",
          "video:yt": "z3KzC_Uu28c"
        },
        {
          "audio": "http://alb.algomus.net:8080/resources/corpus/audio/open-well-tempered-clavier/bwv858.mp3",
          "contributors": {
            "editor": "Open Well-Tempered Clavier",
            "performer": "Kimiko Ishakaza"
          },
          "license": "CC-BY-3.0",
          "name": "Open Well-Tempered Clavier",
          "ref": "https://www.welltemperedclavier.org/",
          "synchro": "https://gitlab.com/algomus.fr/dezrann/dezrann-corpus/-/raw/main/corpus/bach-fugues/synchro/bwv858-Ishizaka.synchro.json"
        }
      ]
    },
    "bwv859": {
      "analysis:default": "14-bwv859-ref.dez",
      "opus": {
        "collection": "The Well-Tempered Clavier, Book I",
        "collection:fr": "Le clavier bien tempéré, Livre I",
        "contributors": {
          "composer": "Johann Sebastian Bach",
          "composer:fr": "Jean-Sébastien Bach"
        },
        "genre": "Fuga",
        "git:synchro": "https://gitlab.com/algomus.fr/dezrann/dezrann-corpus/-/raw/main/corpus/bach-fugues/synchro",
        "id": "bwv859",
        "key": "F♯ minor",
        "movement:num": "2",
        "opus": "BWV 859",
        "ref:imslp": "Das_wohltemperierte_Klavier_I,_BWV_846-869_(Bach,_Johann_Sebastian)",
        "ref:musicbrainz": "dce85d48-7ce6-4bd6-b21e-a7c1be6eb1b4",
        "ref:wikipedia": "The_Well-Tempered_Clavier",
        "title": "Fuga #14 in F♯ minor",
        "title:fr": "Fugue n°14, F♯ minor",
        "year": "1722"
      },
      "quality:annotation": "5",
      "quality:audio": "4",
      "quality:audio:synchro": "4",
      "quality:metadata": "3",
      "quality:musical-time": "3",
      "quality:score": "3",
      "sources": [
        {
          "contributors": {
            "editor": "KernScores, WhenInRome",
            "encoder": "David Huron"
          },
          "name": "KernScores",
          "ref": "https://github.com/humdrum-tools/tree/master/bach-wtc-fugues/master/kern/wtc1f14.krn",
          "score": "https://raw.githubusercontent.com/humdrum-tools/bach-wtc-fugues/master/kern/wtc1f14.krn"
        },
        {
          "analysis": "https://gitlab.com/algomus.fr/algomus-data/-/raw/master/fugues/bach-wtc-i/14-bwv859-ref.dez",
          "contributors": {
            "analyst": "Mathieu Giraud, Richard Groult, Florence Levé"
          },
          "license": "OdBL-1.0",
          "ref": "http://algomus.fr/data/",
          "ref:doi": "10.1162/COMJ_a_00300"
        },
        {
          "contributors": {
            "editor": "The Netherlands Bach Society",
            "performer": "Jacques Ogg"
          },
          "name": "The Netherlands Bach Society",
          "ref": "https://www.bachvereniging.nl/en/about-allofbach",
          "synchro": "https://gitlab.com/algomus.fr/dezrann/dezrann-corpus/-/raw/main/corpus/bach-fugues/synchro/bwv859-AllOfBach.synchro.json",
          "video:yt": "6RQdmnx3gl8"
        },
        {
          "audio": "http://alb.algomus.net:8080/resources/corpus/audio/open-well-tempered-clavier/bwv859.mp3",
          "contributors": {
            "editor": "Open Well-Tempered Clavier",
            "performer": "Kimiko Ishakaza"
          },
          "license": "CC-BY-3.0",
          "name": "Open Well-Tempered Clavier",
          "ref": "https://www.welltemperedclavier.org/",
          "synchro": "https://gitlab.com/algomus.fr/dezrann/dezrann-corpus/-/raw/main/corpus/bach-fugues/synchro/bwv859-Ishizaka.synchro.json"
        }
      ]
    },
    "bwv860": {
      "analysis:default": "15-bwv860-ref.dez",
      "opus": {
        "collection": "The Well-Tempered Clavier, Book I",
        "collection:fr": "Le clavier bien tempéré, Livre I",
        "contributors": {
          "composer": "Johann Sebastian Bach",
          "composer:fr": "Jean-Sébastien Bach"
        },
        "genre": "Fuga",
        "git:synchro": "https://gitlab.com/algomus.fr/dezrann/dezrann-corpus/-/raw/main/corpus/bach-fugues/synchro",
        "id": "bwv860",
        "key": "G major",
        "movement:num": "2",
        "opus": "BWV 860",
        "ref:imslp": "Das_wohltemperierte_Klavier_I,_BWV_846-869_(Bach,_Johann_Sebastian)",
        "ref:musicbrainz": "dce85d48-7ce6-4bd6-b21e-a7c1be6eb1b4",
        "ref:wikipedia": "The_Well-Tempered_Clavier",
        "title": "Fuga #15 in G major",
        "title:fr": "Fugue n°15, G major",
        "year": "1722"
      },
      "quality:annotation": "5",
      "quality:audio": "4",
      "quality:audio:synchro": "0",
      "quality:metadata": "3",
      "quality:musical-time": "3",
      "quality:score": "3",
      "sources": [
        {
          "contributors": {
            "editor": "KernScores, WhenInRome",
            "encoder": "David Huron"
          },
          "name": "KernScores",
          "ref": "https://github.com/humdrum-tools/tree/master/bach-wtc-fugues/master/kern/wtc1f15.krn",
          "score": "https://raw.githubusercontent.com/humdrum-tools/bach-wtc-fugues/master/kern/wtc1f15.krn"
        },
        {
          "analysis": "https://gitlab.com/algomus.fr/algomus-data/-/raw/master/fugues/bach-wtc-i/15-bwv860-ref.dez",
          "contributors": {
            "analyst": "Mathieu Giraud, Richard Groult, Florence Levé",
            "performer": "Ketil Haugsand"
          },
          "license": "OdBL-1.0",
          "ref": "http://algomus.fr/data/",
          "ref:doi": "10.1162/COMJ_a_00300",
          "video:yt": "H3Pmr8wa4vw"
        },
        {
          "contributors": {
            "editor": "The Netherlands Bach Society"
          },
          "name": "The Netherlands Bach Society",
          "ref": "https://www.bachvereniging.nl/en/about-allofbach",
          "synchro": "https://gitlab.com/algomus.fr/dezrann/dezrann-corpus/-/raw/main/corpus/bach-fugues/synchro/bwv860-AllOfBach.synchro.json"
        },
        {
          "audio": "http://alb.algomus.net:8080/resources/corpus/audio/open-well-tempered-clavier/bwv860.mp3",
          "contributors": {
            "editor": "Open Well-Tempered Clavier",
            "performer": "Kimiko Ishakaza"
          },
          "license": "CC-BY-3.0",
          "name": "Open Well-Tempered Clavier",
          "ref": "https://www.welltemperedclavier.org/",
          "synchro": "https://gitlab.com/algomus.fr/dezrann/dezrann-corpus/-/raw/main/corpus/bach-fugues/synchro/bwv860-Ishizaka.synchro.json"
        }
      ]
    },
    "bwv861": {
      "analysis:default": "16-bwv861-ref.dez",
      "opus": {
        "collection": "The Well-Tempered Clavier, Book I",
        "collection:fr": "Le clavier bien tempéré, Livre I",
        "contributors": {
          "composer": "Johann Sebastian Bach",
          "composer:fr": "Jean-Sébastien Bach"
        },
        "genre": "Fuga",
        "git:synchro": "https://gitlab.com/algomus.fr/dezrann/dezrann-corpus/-/raw/main/corpus/bach-fugues/synchro",
        "id": "bwv861",
        "key": "G minor",
        "movement:num": "2",
        "opus": "BWV 861",
        "ref:imslp": "Das_wohltemperierte_Klavier_I,_BWV_846-869_(Bach,_Johann_Sebastian)",
        "ref:musicbrainz": "dce85d48-7ce6-4bd6-b21e-a7c1be6eb1b4",
        "ref:wikipedia": "The_Well-Tempered_Clavier",
        "title": "Fuga #16 in G minor",
        "title:fr": "Fugue n°16, G minor",
        "year": "1722"
      },
      "quality:annotation": "5",
      "quality:audio": "4",
      "quality:audio:synchro": "4",
      "quality:metadata": "3",
      "quality:musical-time": "3",
      "quality:score": "3",
      "sources": [
        {
          "contributors": {
            "editor": "KernScores, WhenInRome",
            "encoder": "David Huron"
          },
          "name": "KernScores",
          "ref": "https://github.com/humdrum-tools/tree/master/bach-wtc-fugues/master/kern/wtc1f16.krn",
          "score": "https://raw.githubusercontent.com/humdrum-tools/bach-wtc-fugues/master/kern/wtc1f16.krn"
        },
        {
          "analysis": "https://gitlab.com/algomus.fr/algomus-data/-/raw/master/fugues/bach-wtc-i/16-bwv861-ref.dez",
          "contributors": {
            "analyst": "Mathieu Giraud, Richard Groult, Florence Levé"
          },
          "license": "OdBL-1.0",
          "ref": "http://algomus.fr/data/",
          "ref:doi": "10.1162/COMJ_a_00300"
        },
        {
          "contributors": {
            "editor": "The Netherlands Bach Society",
            "performer": "Benjamin Alard"
          },
          "name": "The Netherlands Bach Society",
          "ref": "https://www.bachvereniging.nl/en/about-allofbach",
          "synchro": "https://gitlab.com/algomus.fr/dezrann/dezrann-corpus/-/raw/main/corpus/bach-fugues/synchro/bwv861-AllOfBach.synchro.json",
          "video:yt": "NLTNyhpMEEM"
        },
        {
          "audio": "http://alb.algomus.net:8080/resources/corpus/audio/open-well-tempered-clavier/bwv861.mp3",
          "contributors": {
            "editor": "Open Well-Tempered Clavier",
            "performer": "Kimiko Ishizaka"
          },
          "license": "CC-BY-3.0",
          "name": "Open Well-Tempered Clavier",
          "ref": "https://www.welltemperedclavier.org/",
          "synchro": "https://gitlab.com/algomus.fr/dezrann/dezrann-corpus/-/raw/main/corpus/bach-fugues/synchro/bwv861-Ishizaka-yt.synchro.json",
          "video:yt": "dNYEvzpBIRY"
        }
      ]
    },
    "bwv862": {
      "analysis:default": "17-bwv862-ref.dez",
      "opus": {
        "collection": "The Well-Tempered Clavier, Book I",
        "collection:fr": "Le clavier bien tempéré, Livre I",
        "contributors": {
          "composer": "Johann Sebastian Bach",
          "composer:fr": "Jean-Sébastien Bach"
        },
        "genre": "Fuga",
        "git:synchro": "https://gitlab.com/algomus.fr/dezrann/dezrann-corpus/-/raw/main/corpus/bach-fugues/synchro",
        "id": "bwv862",
        "key": "A♭ major",
        "movement:num": "2",
        "opus": "BWV 862",
        "ref:imslp": "Das_wohltemperierte_Klavier_I,_BWV_846-869_(Bach,_Johann_Sebastian)",
        "ref:musicbrainz": "dce85d48-7ce6-4bd6-b21e-a7c1be6eb1b4",
        "ref:wikipedia": "The_Well-Tempered_Clavier",
        "title": "Fuga #17 in A♭ major",
        "title:fr": "Fugue n°17, A♭ major",
        "year": "1722"
      },
      "quality:annotation": "5",
      "quality:audio": "4",
      "quality:audio:synchro": "0",
      "quality:metadata": "3",
      "quality:musical-time": "3",
      "quality:score": "3",
      "sources": [
        {
          "contributors": {
            "editor": "KernScores, WhenInRome",
            "encoder": "David Huron"
          },
          "name": "KernScores",
          "ref": "https://github.com/humdrum-tools/tree/master/bach-wtc-fugues/master/kern/wtc1f17.krn",
          "score": "https://raw.githubusercontent.com/humdrum-tools/bach-wtc-fugues/master/kern/wtc1f17.krn"
        },
        {
          "analysis": "https://gitlab.com/algomus.fr/algomus-data/-/raw/master/fugues/bach-wtc-i/17-bwv862-ref.dez",
          "contributors": {
            "analyst": "Mathieu Giraud, Richard Groult, Florence Levé"
          },
          "license": "OdBL-1.0",
          "ref": "http://algomus.fr/data/",
          "ref:doi": "10.1162/COMJ_a_00300"
        },
        {
          "contributors": {
            "editor": "The Netherlands Bach Society",
            "performer": "Olivier Fortin"
          },
          "name": "The Netherlands Bach Society",
          "ref": "https://www.bachvereniging.nl/en/about-allofbach",
          "synchro": "https://gitlab.com/algomus.fr/dezrann/dezrann-corpus/-/raw/main/corpus/bach-fugues/synchro/bwv862-AllOfBach.synchro.json",
          "video:yt": "4pXSan5YMnM"
        },
        {
          "audio": "http://alb.algomus.net:8080/resources/corpus/audio/open-well-tempered-clavier/bwv862.mp3",
          "contributors": {
            "editor": "Open Well-Tempered Clavier",
            "performer": "Kimiko Ishakaza"
          },
          "license": "CC-BY-3.0",
          "name": "Open Well-Tempered Clavier",
          "ref": "https://www.welltemperedclavier.org/",
          "synchro": "https://gitlab.com/algomus.fr/dezrann/dezrann-corpus/-/raw/main/corpus/bach-fugues/synchro/bwv862-Ishizaka.synchro.json"
        }
      ]
    },
    "bwv863": {
      "analysis:default": "18-bwv863-ref.dez",
      "opus": {
        "collection": "The Well-Tempered Clavier, Book I",
        "collection:fr": "Le clavier bien tempéré, Livre I",
        "contributors": {
          "composer": "Johann Sebastian Bach",
          "composer:fr": "Jean-Sébastien Bach"
        },
        "genre": "Fuga",
        "git:synchro": "https://gitlab.com/algomus.fr/dezrann/dezrann-corpus/-/raw/main/corpus/bach-fugues/synchro",
        "id": "bwv863",
        "key": "G♯ minor",
        "movement:num": "2",
        "opus": "BWV 863",
        "ref:imslp": "Das_wohltemperierte_Klavier_I,_BWV_846-869_(Bach,_Johann_Sebastian)",
        "ref:musicbrainz": "dce85d48-7ce6-4bd6-b21e-a7c1be6eb1b4",
        "ref:wikipedia": "The_Well-Tempered_Clavier",
        "title": "Fuga #18 in G♯ minor",
        "title:fr": "Fugue n°18, G♯ minor",
        "year": "1722"
      },
      "quality:annotation": "5",
      "quality:audio": "4",
      "quality:audio:synchro": "0",
      "quality:metadata": "3",
      "quality:musical-time": "3",
      "quality:score": "3",
      "sources": [
        {
          "contributors": {
            "editor": "KernScores, WhenInRome",
            "encoder": "David Huron"
          },
          "name": "KernScores",
          "ref": "https://github.com/humdrum-tools/tree/master/bach-wtc-fugues/master/kern/wtc1f18.krn",
          "score": "https://raw.githubusercontent.com/humdrum-tools/bach-wtc-fugues/master/kern/wtc1f18.krn"
        },
        {
          "analysis": "https://gitlab.com/algomus.fr/algomus-data/-/raw/master/fugues/bach-wtc-i/18-bwv863-ref.dez",
          "contributors": {
            "analyst": "Mathieu Giraud, Richard Groult, Florence Levé"
          },
          "license": "OdBL-1.0",
          "ref": "http://algomus.fr/data/",
          "ref:doi": "10.1162/COMJ_a_00300"
        },
        {
          "contributors": {
            "editor": "The Netherlands Bach Society",
            "performer": "Korneel Bernolet"
          },
          "name": "The Netherlands Bach Society",
          "ref": "https://www.bachvereniging.nl/en/about-allofbach",
          "synchro": "https://gitlab.com/algomus.fr/dezrann/dezrann-corpus/-/raw/main/corpus/bach-fugues/synchro/bwv863-AllOfBach.synchro.json",
          "video:yt": "T24-ZRHXpbQ"
        },
        {
          "audio": "http://alb.algomus.net:8080/resources/corpus/audio/open-well-tempered-clavier/bwv863.mp3",
          "contributors": {
            "editor": "Open Well-Tempered Clavier",
            "performer": "Kimiko Ishakaza"
          },
          "license": "CC-BY-3.0",
          "name": "Open Well-Tempered Clavier",
          "ref": "https://www.welltemperedclavier.org/",
          "synchro": "https://gitlab.com/algomus.fr/dezrann/dezrann-corpus/-/raw/main/corpus/bach-fugues/synchro/bwv863-Ishizaka.synchro.json"
        }
      ]
    },
    "bwv864": {
      "analysis:default": "19-bwv864-ref.dez",
      "opus": {
        "collection": "The Well-Tempered Clavier, Book I",
        "collection:fr": "Le clavier bien tempéré, Livre I",
        "contributors": {
          "composer": "Johann Sebastian Bach",
          "composer:fr": "Jean-Sébastien Bach"
        },
        "genre": "Fuga",
        "git:synchro": "https://gitlab.com/algomus.fr/dezrann/dezrann-corpus/-/raw/main/corpus/bach-fugues/synchro",
        "id": "bwv864",
        "key": "A major",
        "movement:num": "2",
        "opus": "BWV 864",
        "ref:imslp": "Das_wohltemperierte_Klavier_I,_BWV_846-869_(Bach,_Johann_Sebastian)",
        "ref:musicbrainz": "dce85d48-7ce6-4bd6-b21e-a7c1be6eb1b4",
        "ref:wikipedia": "The_Well-Tempered_Clavier",
        "title": "Fuga #19 in A major",
        "title:fr": "Fugue n°19, A major",
        "year": "1722"
      },
      "quality:annotation": "5",
      "quality:audio": "4",
      "quality:audio:synchro": "0",
      "quality:metadata": "3",
      "quality:musical-time": "3",
      "quality:score": "3",
      "sources": [
        {
          "contributors": {
            "editor": "KernScores, WhenInRome",
            "encoder": "David Huron"
          },
          "name": "KernScores",
          "ref": "https://github.com/humdrum-tools/tree/master/bach-wtc-fugues/master/kern/wtc1f19.krn",
          "score": "https://raw.githubusercontent.com/humdrum-tools/bach-wtc-fugues/master/kern/wtc1f19.krn"
        },
        {
          "analysis": "https://gitlab.com/algomus.fr/algomus-data/-/raw/master/fugues/bach-wtc-i/19-bwv864-ref.dez",
          "contributors": {
            "analyst": "Mathieu Giraud, Richard Groult, Florence Levé"
          },
          "license": "OdBL-1.0",
          "ref": "http://algomus.fr/data/",
          "ref:doi": "10.1162/COMJ_a_00300"
        },
        {
          "contributors": {
            "editor": "The Netherlands Bach Society",
            "performer": "Pierre Hantaï"
          },
          "name": "The Netherlands Bach Society",
          "ref": "https://www.bachvereniging.nl/en/about-allofbach",
          "synchro": "https://gitlab.com/algomus.fr/dezrann/dezrann-corpus/-/raw/main/corpus/bach-fugues/synchro/bwv864-AllOfBach.synchro.json",
          "video:yt": "JnFPOm0kwdI"
        },
        {
          "audio": "http://alb.algomus.net:8080/resources/corpus/audio/open-well-tempered-clavier/bwv864.mp3",
          "contributors": {
            "editor": "Open Well-Tempered Clavier",
            "performer": "Kimiko Ishakaza"
          },
          "license": "CC-BY-3.0",
          "name": "Open Well-Tempered Clavier",
          "ref": "https://www.welltemperedclavier.org/",
          "synchro": "https://gitlab.com/algomus.fr/dezrann/dezrann-corpus/-/raw/main/corpus/bach-fugues/synchro/bwv864-Ishizaka.synchro.json"
        }
      ]
    },
    "bwv865": {
      "analysis:default": "20-bwv865-ref.dez",
      "opus": {
        "collection": "The Well-Tempered Clavier, Book I",
        "collection:fr": "Le clavier bien tempéré, Livre I",
        "contributors": {
          "composer": "Johann Sebastian Bach",
          "composer:fr": "Jean-Sébastien Bach"
        },
        "genre": "Fuga",
        "git:synchro": "https://gitlab.com/algomus.fr/dezrann/dezrann-corpus/-/raw/main/corpus/bach-fugues/synchro",
        "id": "bwv865",
        "key": "A minor",
        "movement:num": "2",
        "opus": "BWV 865",
        "ref:imslp": "Das_wohltemperierte_Klavier_I,_BWV_846-869_(Bach,_Johann_Sebastian)",
        "ref:musicbrainz": "dce85d48-7ce6-4bd6-b21e-a7c1be6eb1b4",
        "ref:wikipedia": "The_Well-Tempered_Clavier",
        "title": "Fuga #20 in A minor",
        "title:fr": "Fugue n°20, A minor",
        "year": "1722"
      },
      "quality:annotation": "5",
      "quality:audio": "4",
      "quality:audio:synchro": "0",
      "quality:metadata": "3",
      "quality:musical-time": "3",
      "quality:score": "0",
      "sources": [
        {
          "contributors": {
            "editor": "KernScores, WhenInRome",
            "encoder": "David Huron"
          },
          "name": "KernScores",
          "ref": "https://github.com/humdrum-tools/tree/master/bach-wtc-fugues/master/kern/wtc1f20.krn",
          "score": "https://raw.githubusercontent.com/humdrum-tools/bach-wtc-fugues/master/kern/wtc1f20.krn"
        },
        {
          "analysis": "https://gitlab.com/algomus.fr/algomus-data/-/raw/master/fugues/bach-wtc-i/20-bwv865-ref.dez",
          "contributors": {
            "analyst": "Mathieu Giraud, Richard Groult, Florence Levé"
          },
          "license": "OdBL-1.0",
          "ref": "http://algomus.fr/data/",
          "ref:doi": "10.1162/COMJ_a_00300"
        },
        {
          "contributors": {
            "editor": "The Netherlands Bach Society",
            "performer": "Olga Pashchenko"
          },
          "name": "The Netherlands Bach Society",
          "ref": "https://www.bachvereniging.nl/en/about-allofbach",
          "synchro": "https://gitlab.com/algomus.fr/dezrann/dezrann-corpus/-/raw/main/corpus/bach-fugues/synchro/bwv865-AllOfBach.synchro.json",
          "video:yt": "hViR1LQh1MM"
        },
        {
          "audio": "http://alb.algomus.net:8080/resources/corpus/audio/open-well-tempered-clavier/bwv865.mp3",
          "contributors": {
            "editor": "Open Well-Tempered Clavier",
            "performer": "Kimiko Ishakaza"
          },
          "license": "CC-BY-3.0",
          "name": "Open Well-Tempered Clavier",
          "ref": "https://www.welltemperedclavier.org/",
          "synchro": "https://gitlab.com/algomus.fr/dezrann/dezrann-corpus/-/raw/main/corpus/bach-fugues/synchro/bwv865-Ishizaka.synchro.json"
        }
      ]
    },
    "bwv866": {
      "analysis:default": "21-bwv866-ref.dez",
      "opus": {
        "collection": "The Well-Tempered Clavier, Book I",
        "collection:fr": "Le clavier bien tempéré, Livre I",
        "contributors": {
          "composer": "Johann Sebastian Bach",
          "composer:fr": "Jean-Sébastien Bach"
        },
        "genre": "Fuga",
        "git:synchro": "https://gitlab.com/algomus.fr/dezrann/dezrann-corpus/-/raw/main/corpus/bach-fugues/synchro",
        "id": "bwv866",
        "key": "B♭ major",
        "movement:num": "2",
        "opus": "BWV 866",
        "ref:imslp": "Das_wohltemperierte_Klavier_I,_BWV_846-869_(Bach,_Johann_Sebastian)",
        "ref:musicbrainz": "dce85d48-7ce6-4bd6-b21e-a7c1be6eb1b4",
        "ref:wikipedia": "The_Well-Tempered_Clavier",
        "title": "Fuga #21 in B♭ major",
        "title:fr": "Fugue n°21, B♭ major",
        "year": "1722"
      },
      "quality:annotation": "5",
      "quality:audio": "4",
      "quality:audio:synchro": "4",
      "quality:metadata": "3",
      "quality:musical-time": "3",
      "quality:score": "3",
      "sources": [
        {
          "contributors": {
            "editor": "KernScores, WhenInRome",
            "encoder": "David Huron"
          },
          "name": "KernScores",
          "ref": "https://github.com/humdrum-tools/tree/master/bach-wtc-fugues/master/kern/wtc1f21.krn",
          "score": "https://raw.githubusercontent.com/humdrum-tools/bach-wtc-fugues/master/kern/wtc1f21.krn"
        },
        {
          "analysis": "https://gitlab.com/algomus.fr/algomus-data/-/raw/master/fugues/bach-wtc-i/21-bwv866-ref.dez",
          "contributors": {
            "analyst": "Mathieu Giraud, Richard Groult, Florence Levé"
          },
          "license": "OdBL-1.0",
          "ref": "http://algomus.fr/data/",
          "ref:doi": "10.1162/COMJ_a_00300"
        },
        {
          "contributors": {
            "editor": "The Netherlands Bach Society",
            "performer": "Bart Naessens"
          },
          "name": "The Netherlands Bach Society",
          "ref": "https://www.bachvereniging.nl/en/about-allofbach",
          "synchro": "https://gitlab.com/algomus.fr/dezrann/dezrann-corpus/-/raw/main/corpus/bach-fugues/synchro/bwv866-AllOfBach.synchro.json",
          "video:yt": "NCD5vHrTLqA"
        },
        {
          "audio": "http://alb.algomus.net:8080/resources/corpus/audio/open-well-tempered-clavier/bwv866.mp3",
          "contributors": {
            "editor": "Open Well-Tempered Clavier",
            "performer": "Kimiko Ishakaza"
          },
          "license": "CC-BY-3.0",
          "name": "Open Well-Tempered Clavier",
          "ref": "https://www.welltemperedclavier.org/",
          "synchro": "https://gitlab.com/algomus.fr/dezrann/dezrann-corpus/-/raw/main/corpus/bach-fugues/synchro/bwv866-Ishizaka.synchro.json"
        }
      ]
    },
    "bwv867": {
      "analysis:default": "22-bwv867-ref.dez",
      "opus": {
        "collection": "The Well-Tempered Clavier, Book I",
        "collection:fr": "Le clavier bien tempéré, Livre I",
        "contributors": {
          "composer": "Johann Sebastian Bach",
          "composer:fr": "Jean-Sébastien Bach"
        },
        "genre": "Fuga",
        "git:synchro": "https://gitlab.com/algomus.fr/dezrann/dezrann-corpus/-/raw/main/corpus/bach-fugues/synchro",
        "id": "bwv867",
        "key": "B♭ minor",
        "movement:num": "2",
        "opus": "BWV 867",
        "ref:imslp": "Das_wohltemperierte_Klavier_I,_BWV_846-869_(Bach,_Johann_Sebastian)",
        "ref:musicbrainz": "dce85d48-7ce6-4bd6-b21e-a7c1be6eb1b4",
        "ref:wikipedia": "The_Well-Tempered_Clavier",
        "title": "Fuga #22 in B♭ minor",
        "title:fr": "Fugue n°22, B♭ minor",
        "year": "1722"
      },
      "quality:annotation": "5",
      "quality:audio": "4",
      "quality:audio:synchro": "4",
      "quality:metadata": "3",
      "quality:musical-time": "3",
      "quality:score": "3",
      "sources": [
        {
          "contributors": {
            "editor": "KernScores, WhenInRome",
            "encoder": "David Huron"
          },
          "name": "KernScores",
          "ref": "https://github.com/humdrum-tools/tree/master/bach-wtc-fugues/master/kern/wtc1f22.krn",
          "score": "https://raw.githubusercontent.com/humdrum-tools/bach-wtc-fugues/master/kern/wtc1f22.krn"
        },
        {
          "analysis": "https://gitlab.com/algomus.fr/algomus-data/-/raw/master/fugues/bach-wtc-i/22-bwv867-ref.dez",
          "contributors": {
            "analyst": "Mathieu Giraud, Richard Groult, Florence Levé"
          },
          "license": "OdBL-1.0",
          "ref": "http://algomus.fr/data/",
          "ref:doi": "10.1162/COMJ_a_00300"
        },
        {
          "contributors": {
            "editor": "The Netherlands Bach Society",
            "performer": "Kris Verhelst"
          },
          "name": "The Netherlands Bach Society",
          "ref": "https://www.bachvereniging.nl/en/about-allofbach",
          "synchro": "https://gitlab.com/algomus.fr/dezrann/dezrann-corpus/-/raw/main/corpus/bach-fugues/synchro/bwv867-AllOfBach.synchro.json",
          "video:yt": "rbcYLQZouiM"
        },
        {
          "audio": "http://alb.algomus.net:8080/resources/corpus/audio/open-well-tempered-clavier/bwv867.mp3",
          "contributors": {
            "editor": "Open Well-Tempered Clavier",
            "performer": "Kimiko Ishakaza"
          },
          "license": "CC-BY-3.0",
          "name": "Open Well-Tempered Clavier",
          "ref": "https://www.welltemperedclavier.org/",
          "synchro": "https://gitlab.com/algomus.fr/dezrann/dezrann-corpus/-/raw/main/corpus/bach-fugues/synchro/bwv867-Ishizaka.synchro.json"
        }
      ]
    },
    "bwv868": {
      "analysis:default": "23-bwv868-ref.dez",
      "opus": {
        "collection": "The Well-Tempered Clavier, Book I",
        "collection:fr": "Le clavier bien tempéré, Livre I",
        "contributors": {
          "composer": "Johann Sebastian Bach",
          "composer:fr": "Jean-Sébastien Bach"
        },
        "genre": "Fuga",
        "git:synchro": "https://gitlab.com/algomus.fr/dezrann/dezrann-corpus/-/raw/main/corpus/bach-fugues/synchro",
        "id": "bwv868",
        "key": "B major",
        "movement:num": "2",
        "opus": "BWV 868",
        "ref:imslp": "Das_wohltemperierte_Klavier_I,_BWV_846-869_(Bach,_Johann_Sebastian)",
        "ref:musicbrainz": "dce85d48-7ce6-4bd6-b21e-a7c1be6eb1b4",
        "ref:wikipedia": "The_Well-Tempered_Clavier",
        "title": "Fuga #23 in B major",
        "title:fr": "Fugue n°23, B major",
        "year": "1722"
      },
      "quality:annotation": "5",
      "quality:audio": "4",
      "quality:audio:synchro": "4",
      "quality:metadata": "3",
      "quality:musical-time": "3",
      "quality:score": "3",
      "sources": [
        {
          "contributors": {
            "editor": "KernScores, WhenInRome",
            "encoder": "David Huron"
          },
          "name": "KernScores",
          "ref": "https://github.com/humdrum-tools/tree/master/bach-wtc-fugues/master/kern/wtc1f23.krn",
          "score": "https://raw.githubusercontent.com/humdrum-tools/bach-wtc-fugues/master/kern/wtc1f23.krn"
        },
        {
          "analysis": "https://gitlab.com/algomus.fr/algomus-data/-/raw/master/fugues/bach-wtc-i/23-bwv868-ref.dez",
          "contributors": {
            "analyst": "Mathieu Giraud, Richard Groult, Florence Levé"
          },
          "license": "OdBL-1.0",
          "ref": "http://algomus.fr/data/",
          "ref:doi": "10.1162/COMJ_a_00300"
        },
        {
          "contributors": {
            "editor": "The Netherlands Bach Society",
            "performer": "Diego Ares"
          },
          "name": "The Netherlands Bach Society",
          "ref": "https://www.bachvereniging.nl/en/about-allofbach",
          "synchro": "https://gitlab.com/algomus.fr/dezrann/dezrann-corpus/-/raw/main/corpus/bach-fugues/synchro/bwv868-AllOfBach.synchro.json",
          "video:yt": "2I3hdaTQvcA"
        },
        {
          "audio": "http://alb.algomus.net:8080/resources/corpus/audio/open-well-tempered-clavier/bwv868.mp3",
          "contributors": {
            "editor": "Open Well-Tempered Clavier",
            "performer": "Kimiko Ishakaza"
          },
          "license": "CC-BY-3.0",
          "name": "Open Well-Tempered Clavier",
          "ref": "https://www.welltemperedclavier.org/",
          "synchro": "https://gitlab.com/algomus.fr/dezrann/dezrann-corpus/-/raw/main/corpus/bach-fugues/synchro/bwv868-Ishizaka.synchro.json"
        }
      ]
    },
    "bwv869": {
      "analysis:default": "24-bwv869-ref.dez",
      "opus": {
        "collection": "The Well-Tempered Clavier, Book I",
        "collection:fr": "Le clavier bien tempéré, Livre I",
        "contributors": {
          "composer": "Johann Sebastian Bach",
          "composer:fr": "Jean-Sébastien Bach"
        },
        "genre": "Fuga",
        "git:synchro": "https://gitlab.com/algomus.fr/dezrann/dezrann-corpus/-/raw/main/corpus/bach-fugues/synchro",
        "id": "bwv869",
        "key": "B minor",
        "movement:num": "2",
        "opus": "BWV 869",
        "ref:imslp": "Das_wohltemperierte_Klavier_I,_BWV_846-869_(Bach,_Johann_Sebastian)",
        "ref:musicbrainz": "dce85d48-7ce6-4bd6-b21e-a7c1be6eb1b4",
        "ref:wikipedia": "The_Well-Tempered_Clavier",
        "title": "Fuga #24 in B minor",
        "title:fr": "Fugue n°24, B minor",
        "year": "1722"
      },
      "quality:annotation": "5",
      "quality:audio": "4",
      "quality:audio:synchro": "2",
      "quality:metadata": "3",
      "quality:musical-time": "3",
      "quality:score": "3",
      "sources": [
        {
          "contributors": {
            "editor": "KernScores, WhenInRome",
            "encoder": "David Huron"
          },
          "name": "KernScores",
          "ref": "https://github.com/humdrum-tools/tree/master/bach-wtc-fugues/master/kern/wtc1f24.krn",
          "score": "https://raw.githubusercontent.com/humdrum-tools/bach-wtc-fugues/master/kern/wtc1f24.krn"
        },
        {
          "analysis": "https://gitlab.com/algomus.fr/algomus-data/-/raw/master/fugues/bach-wtc-i/24-bwv869-ref.dez",
          "contributors": {
            "analyst": "Mathieu Giraud, Richard Groult, Florence Levé"
          },
          "license": "OdBL-1.0",
          "ref": "http://algomus.fr/data/",
          "ref:doi": "10.1162/COMJ_a_00300"
        },
        {
          "contributors": {
            "editor": "The Netherlands Bach Society",
            "performer": "Bob van Asperen"
          },
          "name": "The Netherlands Bach Society",
          "ref": "https://www.bachvereniging.nl/en/about-allofbach",
          "synchro": "https://gitlab.com/algomus.fr/dezrann/dezrann-corpus/-/raw/main/corpus/bach-fugues/synchro/bwv869-AllOfBach.synchro.json",
          "video:yt": "UGieOVATEOM"
        },
        {
          "audio": "http://alb.algomus.net:8080/resources/corpus/audio/open-well-tempered-clavier/bwv869.mp3",
          "contributors": {
            "editor": "Open Well-Tempered Clavier",
            "performer": "Kimiko Ishakaza"
          },
          "license": "CC-BY-3.0",
          "name": "Open Well-Tempered Clavier",
          "ref": "https://www.welltemperedclavier.org/",
          "synchro": "https://gitlab.com/algomus.fr/dezrann/dezrann-corpus/-/raw/main/corpus/bach-fugues/synchro/bwv869-Ishizaka.synchro.json"
        }
      ]
    }
  },
  "settings": {
    "access": "public"
  },
  "template": {
    "opus": {
      "..analysis:default": "{num:02d}-bwv{bwv}-ref.dez",
      "..quality:annotation": "5",
      "..quality:audio": "4",
      "..quality:metadata": "3",
      "..quality:musical-time": "3",
      "..quality:score": "3",
      "..sources.0.contributors.editor": "KernScores, WhenInRome",
      "..sources.0.contributors.encoder": "David Huron",
      "..sources.0.name": "KernScores",
      "..sources.0.ref": "https://github.com/humdrum-tools/tree/master/bach-wtc-fugues/master/kern/wtc1f{num:02d}.krn",
      "..sources.0.score": "https://raw.githubusercontent.com/humdrum-tools/bach-wtc-fugues/master/kern/wtc1f{num:02d}.krn",
      "..sources.1.analysis": "https://gitlab.com/algomus.fr/algomus-data/-/raw/master/fugues/bach-wtc-i/{num:02}-bwv{bwv}-ref.dez",
      "..sources.1.contributors.analyst": "Mathieu Giraud, Richard Groult, Florence Levé",
      "..sources.1.license": "OdBL-1.0",
      "..sources.1.ref": "http://algomus.fr/data/",
      "..sources.1.ref:doi": "10.1162/COMJ_a_00300",
      "..sources.2.contributors.editor": "The Netherlands Bach Society",
      "..sources.2.name": "The Netherlands Bach Society",
      "..sources.2.ref": "https://www.bachvereniging.nl/en/about-allofbach",
      "..sources.2.synchro": "{git_synchro}/bwv{bwv}-AllOfBach.synchro.json",
      "..sources.3.audio": "http://alb.algomus.net:8080/resources/corpus/audio/open-well-tempered-clavier/bwv{bwv}.mp3",
      "..sources.3.contributors.editor": "Open Well-Tempered Clavier",
      "..sources.3.contributors.performer": "Kimiko Ishakaza",
      "..sources.3.license": "CC-BY-3.0",
      "..sources.3.name": "Open Well-Tempered Clavier",
      "..sources.3.ref": "https://www.welltemperedclavier.org/",
      "..sources.3.synchro": "{git_synchro}/bwv{bwv}-Ishizaka.synchro.json",
      "collection": "The Well-Tempered Clavier, Book I",
      "collection:fr": "Le clavier bien tempéré, Livre I",
      "contributors.composer": "Johann Sebastian Bach",
      "contributors.composer:fr": "Jean-Sébastien Bach",
      "genre": "Fuga",
      "git:synchro": "https://gitlab.com/algomus.fr/dezrann/dezrann-corpus/-/raw/main/corpus/bach-fugues/synchro",
      "id": "bwv{bwv}",
      "key": {
        "1": "C major",
        "10": "E minor",
        "11": "F major",
        "12": "F minor",
        "13": "F♯ major",
        "14": "F♯ minor",
        "15": "G major",
        "16": "G minor",
        "17": "A♭ major",
        "18": "G♯ minor",
        "19": "A major",
        "2": "C minor",
        "20": "A minor",
        "21": "B♭ major",
        "22": "B♭ minor",
        "23": "B major",
        "24": "B minor",
        "3": "C♯ major",
        "4": "C♯ minor",
        "5": "D major",
        "6": "D minor",
        "7": "E♭ major",
        "8": "D♯ minor",
        "9": "E major"
      },
      "movement:num": "2",
      "opus": "BWV {bwv}",
      "ref:imslp": "Das_wohltemperierte_Klavier_I,_BWV_846-869_(Bach,_Johann_Sebastian)",
      "ref:musicbrainz": "dce85d48-7ce6-4bd6-b21e-a7c1be6eb1b4",
      "ref:wikipedia": "The_Well-Tempered_Clavier",
      "title": "Fuga #{num} in {key}",
      "title:fr": "Fugue n°{num}, {key}",
      "year": "1722"
    }
  }
}