{
  "corpus": {
    "id": "mozart-piano-sonatas",
    "motto": "The 18 Mozart piano sonatas with some form, harmony, and texture annotations",
    "motto:de": "Die 18 Klaviersonaten von Mozart mit einigen Form-, Harmonie- und Texturannotationen",
    "motto:el": "Οι 18 πιανιστικές σονάτες του Mozart με κάποιες σημειώσεις σχετικά με τη μορφή, την αρμονία και την υφή",
    "motto:fr": "Les 18 sonates pour piano de Mozart, avec quelques annotations de forme, d'harmonie et de texture",
    "motto:hr": "18 klavirskih sonata W. A. Mozarta s anotacijama glazbenih oblika, harmonija i tekstura",
    "motto:it": "Le 18 sonate per pianoforte di Mozart con alcune annotazioni su forma, armonia e texture",
    "motto:sl": "18 Mozartovih klavirskih sonat z oblikovno, harmonsko in teksturno analizo.",

    "title:de": "Mozart Klaviersonaten",
    "title:el": "Πιανιστικές σονάτες του Mozart",
    "title:en": "Mozart Piano Sonatas",
    "title:fr": "Sonates pour piano de Mozart",
    "title:hr": "Klavirske sonate W. A. Mozarta",
    "title:it": "Sonate per pianoforte di Mozart",
    "title:sl": "Mozartove klavirske sonate",

    "contributors": {
      "composer": "Wolfgang Amadeus Mozart",
      "editor": "Neue Mozart Ausgabe",
      "encoder": "Lucas Mossman, Craig Stuart Sapp, Tobias Schölkopf, Tom Schreyer, tunescribers",
      "maintainer": "Louis Couturier <louis.couturier@algomus.fr>, Mathieu Giraud <mathieu@algomus.fr>"
    },
    "ref": "https://www.algomus.fr/data",
    "ref:doi": "10.57745/OHRWPC",
    "ref:pub": "[(Hentschel et al., 2021)](https://dx.doi.org/10.5334/tismir.63), [(Couturier et al., 2022)](https://dx.doi.org/10.5281/zenodo.7316712)",
    "year": "1774–1789",

    "text": "Wolfgang Amadeus Mozart (1756–1791) was a composer of 18th century Classical style period, recognized as one of the three principal figures of the *First Viennese School*, alongside Joseph Haydn and Ludwig van Beethoven. He expressed his versatile music ideas in a large palette of genres. His *piano sonatas*, published over a 15-year period, were composed for various purposes, including educational material and private commissions from aristocrats. The classical sonata (typically for a solo keyboard instrument) is composed of usually three movements, of which the first generally follows [sonata form](https://en.wikipedia.org/wiki/Sonata_form). Mozart's sonatas are well known to have a remarkable structural and textural composition.",
    "text:de": "Wolfgang Amadeus Mozart (1756–1791) war ein Komponist der klassischen Stilepoche des 18. Jahrhunderts und gilt als eine der drei Hauptfiguren der *Ersten Wiener Schule* neben Joseph Haydn und Ludwig van Beethoven. Er drückte seine vielseitigen musikalischen Ideen in einer breiten Palette von Genres aus. Seine *Klaviersonaten*, über einen Zeitraum von 15 Jahren veröffentlicht, wurden für verschiedene Zwecke komponiert, einschließlich Lehrmaterial und privater Aufträge von Aristokraten. Die klassische Sonate (typischerweise für ein Solo-Tasteninstrument) besteht in der Regel aus drei Sätzen, von denen der erste typischerweise der [Sonatenform](https://de.wikipedia.org/wiki/Sonatensatzform) folgt. Mozarts Sonaten sind bekannt für ihre bemerkenswerten Texturen und Formpläne.",
    "text:el": "Ο Wolfgang Amadeus Mozart (1756–1791) ήταν συνθέτης της κλασικής περιόδου του 18ου αιώνα, που αναγνωρίζεται ως ένας από τους τρεις κύριους εκπροσώπους της *Πρώτης Βιέννης Σχολής*, στην οποία περιλαμβάνονται επίσης οι Joseph Haydn και Ludwig van Beethoven. Εξέφραζε τις ποικίλες μουσικές του ιδέες σε ένα μεγάλο φάσμα ειδών. Οι *πιανιστικές σονάτες* του, δημοσιευμένες σε ένα διάστημα 15 ετών, συνετέλεσαν για διάφορους σκοπούς, συμπεριλαμβανομένου του εκπαιδευτικού υλικού και των ιδιωτικών πΤοαραγγελιών από αριστοκράτες. Η κλασική σονάτα (συνήθως για ένα μόνο πληκτροφόρο όργανο) αποτελείται συνήθως από τρία κινήματα, από τα οποία το πρώτο ακολουθεί γενικά τη [φόρμα της σονάτας](https://en.wikipedia.org/wiki/Sonata_form). Οι σονάτες του Mozart είναι γνωστές για την αξιοσημείωτη δομική και υφιστάμενη σύνθεσή τους.",
    "text:fr": "Wolfgang Amadeus Mozart (1756–1791), compositeur de l'époque classique du XVIIIe siècle, est connu comme l'un des trois membres de la Première École de Vienne, aux côtés de Ludwig van Beethoven et Joseph Haydn. Il a exprimé ses idées musicales dans un large éventail de genres, notamment l'opéra, les symphonies, les concertos, et... les sonates pour piano. Celles-ci ont été composées sur une période de 15 ans pour diverses occasions (pédagogie, commandes privées...). La *sonate* classique est souvent composée de trois mouvements, dont le premier est généralement en [forme sonate](https://fr.wikipedia.org/wiki/Forme_sonate). Les sonates de Mozart sont bien connues pour leur structures et leur textures remarquables.",
    "text:hr": "Uz Josepha Haydna i Ludwiga van Beethovna je Wolfgang Amadeus Mozart (1756–1791) glavni predstavnik *Prve bečke škole* povezane s razdobljem klasicizma u zapadnoeuropskoj umjetničkoj glazbi. *Klavirske sonate* nastajale su sporadično i u različite svrhe (pedagoške ili po narudžbi). [Sonatni ciklus]( https://en.wikipedia.org/wiki/Sonata#Classical_period) višestavačna je skladba, a barem jedan stavak je u [sonatnom obliku](https://en.wikipedia.org/wiki/Sonata_form). Mozartove klavirske sonate obično sadrže tri stavka, prvi je najčešće sonatni.",
    "text:it": "Wolfgang Amadeus Mozart (1756-1791) fu un compositore del periodo classico del XVIII secolo, riconosciuto come una delle tre figure principali della *Prima scuola viennese*, insieme a Joseph Haydn e Ludwig van Beethoven. Espresse le sue versatili idee musicali in un'ampia gamma di generi. Le *sonate per pianoforte*, pubblicate nel corso di un periodo di 15 anni, furono composte per diverse occasioni. Alcune di esse hanno scopi didattici, altre sono state commissionante privatamente da membri dell'aristocrazia. La sonata classica (tipicamente per un solo strumento a tastiera solista) è composta solitamente da tre movimenti, di cui il primo segue generalmente la [forma sonata](https://it.wikipedia.org/wiki/Forma-sonata). Le sonate di Mozart sono note per la loro notevole composizione strutturale e testurale.",
    "text:sl": "Wolfgang Amadeus Mozart (1756–1791) je bil klasicistični skladatelj 18. stoletja, pripoznan, poleg Josepha Haydna in Ludwiga van Beethovna, kot eden od treh glavnih predstavnikov *Prve dunajske šole*. *Klavirske sonate*, objavljene v obdobju 15 let, so nastale iz različnih namenov, med drugim kot izobraževalni material in za zasebna naročila plemičev. Klasicistična sonata (običajno za solo klavirski instrument) je običajno sestavljena iz treh stavkov, od katerih je prvi v [sonatni obliki](https://en.wikipedia.org/wiki/Sonata_form).",
    "availability": "The corpus consists of complete scores of all 18 sonatas with form, harmony, and cadence annotations ([Hentschel et al., 2021](http://doi.org/10.5334/tismir.63)). Sonatas 1 (K279), 2 (K280) and 5 (K283) also have texture annotations ([Couturier et al., 2022](https://dx.doi.org/10.5281/zenodo.7316712)). Some movements also have synchronized audio. The corpus uses measure maps ([Gotham et al., 2023](https://doi.org/10.1145/3625135.3625136)) to improve annotation interoperability.",
    "availability:de": "Der Korpus besteht aus vollständigen Partituren aller 18 Sonaten mit Form-, Harmonie- und Kadenzannotationen ([Hentschel et al., 2021](http://doi.org/10.5334/tismir.63)). Die Sonaten 1 (K279), 2 (K280) und 5 (K283) enthalten außerdem auch Texturannotationen ([Couturier et al., 2022](https://dx.doi.org/10.5281/zenodo.7316712)). Einige Sätze haben auch synchronisierte Audioaufnahmen. Der Korpus verwendet Measure Maps ([Gotham et al., 2023](https://doi.org/10.1145/3625135.3625136)) für verbesserte Interoperabilität der Annotationen.",
    "availability:el": "Το σύνολο περιλαμβάνει πλήρεις παρτιτούρες όλων των 18 σονατών με σημειώσεις σχετικά με τη μορφή, την αρμονία και την καδένα ([Hentschel et al., 2021](http://doi.org/10.5334/tismir.63)). Οι σονάτες 1 (K279), 2 (K280) και 5 (K283) έχουν επίσης σημειώσεις υφής ([Couturier et al., 2022](https://dx.doi.org/10.5281/zenodo.7316712)). Κάποια κινήματα έχουν επίσης συγχρονισμένο ήχο. Το σύνολο χρησιμοποιεί χάρτες μέτρων ([Gotham et al., 2023](https://doi.org/10.1145/3625135.3625136)) για να βελτιώσει τη συμβατότητα των σημειώσεων.",
    "availability:fr": "Ce corpus comprend les partitions de l'ensemble des 18 sonates avec des annotations d'harmonie et de forme ([Hentschel et al., 2021](http://doi.org/10.5334/tismir.63)). Les sonates 1 (K279), 2 (K280) et 5 (K283) ont aussi des annotations de texture ([Couturier et al., 2022](https://dx.doi.org/10.5281/zenodo.7316712)). Quelques mouvements ont aussi des enregistrements audio. Le corpus utilise les *measure maps* ([Gotham et al., 2023](https://doi.org/10.1145/3625135.3625136)) pour améliorer l'interopérabilité des annotations.",
    "availability:hr": "Korpus sadrži partiture 18 klavirskih sonata W. A. Mozarta s anotacijama glazbenog oblika, harmonije i kadenca ([Hentschel i suradnici, 2021](http://doi.org/10.5334/tismir.63)). Za tri sonate – Sonata za klavir br. 1 u C-duru, K. 279, Sonata za klavir br. 2 u F-duru, K. 280 i Sonata za klavir br. 5 u G-duru, K. 283 – dostupne su vizualizacije tekstura ([Couturier i suradnici, 2022](https://dx.doi.org/10.5281/zenodo.7316712)). Samo su neki stavci sinkronizirani. Korpus koristi metodu za mjerenje razmaka između taktova (“measure maps”) ([Gotham i suradnici, 2023](https://doi.org/10.1145/3625135.3625136)) da bi poboljšao interoperabilnost anotacija.",
    "availability:it": "Il corpus è composto dalle partiture complete di tutte e 18 le sonate con annotazioni sulla forma, l'armonia e le cadenze ([Hentschel et al., 2021](http://doi.org/10.5334/tismir.63)). Le sonate 1 (K279), 2 (K280) e 5 (K283) hanno annotazioni anche sulla texture musicale ([Couturier et al., 2022](https://dx.doi.org/10.5281/zenodo.7316712)). Alcuni movimenti sono provvisti anche di audio sincronizzato. Il corpus utilizza la measure map (mappa delle battute) ([Gotham et al., 2023](https://doi.org/10.1145/3625135.3625136)) per migliorare l'interoperabilità delle annotazioni.",
    "availability:sl": "Korpus vsebuje partiture vseh 18 sonat z označenimi harmonijami in kadencami ([Hentschel et al., 2021](http://doi.org/10.5334/tismir.63)). Sonata za klavir št. 1 v C-duru, K. 279, Sonata za klavir št. 2 v F-duru, K. 280 in Sonata za klavir št. 5 v G-duru, K. 283 so opremljene še z vizualizacijo analize tekstur ([Couturier et al., 2022](https://dx.doi.org/10.5281/zenodo.7316712)). Nekateri stavki imajo tudi usklajene avdio posnetke. Korpus uporablja metodo za merjenje razdalj med takti (*measure maps*) ([Gotham et al., 2023](https://doi.org/10.1145/3625135.3625136)) za izboljšanje interoperabilnosti množice oznak, beležk, analiz in komentarjev.",

    "image": "https://upload.wikimedia.org/wikipedia/commons/b/bc/Mozart-by-Croce-1780-81.jpg",
    "image:card": "https://ws.dezrann.net/resources/corpus/images/Mozart-zoom.jpg",

    "genre": "Piano Sonata",
    "license": "CC-BY-NC-SA-4.0 (scores), ODbL (annotations), CC0-1.0, CC-BY-NC-SA-3.0 (specific recordings)",
    "quality:corpus": 5,
    "quality:corpus:metadata": 4,
    "ref:imslp": "19_Sonatas_for_the_Piano_(Mozart,_Wolfgang_Amadeus)",
    "ref:musescore": "https://github.com/DCMLab/mozart_piano_sonatas/tree/main/scores",
    "ref:musicbrainz": "16d9d959-8d25-3276-b209-3fd99dd81547",
    "ref:wikipedia": "List_of_sonatas_by_Wolfgang_Amadeus_Mozart",
    "ref:wikipedia:fr ": "Liste_des_œuvres_pour_piano_de_Wolfgang_Amadeus_Mozart#Sonates",
    "showcase": [
      "k279.1", "k279.2", "k279.3", "k280.1", "k283.1"
    ],
    "status": "✅ The corpus is in good condition, with only minor issues. It is fully reproducible from a long-term archive. For the majority of pieces, the score are well presented, include analyses. Some of them have synchronized audio."
  },

  "pieces": {
    "k279": {
      "opus": {
        "..analysis:default": "K{koechel}-{mvt}_harmony_texture.dez",
        "..sources.2.analysis": "https://gitlab.com/algomus.fr/symbolic-texture-dataset/-/raw/dez_augmented/dez_augmented/K{koechel}-{mvt}_harmony_texture.dez",
        "..sources.3.analysis": "https://gitlab.com/algomus.fr/symbolic-texture-dataset/-/raw/dez_augmented/dataset/dez/K{koechel}-{mvt}_texture.dez",
        "piece:title": "Piano Sonata no. 1 in C major",
        "piece:title:fr": "Sonate pour piano n°1 en do majeur",
        "ref:kernscores": "mozart/sonata/sonata01-{mvt}.krn",
        "ref:musicbrainz": "16d9d959-8d25-3276-b209-3fd99dd81547",
        "sonata:key": "C major",
        "sonata:num": "1",
        "year": "1775"
      }
    },
    "k279.1": {
      "opus": {
        "key": "C major",
        "movement:title": "Allegro"
      },

      "quality:score": "3",
      "quality:annotation": "5",
      "quality:audio": "4",
      "quality:audio:synchro": "3",
      "quality:musical-time": "5",
      "quality:metadata": "4",

      "sources": [
        {},
        {
          "audio:yt": "W4ykwJjI0IA"
        }
      ]
    },
    "k279.2": {
      "opus": {
        "key": "F major",
        "movement:title": "Andante"
      },

      "quality:score": "3",
      "quality:annotation": "5",
      "quality:audio": "4",
      "quality:audio:synchro": "3",
      "quality:musical-time": "5",
      "quality:metadata": "4",

      "sources": [
        {},
        {
          "audio:yt": "Xv3i3eAkbGQ"
        }
      ]
    },
    "k279.3": {
      "opus": {
        "key": "C major",
        "movement:title": "Allegro"
      },

      "quality:score": "3",
      "quality:annotation": "5",
      "quality:audio": "4",
      "quality:audio:synchro": "3",
      "quality:musical-time": "5",
      "quality:metadata": "4",

      "sources": [
        {},
        {
          "audio:yt": "15VU3a3Uf58"
        }
      ]
    },
    "k280": {
      "opus": {
        "..analysis:default": "K{koechel}-{mvt}_harmony_texture.dez",
        "..sources.2.analysis": "https://gitlab.com/algomus.fr/symbolic-texture-dataset/-/raw/dez_augmented/dez_augmented/K{koechel}-{mvt}_harmony_texture.dez",
        "..sources.3.analysis": "https://gitlab.com/algomus.fr/symbolic-texture-dataset/-/raw/dez_augmented/dataset/dez/K{koechel}-{mvt}_texture.dez",
        "piece:title": "Piano Sonata no. 2 in F major",
        "piece:title:fr": "Sonate pour piano n°2 en fa majeur",
        "ref:kernscores": "mozart/sonata/sonata02-{mvt}.krn",
        "ref:musicbrainz": "52912ca4-855d-451d-9abb-d3e3a353e6d2",
        "sonata:key": "F major",
        "sonata:num": "2",
        "year": "1775"
      }
    },
    "k280.1": {
      "opus": {
        "key": "F major",
        "movement:title": "Allegro assai"
      },

      "quality:score": "3",
      "quality:annotation": "5",
      "quality:audio": "4",
      "quality:audio:synchro": "3",
      "quality:musical-time": "5",
      "quality:metadata": "4",

      "sources": [
        {},
        {
          "audio:yt": "FQc_ykPAXQU"
        }
      ]
    },
    "k280.2": {
      "opus": {
        "key": "F minor",
        "movement:title": "Adagio"
      },

      "quality:score": "3",
      "quality:annotation": "5",
      "quality:audio": "4",
      "quality:audio:synchro": "3",
      "quality:musical-time": "5",
      "quality:metadata": "4",

      "sources": [
        {},
        {
          "audio:yt": "8t2WGCeGQbs"
        },
        {},
        {},
        {
          "audio": "http://vmirror.imslp.org/files/imglnks/usimg/2/2a/IMSLP597308-PMLP1832-Mozart_Sonata_2_-_II._Adagio.mp3",
          "contributors": {
            "performer": "Vicente Segura"
          },
          "license": "CC0-1.0",
          "ref": "https://imslp.org/wiki/Piano_Sonata_No.2_in_F_major,_K.280/189e_(Mozart,_Wolfgang_Amadeus)",
          "synchro": "https://gitlab.com/algomus.fr/dezrann/dezrann-corpus/-/raw/main/corpus/mozart-piano-sonatas/synchro/k280.2-other-1.synchro.json"
        }
      ]
    },
    "k280.3": {
      "opus": {
        "key": "F major",
        "movement:title": "Presto"
      },

      "quality:score": "3",
      "quality:annotation": "5",
      "quality:audio": "4",
      "quality:audio:synchro": "3",
      "quality:musical-time": "5",
      "quality:metadata": "4",

      "sources": [
        {},
        {
          "audio:yt": "sgvdvCbzIOs"
        }
      ]
    },
    "k281": {
      "opus": {
        "piece:title": "Piano Sonata no. 3 in B flat major",
        "piece:title:fr": "Sonate pour piano n°3 en si bémol majeur",
        "ref:kernscores": "mozart/sonata/sonata03-{mvt}.krn",
        "ref:musicbrainz": "4495fb34-25b6-48f9-9a53-e2caa9ac8a2c",
        "sonata:key": "B flat major",
        "sonata:num": "3",
        "year": "1775"
      }
    },
    "k281.1": {
      "opus": {
        "key": "B flat major",
        "movement:title": "Allegro"
      },

      "quality:score": "3",
      "quality:annotation": "5",
      "quality:audio": "4",
      "quality:audio:synchro": "3",
      "quality:musical-time": "5",
      "quality:metadata": "4",

      "sources": [
        {},
        {
          "audio:yt": "z0pGl6eBptM"
        }
      ]
    },
    "k281.2": {
      "opus": {
        "key": "E flat major",
        "movement:title": "Andante amoroso"
      },

      "quality:score": "3",
      "quality:annotation": "5",
      "quality:audio": "4",
      "quality:audio:synchro": "3",
      "quality:musical-time": "5",
      "quality:metadata": "4",

      "sources": [
        {},
        {
          "audio:yt": "0xfF3f7i7PM"
        }
      ]
    },
    "k281.3": {
      "opus": {
        "key": "B flat major",
        "movement:title": "Rondeau. Allegro"
      },

      "quality:score": "3",
      "quality:annotation": "5",
      "quality:audio": "4",
      "quality:audio:synchro": "3",
      "quality:musical-time": "5",
      "quality:metadata": "4",

      "sources": [
        {},
        {
          "audio:yt": "hJ0vgUZieqI"
        }
      ]
    },
    "k282": {
      "opus": {
        "piece:title": "Piano Sonata no. 4 in E flat major",
        "piece:title:fr": "Sonate pour piano n°4 en mi bémol majeur",
        "ref:kernscores": "mozart/sonata/sonata04-{mvt}.krn",
        "ref:musicbrainz": "97cc4159-c124-48a6-92ae-d05e8175cb2b",
        "sonata:key": "E flat major",
        "sonata:num": "4",
        "year": "1775"
      }
    },
    "k282.1": {
      "opus": {
        "key": "E flat major",
        "movement:title": "Adagio"
      },

      "quality:score": "3",
      "quality:annotation": "5",
      "quality:audio": "4",
      "quality:audio:synchro": "3",
      "quality:musical-time": "5",
      "quality:metadata": "4",

      "sources": [
        {},
        {
          "audio:yt": "hUQuROTp71g"
        }
      ]
    },
    "k282.2": {
      "opus": {
        "key": "B flat major",
        "movement:title": "Minuetto I & II"
      },

      "quality:score": "3",
      "quality:annotation": "5",
      "quality:audio": "4",
      "quality:audio:synchro": "3",
      "quality:musical-time": "5",
      "quality:metadata": "4",

      "sources": [
        {},
        {
          "audio:yt": "n6dP72yIAOg"
        }
      ]
    },
    "k282.3": {
      "opus": {
        "key": "E flat major",
        "movement:title": "Allegro"
      },

      "quality:score": "3",
      "quality:annotation": "5",
      "quality:audio": "4",
      "quality:audio:synchro": "3",
      "quality:musical-time": "5",
      "quality:metadata": "4",

      "sources": [
        {},
        {
          "audio:yt": "5d-CsLM5zrM"
        }
      ]
    },
    "k283": {
      "opus": {
        "..analysis:default": "K{koechel}-{mvt}_harmony_texture.dez",
        "..sources.2.analysis": "https://gitlab.com/algomus.fr/symbolic-texture-dataset/-/raw/dez_augmented/dez_augmented/K{koechel}-{mvt}_harmony_texture.dez",
        "..sources.3.analysis": "https://gitlab.com/algomus.fr/symbolic-texture-dataset/-/raw/dez_augmented/dataset/dez/K{koechel}-{mvt}_texture.dez",
        "piece:title": "Piano Sonata no. 5 in G major",
        "piece:title:fr": "Sonate pour piano n°5 en sol majeur",
        "ref:kernscores": "mozart/sonata/sonata05-{mvt}.krn",
        "ref:musicbrainz": "cb47a22e-9fc6-4ab6-9be2-445113373353",
        "sonata:key": "G major",
        "sonata:num": "5",
        "year": "1775"
      }
    },
    "k283.1": {
      "opus": {
        "key": "G major",
        "movement:title": "Allegro"
      },

      "quality:score": "3",
      "quality:annotation": "5",
      "quality:audio": "4",
      "quality:audio:synchro": "3",
      "quality:musical-time": "4",
      "quality:metadata": "4",

      "sources": [
        {},
        {
          "audio:yt": "C_nF5ANokjw"
        },
        {},
        {},
        {
          "audio": "http://vmirror.imslp.org/files/imglnks/usimg/2/2a/IMSLP243923-PMLP01837-mozart_K283_jumppanen.mp3",
          "contributors": {
            "performer": "Paavali Jumppanen"
          },
          "license": "CC-BY-NC-SA-3.0",
          "ref": "https://imslp.org/wiki/Piano_Sonata_No.5_in_G_major,_K.283/189h_(Mozart,_Wolfgang_Amadeus)",
          "synchro": "https://gitlab.com/algomus.fr/dezrann/dezrann-corpus/-/raw/main/corpus/mozart-piano-sonatas/synchro/k283.1-other-2.synchro.json"
        }
      ]
    },
    "k283.2": {
      "opus": {
        "key": "C major",
        "movement:title": "Andante"
      },
      "quality:warning": "not found",
      "sources": [
        {},
        {
          "audio:yt": "iuj9nxyEHLg"
        }
      ]
    },
    "k283.3": {
      "opus": {
        "key": "G major",
        "movement:title": "Presto"
      },

      "quality:score": "3",
      "quality:annotation": "5",
      "quality:audio": "4",
      "quality:audio:synchro": "3",
      "quality:musical-time": "5",
      "quality:metadata": "4",

      "sources": [
        {},
        {
          "audio:yt": "YLUFLYCH5J8"
        }
      ]
    },
    "k284": {
      "opus": {
        "piece:nickname": "Dürnitz",
        "piece:title": "Piano Sonata no. 6 in D major",
        "piece:title:fr": "Sonate pour piano n°6 en ré majeur",
        "ref:kernscores": "mozart/sonata/sonata06-{mvt}.krn",
        "ref:musicbrainz": "28017093-d48e-43b9-a908-0e893a1e867e",
        "sonata:key": "D major",
        "sonata:num": "6",
        "year": "1775"
      }
    },
    "k284.1": {
      "opus": {
        "key": "D major",
        "movement:title": "Allegro"
      },

      "quality:score": "3",
      "quality:annotation": "5",
      "quality:audio": "4",
      "quality:audio:synchro": "3",
      "quality:musical-time": "5",
      "quality:metadata": "4",

      "sources": [
        {},
        {
          "audio:yt": "zbY2oU-JmpM"
        }
      ]
    },
    "k284.2": {
      "opus": {
        "key": "A major",
        "movement:title": "Rondeau en Polonaise. Andante"
      },

      "quality:score": "3",
      "quality:annotation": "5",
      "quality:audio": "4",
      "quality:audio:synchro": "3",
      "quality:musical-time": "5",
      "quality:metadata": "4",

      "sources": [
        {},
        {
          "audio:yt": "gaU_q8M_deY"
        }
      ]
    },
    "k284.3": {
      "opus": {
        "key": "D major",
        "movement:title": "Thema & Variations. Andante"
      },

      "quality:score": "3",
      "quality:annotation": "5",
      "quality:audio": "4",
      "quality:audio:synchro": "3",
      "quality:musical-time": "5",
      "quality:metadata": "4",

      "sources": [
        {},
        {
          "audio:yt": "BWkN5ZSvzT4"
        }
      ]
    },
    "k309": {
      "opus": {
        "piece:title": "Piano Sonata no. 7 in C major",
        "piece:title:fr": "Sonate pour piano n°7 en do majeur",
        "ref:musicbrainz": "bd91e456-789c-4596-bedb-2259f113e3aa",
        "sonata:key": "C major",
        "sonata:num": "7",
        "year": "1777"
      }
    },
    "k309.1": {
      "opus": {
        "key": "C major",
        "movement:title": "Allegro con spirito"
      },

      "quality:score": "3",
      "quality:annotation": "5",
      "quality:audio": "4",
      "quality:audio:synchro": "3",
      "quality:musical-time": "5",
      "quality:metadata": "4",

      "sources": [
        {},
        {
          "audio:yt": "Xjkb1WuonxE"
        }
      ]
    },
    "k309.2": {
      "opus": {
        "key": "F major",
        "movement:title": "Andante un poco adagio"
      },

      "quality:score": "3",
      "quality:annotation": "5",
      "quality:audio": "4",
      "quality:audio:synchro": "3",
      "quality:musical-time": "5",
      "quality:metadata": "4",

      "sources": [
        {},
        {
          "audio:yt": "5L3thixfhHg"
        }
      ]
    },
    "k309.3": {
      "opus": {
        "key": "C major",
        "movement:title": "Rondeau. Allegretto grazioso"
      },

      "quality:score": "3",
      "quality:annotation": "5",
      "quality:audio": "4",
      "quality:audio:synchro": "3",
      "quality:musical-time": "5",
      "quality:metadata": "4",

      "sources": [
        {},
        {
          "audio:yt": "JVhMa-4kifw"
        }
      ]
    },
    "k310": {
      "opus": {
        "piece:title": "Piano Sonata no. 8 in A minor",
        "piece:title:fr": "Sonate pour piano n°8 en la mineur",
        "ref:musicbrainz": "53b2287b-e013-4c53-8498-6ab35c5de503",
        "sonata:key": "A minor",
        "sonata:num": "8",
        "year": "1778"
      }
    },
    "k310.1": {
      "opus": {
        "key": "A minor",
        "movement:title": "Allegro maestoso"
      },

      "quality:score": "3",
      "quality:annotation": "5",
      "quality:audio": "4",
      "quality:audio:synchro": "0",
      "quality:musical-time": "5",
      "quality:metadata": "4",

      "sources": [
        {},
        {
          "audio:yt": "YXY_DiWRRx8"
        }
      ]
    },
    "k310.2": {
      "opus": {
        "key": "F major",
        "movement:title": "Andante cantabile con espressione"
      },

      "quality:score": "3",
      "quality:annotation": "5",
      "quality:audio": "4",
      "quality:audio:synchro": "0",
      "quality:musical-time": "5",
      "quality:metadata": "4",

      "sources": [
        {},
        {
          "audio:yt": "9ibpKk5AIYU"
        }
      ]
    },
    "k310.3": {
      "opus": {
        "key": "A minor",
        "movement:title": "Presto"
      },

      "quality:score": "3",
      "quality:annotation": "5",
      "quality:audio": "4",
      "quality:audio:synchro": "0",
      "quality:musical-time": "5",
      "quality:metadata": "4",

      "sources": [
        {},
        {
          "audio:yt": "WccyY5UxYek"
        }
      ]
    },
    "k311": {
      "opus": {
        "piece:title": "Piano Sonata no. 9 in D major",
        "piece:title:fr": "Sonate pour piano n°9 en ré majeur",
        "ref:musicbrainz": "70d1fa96-da75-4ec2-97e4-759ff26eb881",
        "sonata:key": "D major",
        "sonata:num": "9",
        "year": "1778"
      }
    },
    "k311.1": {
      "opus": {
        "key": "D major",
        "movement:title": "Allegro con spirito"
      },

      "quality:score": "3",
      "quality:annotation": "5",
      "quality:audio": "4",
      "quality:audio:synchro": "0",
      "quality:musical-time": "5",
      "quality:metadata": "4",

      "sources": [
        {},
        {
          "audio:yt": "ajTK2yjEamE"
        }
      ]
    },
    "k311.2": {
      "opus": {
        "key": "G major",
        "movement:title": "Andante con espressione"
      },

      "quality:score": "3",
      "quality:annotation": "5",
      "quality:audio": "4",
      "quality:audio:synchro": "0",
      "quality:musical-time": "5",
      "quality:metadata": "4",

      "sources": [
        {},
        {
          "audio:yt": "TD93No85P3Y"
        }
      ]
    },
    "k311.3": {
      "opus": {
        "key": "D major",
        "movement:title": "Rondeau. Allegro"
      },

      "quality:score": "3",
      "quality:annotation": "5",
      "quality:audio": "4",
      "quality:audio:synchro": "0",
      "quality:musical-time": "5",
      "quality:metadata": "4",

      "sources": [
        {},
        {
          "audio:yt": "OocEvTqpGw4"
        }
      ]
    },
    "k330": {
      "opus": {
        "piece:title": "Piano Sonata no. 10 in C major",
        "piece:title:fr": "Sonate pour piano n°10 en do majeur",
        "ref:musicbrainz": "70d1fa96-da75-4ec2-97e4-759ff26eb881",
        "sonata:key": "C major",
        "sonata:num": "10",
        "year": "1783"
      }
    },
    "k330.1": {
      "opus": {
        "key": "C major",
        "movement:title": "Allegro moderato"
      },
      "quality:score": "3",
      "quality:annotation": "5",
      "quality:audio": "4",
      "quality:audio:synchro": "3",
      "quality:musical-time": "5",
      "quality:metadata": "4",

      "sources": [
        {},
        {
          "audio:yt": "6S1RCjUpJrg"
        }
      ]
    },
    "k330.2": {
      "opus": {
        "key": "F major",
        "movement:title": "Andante cantabile"
      },
      "quality:score": "3",
      "quality:annotation": "5",
      "quality:audio": "4",
      "quality:audio:synchro": "3",
      "quality:musical-time": "5",
      "quality:metadata": "4",

      "sources": [
        {},
        {
          "audio:yt": "BcR9QOC8sbw"
        }
      ]
    },
    "k330.3": {
      "opus": {
        "key": "C major",
        "movement:title": "Allegretto"
      },
      "quality:score": "3",
      "quality:annotation": "5",
      "quality:audio": "4",
      "quality:audio:synchro": "3",
      "quality:musical-time": "5",
      "quality:metadata": "4",

      "sources": [
        {},
        {
          "audio:yt": "cx0FedH1L1c"
        }
      ]
    },
    "k331": {
      "opus": {
        "piece:title": "Piano Sonata no. 11 in A major",
        "piece:title:fr": "Sonate pour piano n°11 en la mineur",
        "ref:musicbrainz": "a488a020-884d-3349-a7e7-18993ffed13e",
        "sonata:key": "A major",
        "sonata:num": "11",
        "year": "1783"
      }
    },
    "k331.1": {
      "opus": {
        "key": "A major",
        "movement:title": "Thema & Variations. Andante grazioso"
      },
      "quality:score": "3",
      "quality:annotation": "5",
      "quality:audio": "4",
      "quality:audio:synchro": "3",
      "quality:musical-time": "5",
      "quality:metadata": "4",

      "sources": [
        {},
        {
          "audio:yt": "ZYSHUK7kOKI"
        }
      ]
    },
    "k331.2": {
      "opus": {
        "key": "D major",
        "movement:title": "Menuetto & Trio"
      },
      "quality:score": "3",
      "quality:annotation": "5",
      "quality:audio": "4",
      "quality:audio:synchro": "3",
      "quality:musical-time": "5",
      "quality:metadata": "4",

      "sources": [
        {},
        {
          "audio:yt": "g5p--m9cW30"
        }
      ]
    },
    "k331.3": {
      "opus": {
        "key": "A minor",
        "movement:title": "Rondo alla Turca. Allegretto"
      },
      "quality:score": "3",
      "quality:annotation": "5",
      "quality:audio": "4",
      "quality:audio:synchro": "3",
      "quality:musical-time": "5",
      "quality:metadata": "4",

      "sources": [
        {},
        {
          "audio:yt": "SXsGypaGrzo"
        }
      ]
    },
    "k332": {
      "opus": {
        "piece:title": "Piano Sonata no. 12 in F major",
        "piece:title:fr": "Sonate pour piano n°12 en fa majeur",
        "ref:musicbrainz": "5b587196-bd21-410a-999e-881073dea33b",
        "sonata:key": "F major",
        "sonata:num": "12",
        "year": "1783"
      }
    },
    "k332.1": {
      "opus": {
        "key": "F major",
        "movement:title": "Allegro"
      },
      "quality:score": "3",
      "quality:annotation": "5",
      "quality:audio": "4",
      "quality:audio:synchro": "3",
      "quality:musical-time": "5",
      "quality:metadata": "4",

      "sources": [
        {},
        {
          "audio:yt": "S550CgyzQ1M"
        }
      ]
    },
    "k332.2": {
      "opus": {
        "key": "B flat major",
        "movement:title": "Adagio"
      },
      "quality:score": "3",
      "quality:annotation": "5",
      "quality:audio": "4",
      "quality:audio:synchro": "3",
      "quality:musical-time": "5",
      "quality:metadata": "4",

      "sources": [
        {},
        {
          "audio:yt": "CXJZ2FmqO04"
        }
      ]
    },
    "k332.3": {
      "opus": {
        "key": "F major",
        "movement:title": "Allegro assai"
      },
      "quality:score": "3",
      "quality:annotation": "5",
      "quality:audio": "4",
      "quality:audio:synchro": "3",
      "quality:musical-time": "5",
      "quality:metadata": "4",

      "sources": [
        {},
        {
          "audio:yt": "NMQ-EkUs-os"
        }
      ]
    },
    "k333": {
      "opus": {
        "piece:title": "Piano Sonata no. 13 in B flat major",
        "piece:title:fr": "Sonate pour piano n°13 en si bémol majeur",
        "ref:musicbrainz": "5057d730-7733-4753-aa0f-07498a0c37f0",
        "sonata:key": "B flat major",
        "sonata:num": "13",
        "year": "1783"
      }
    },
    "k333.1": {
      "opus": {
        "key": "B flat major",
        "movement:title": "Allegro"
      },
      "quality:score": "3",
      "quality:annotation": "5",
      "quality:audio": "4",
      "quality:audio:synchro": "3",
      "quality:musical-time": "1",
      "quality:metadata": "4",

      "sources": [
        {},
        {
          "audio:yt": "fUw99LvEm6M"
        }
      ]
    },
    "k333.2": {
      "opus": {
        "key": "E flat major",
        "movement:title": "Andante cantabile"
      },
      "quality:score": "3",
      "quality:annotation": "5",
      "quality:audio": "4",
      "quality:audio:synchro": "3",
      "quality:musical-time": "5",
      "quality:metadata": "4",

      "sources": [
        {},
        {
          "audio:yt": "z2k-WUlS4Po"
        }
      ]
    },
    "k333.3": {
      "opus": {
        "key": "B flat major",
        "movement:title": "Allegretto grazioso"
      },
      "quality:score": "3",
      "quality:annotation": "5",
      "quality:audio": "4",
      "quality:audio:synchro": "3",
      "quality:musical-time": "5",
      "quality:metadata": "4",

      "sources": [
        {},
        {
          "audio:yt": "zX5pfBmz_-E"
        }
      ]
    },
    "k457": {
      "opus": {
        "piece:title": "Piano Sonata no. 14 in C minor",
        "piece:title:fr": "Sonate pour piano n°14 en do mineur",
        "ref:musicbrainz": "c4762043-b408-4991-947e-d5340a9080d6",
        "sonata:key": "C minor",
        "sonata:num": "14",
        "year": "1784"
      }
    },
    "k457.1": {
      "opus": {
        "key": "C minor",
        "movement:title": "Molto allegro"
      },
      "quality:score": "3",
      "quality:annotation": "5",
      "quality:audio": "4",
      "quality:audio:synchro": "3",
      "quality:musical-time": "5",
      "quality:metadata": "4",

      "sources": [
        {},
        {
          "audio:yt": "hYWMUBcdsEg"
        }
      ]
    },
    "k457.2": {
      "opus": {
        "key": "E flat major",
        "movement:title": "Adagio"
      },
      "quality:score": "3",
      "quality:annotation": "5",
      "quality:audio": "4",
      "quality:audio:synchro": "3",
      "quality:musical-time": "5",
      "quality:metadata": "4",

      "sources": [
        {},
        {
          "audio:yt": "c4c8t3aN-zQ"
        }
      ]
    },
    "k457.3": {
      "opus": {
        "key": "C minor",
        "movement:title": "Allegro assai"
      },
      "quality:score": "3",
      "quality:annotation": "5",
      "quality:audio": "4",
      "quality:audio:synchro": "3",
      "quality:musical-time": "5",
      "quality:metadata": "4",

      "sources": [
        {},
        {
          "audio:yt": "bKq2wH1AH4Y"
        }
      ]
    },
    "k533": {
      "opus": {
        "piece:title": "Piano Sonata no. 15 in F major",
        "piece:title:fr": "Sonate pour piano n°15 en fa majeur",
        "ref:musicbrainz": "11364bbd-1258-4d06-b4f6-3262e4a67000",
        "sonata:key": "F major",
        "sonata:num": "15",
        "year": "1788"
      }
    },
    "k533.1": {
      "opus": {
        "key": "F major",
        "movement:title": "Allegro"
      },
      "quality:score": "3",
      "quality:annotation": "5",
      "quality:audio": "4",
      "quality:audio:synchro": "3",
      "quality:musical-time": "5",
      "quality:metadata": "4",

      "sources": [
        {},
        {
          "audio:yt": "Vf2DYGpel8g"
        }
      ]
    },
    "k533.2": {
      "opus": {
        "key": "B flat major",
        "movement:title": "Andante"
      },
      "quality:score": "3",
      "quality:annotation": "5",
      "quality:audio": "4",
      "quality:audio:synchro": "3",
      "quality:musical-time": "5",
      "quality:metadata": "4",

      "sources": [
        {},
        {
          "audio:yt": "xEDcxAuZgvw"
        }
      ]
    },
    "k533.3": {
      "opus": {
        "key": "F major",
        "movement:title": "Rondeau. Allegretto"
      },
      "quality:score": "3",
      "quality:annotation": "5",
      "quality:audio": "4",
      "quality:audio:synchro": "3",
      "quality:musical-time": "5",
      "quality:metadata": "4",

      "sources": [
        {},
        {
          "audio:yt": "nJwkUlkdIZ0"
        }
      ]
    },
    "k545": {
      "opus": {
        "piece:nickname": "Sonata facile",
        "piece:title": "Piano Sonata no. 16 in C major",
        "piece:title:fr": "Sonate pour piano n°16 en do majeur",
        "ref:musicbrainz": "a2ad223d-d73b-3775-9580-fd25b4d986e1",
        "sonata:key": "C major",
        "sonata:num": "16",
        "year": "1788"
      }
    },
    "k545.1": {
      "opus": {
        "key": "C major",
        "movement:title": "Allegro"
      },

      "quality:score": "3",
      "quality:annotation": "5",
      "quality:audio": "4",
      "quality:audio:synchro": "3",
      "quality:musical-time": "5",
      "quality:metadata": "4",

      "sources": [
        {},
        {
          "audio:yt": "ht8r1uRpgN0"
        },
        {
          "video:yt": "cLYmvisWtbo",
          "contributors": {
            "performer": "Daniel Barenboim"
          },
          "year": "2000",
          "info": "Teatro Colón, Buenos Aires"
        }
      ]
    },
    "k545.2": {
      "opus": {
        "key": "G major",
        "movement:title": "Andante"
      },
      "quality:score": "3",
      "quality:annotation": "5",
      "quality:audio": "4",
      "quality:audio:synchro": "3",
      "quality:musical-time": "5",
      "quality:metadata": "4",

      "sources": [
        {},
        {
          "audio:yt": "91CUVZd4aJ8"
        }
      ]
    },
    "k545.3": {
      "opus": {
        "key": "C major",
        "movement:title": "Rondeau. Allegretto"
      },
      "quality:score": "3",
      "quality:annotation": "5",
      "quality:audio": "4",
      "quality:audio:synchro": "3",
      "quality:musical-time": "5",
      "quality:metadata": "4",

      "sources": [
        {},
        {
          "audio:yt": "-MfuVrrqVhQ"
        }
      ]
    },
    "k570": {
      "opus": {
        "piece:title": "Piano Sonata no. 17 in B flat major",
        "piece:title:fr": "Sonate pour piano n°17 en si bémol majeur",
        "ref:musicbrainz": "a484f227-9918-4c5e-85fb-1204db0b7af2",
        "sonata:key": "B flat major",
        "sonata:num": "17",
        "year": "1789"
      }
    },
    "k570.1": {
      "opus": {
        "key": "B flat major",
        "movement:title": "Allegro"
      },
      "quality:score": "3",
      "quality:annotation": "5",
      "quality:audio": "4",
      "quality:audio:synchro": "3",
      "quality:musical-time": "5",
      "quality:metadata": "4",

      "sources": [
        {},
        {
          "audio:yt": "UaQrbZNkgDE"
        }
      ]
    },
    "k570.2": {
      "opus": {
        "key": "E flat major",
        "movement:title": "Adagio"
      },
      "quality:score": "3",
      "quality:annotation": "5",
      "quality:audio": "4",
      "quality:audio:synchro": "3",
      "quality:musical-time": "5",
      "quality:metadata": "4",

      "sources": [
        {},
        {
          "audio:yt": "jhXY84JUh_8"
        }
      ]
    },
    "k570.3": {
      "opus": {
        "key": "B flat major",
        "movement:title": "Allegretto"
      },
      "quality:score": "3",
      "quality:annotation": "5",
      "quality:audio": "4",
      "quality:audio:synchro": "3",
      "quality:musical-time": "5",
      "quality:metadata": "4",

      "sources": [
        {},
        {
          "audio:yt": "JFjqh3_pRSI"
        }
      ]
    },
    "k576": {
      "opus": {
        "piece:title": "Piano Sonata no. 18 in D major",
        "piece:title:fr": "Sonate pour piano n°18 en ré majeur",
        "ref:musicbrainz": "99538f90-2ca3-4b34-b6b9-f39ca0937066",
        "sonata:key": "D major",
        "sonata:num": "18",
        "year": "1789"
      }
    },
    "k576.1": {
      "opus": {
        "key": "D major",
        "movement:title": "Allegro"
      },
      "quality:score": "3",
      "quality:annotation": "5",
      "quality:audio": "4",
      "quality:audio:synchro": "3",
      "quality:musical-time": "5",
      "quality:metadata": "4",

      "sources": [
        {},
        {
          "audio:yt": "2sehQIIirLc"
        }
      ]
    },
    "k576.2": {
      "opus": {
        "key": "A major",
        "movement:title": "Adagio"
      },
      "quality:score": "3",
      "quality:annotation": "5",
      "quality:audio": "4",
      "quality:audio:synchro": "3",
      "quality:musical-time": "5",
      "quality:metadata": "4",

      "sources": [
        {},
        {
          "audio:yt": "9k5ayz6_EZE"
        }
      ]
    },
    "k576.3": {
      "opus": {
        "key": "D major",
        "movement:title": "Allegretto"
      },
      "quality:score": "3",
      "quality:annotation": "5",
      "quality:audio": "4",
      "quality:audio:synchro": "3",
      "quality:musical-time": "5",
      "quality:metadata": "4",

      "sources": [
        {},
        {
          "audio:yt": "PIEwOFbJuk4"
        }
      ]
    }
  },
  "settings": {
    "access": "public"
  },
  "template": {
    "opus": {
      "..quality:annotation": "5",
      "..quality:audio": "4",
      "..quality:audio:synchro": "0",
      "..quality:metadata": "4",
      "..quality:score": "3",

      "..sources.0.name": "DCML",
      "..sources.0.contributors.editor": "DCML corpus initiative",
      "..sources.0.contributors.encoder": "Johannes Hentschel, Markus Neuwirth, Martin A Rohrmeier",
      "..sources.0.license": "CC-BY-NC-SA-4.0",
      "..sources.0.ref": "http://doi.org/10.5334/tismir.63",
      "..sources.0.score": "https://raw.githubusercontent.com/DCMLab/mozart_piano_sonatas/main/MS3/K{koechel}-{mvt}.mscx",
      "..sources.0.measure-map": "https://gitlab.com/algomus.fr/symbolic-texture-dataset/-/raw/measuremap/measuremap/verbose/K{koechel}-{mvt}.mm.json",

      "..sources.1.name": "Klára Würtz",
      "..sources.1.contributors.editor": "Brilliant Classics",
      "..sources.1.contributors.performer": "Klára Würtz",
      "..sources.1.synchro": "https://gitlab.com/algomus.fr/dezrann/dezrann-corpus/-/raw/main/corpus/mozart-piano-sonatas/synchro/k{koechel}.{mvt}-W%C3%BCrtz-yt.synchro.json",

      "..sources.2.analysis": "https://gitlab.com/algomus.fr/symbolic-texture-dataset/-/raw/dez_augmented/dez_harmony/K{koechel}-{mvt}_harmony.dez",
      "..sources.2.license": "ODbL",
      "..analysis:default": "K{koechel}-{mvt}_harmony.dez",

      "contributors.composer": "Wolfgang Amadeus Mozart",
      "contributors.editor": "Neue Mozart Ausgabe",
      "contributors.encoder": "Lucas Mossman, Craig Stuart Sapp, Tobias Schölkopf, Tom Schreyer, tunescribers.com",
      "corpus": "Mozart piano sonatas",
      "corpus:fr": "Sonates pour piano de Mozart",
      "genre": "Piano Sonata",
      "id": "mozart/{KEY}",
      "key": "{sonata_key}",
      "movement:num": "{mvt_roman}",
      "movement:title": "mvt.",
      "opus": "{opus}",
      "piece:title": "Piano Sonata no. {sonata_num} in {sonata_key}",
      "ref": "https://github.com/DCMLab/mozart_piano_sonatas",
      "ref:imslp": "19_Sonatas_for_the_Piano_(Mozart,_Wolfgang_Amadeus)",
      "ref:wikipedia": "Piano_Sonata_No._{sonata_num}_(Mozart)",
      "ref:wikipedia:fr": "Sonate_pour_piano_no_{sonata_num}_de_Mozart"
    }
  }
}