[
  {
    "onset": 0,
    "date": 188.78
  },
  {
    "onset": 4,
    "date": 190.94
  },
  {
    "onset": 8,
    "date": 193.14
  },
  {
    "onset": 12,
    "date": 195.37
  },
  {
    "onset": 16,
    "date": 197.56
  },
  {
    "onset": 20,
    "date": 199.54
  },
  {
    "onset": 24,
    "date": 201.67
  },
  {
    "onset": 28,
    "date": 203.84
  },
  {
    "onset": 32,
    "date": 205.73
  },
  {
    "onset": 36,
    "date": 207.52
  },
  {
    "onset": 40,
    "date": 209.58
  },
  {
    "onset": 44,
    "date": 211.48
  },
  {
    "onset": 48,
    "date": 213.50
  },
  {
    "onset": 56,
    "date": 217.54
  },
  {
    "onset": 60,
    "date": 219.54
  },
  {
    "onset": 64,
    "date": 221.59
  },
  {
    "onset": 68,
    "date": 223.79
  },
  {
    "onset": 72,
    "date": 225.70
  },
  {
    "onset": 76,
    "date": 227.88
  },
  {
    "onset": 80,
    "date": 229.74
  },
  {
    "onset": 84,
    "date": 231.78
  },
  {
    "onset": 88,
    "date": 233.95
  },
  {
    "onset": 92,
    "date": 235.78
  },
  {
    "onset": 93,
    "date": 236.25
  },
  {
    "onset": 94,
    "date": 236.72
  },
  {
    "onset": 95,
    "date": 237.19
  },
  {
    "onset": 96,
    "date": 237.71
  },
  {
    "onset": 98,
    "date": 238.98
  },
  {
    "onset": 99,
    "date": 239.46
  },
  {
    "onset": 100,
    "date": 240.05
  },
  {
    "onset": 101,
    "date": 240.58
  },
  {
    "onset": 102,
    "date": 240.97
  },
  {
    "onset": 103,
    "date": 241.39
  },
  {
    "onset": 104,
    "date": 241.86
  },
  {
    "onset": 105,
    "date": 242.30
  },
  {
    "onset": 106,
    "date": 242.69
  },
  {
    "onset": 107,
    "date": 243.13
  },
  {
    "onset": 108,
    "date": 243.61
  },
  {
    "onset": 109,
    "date": 244.05
  },
  {
    "onset": 110,
    "date": 244.61
  },
  {
    "onset": 111,
    "date": 245.06
  },
  {
    "onset": 112,
    "date": 245.48
  },
  {
    "onset": 116,
    "date": 247.51
  },
  {
    "onset": 120,
    "date": 249.32
  },
  {
    "onset": 124,
    "date": 251.21
  },
  {
    "onset": 128,
    "date": 253.35
  },
  {
    "onset": 132,
    "date": 255.15
  },
  {
    "onset": 136,
    "date": 257.14
  },
  {
    "onset": 140,
    "date": 259.20
  },
  {
    "onset": 144,
    "date": 261.04
  },
  {
    "onset": 148,
    "date": 262.68
  },
  {
    "onset": 152,
    "date": 264.53
  },
  {
    "onset": 156,
    "date": 266.18
  },
  {
    "onset": 160,
    "date": 267.92
  },
  {
    "onset": 164,
    "date": 269.68
  },
  {
    "onset": 168,
    "date": 271.40
  },
  {
    "onset": 172,
    "date": 273.06
  },
  {
    "onset": 176,
    "date": 274.95
  },
  {
    "onset": 180,
    "date": 276.79
  },
  {
    "onset": 184,
    "date": 278.44
  },
  {
    "onset": 188,
    "date": 280.11
  },
  {
    "onset": 192,
    "date": 281.74
  },
  {
    "onset": 196,
    "date": 283.62
  },
  {
    "onset": 200,
    "date": 285.29
  },
  {
    "onset": 204,
    "date": 287.16
  },
  {
    "onset": 220,
    "date": 293.88
  },
  {
    "onset": 224,
    "date": 295.59
  },
  {
    "onset": 228,
    "date": 297.34
  },
  {
    "onset": 232,
    "date": 299.06
  },
  {
    "onset": 236,
    "date": 300.85
  },
  {
    "onset": 252,
    "date": 307.51
  },
  {
    "onset": 256,
    "date": 309.36
  },
  {
    "onset": 260,
    "date": 311.18
  },
  {
    "onset": 264,
    "date": 313.17
  },
  {
    "onset": 268,
    "date": 314.86
  },
  {
    "onset": 272,
    "date": 316.61
  },
  {
    "onset": 276,
    "date": 318.32
  },
  {
    "onset": 280,
    "date": 320.00
  },
  {
    "onset": 284,
    "date": 321.74
  },
  {
    "onset": 288,
    "date": 323.48
  },
  {
    "onset": 292,
    "date": 325.56
  },
  {
    "onset": 296,
    "date": 327.28
  },
  {
    "onset": 300,
    "date": 328.95
  },
  {
    "onset": 304,
    "date": 330.61
  },
  {
    "onset": 308,
    "date": 332.42
  },
  {
    "onset": 312,
    "date": 334.06
  },
  {
    "onset": 316,
    "date": 335.90
  },
  {
    "onset": 320,
    "date": 337.54
  },
  {
    "onset": 324,
    "date": 339.39
  },
  {
    "onset": 328,
    "date": 340.99
  },
  {
    "onset": 332,
    "date": 342.64
  },
  {
    "onset": 336,
    "date": 344.41
  },
  {
    "onset": 340,
    "date": 346.12
  },
  {
    "onset": 344,
    "date": 347.79
  },
  {
    "onset": 348,
    "date": 349.53
  },
  {
    "onset": 352,
    "date": 351.39
  },
  {
    "onset": 356,
    "date": 353.13
  },
  {
    "onset": 360,
    "date": 355.21
  },
  {
    "onset": 364,
    "date": 356.98
  },
  {
    "onset": 368,
    "date": 358.52
  },
  {
    "onset": 372,
    "date": 360.19
  },
  {
    "onset": 376,
    "date": 362.43
  },
  {
    "onset": 380,
    "date": 364.54
  },
  {
    "onset": 384,
    "date": 366.45
  },
  {
    "onset": 388,
    "date": 368.21
  },
  {
    "onset": 392,
    "date": 370.26
  },
  {
    "onset": 396,
    "date": 372.03
  },
  {
    "onset": 400,
    "date": 374.11
  },
  {
    "onset": 404,
    "date": 375.86
  },
  {
    "onset": 408,
    "date": 377.71
  },
  {
    "onset": 412,
    "date": 379.53
  },
  {
    "onset": 416,
    "date": 381.46
  },
  {
    "onset": 420,
    "date": 383.58
  },
  {
    "onset": 424,
    "date": 385.45
  },
  {
    "onset": 428,
    "date": 387.44
  },
  {
    "onset": 432,
    "date": 389.44
  },
  {
    "onset": 436,
    "date": 391.69
  },
  {
    "onset": 440,
    "date": 393.84
  },
  {
    "onset": 444,
    "date": 396.37
  },
  {
    "onset": 448,
    "date": 398.67
  },
  {
    "onset": 452,
    "date": 400.78
  },
  {
    "onset": 456,
    "date": 404.07
  },
  {
    "onset": 456,
    "date": 404.49
  }
]