[
  {
    "onset": 0,
    "date": 134.39
  },
  {
    "onset": 3,
    "date": 137.28
  },
  {
    "onset": 15,
    "date": 150.54
  },
  {
    "onset": 27,
    "date": 163.18
  },
  {
    "onset": 33,
    "date": 169.52
  },
  {
    "onset": 42,
    "date": 178.98
  },
  {
    "onset": 48,
    "date": 185.47
  },
  {
    "onset": 54,
    "date": 192.23
  },
  {
    "onset": 60,
    "date": 199.00
  },
  {
    "onset": 72,
    "date": 211.56
  },
  {
    "onset": 78,
    "date": 217.76
  },
  {
    "onset": 90,
    "date": 230.40
  },
  {
    "onset": 96,
    "date": 236.52
  },
  {
    "onset": 99,
    "date": 240.03
  },
  {
    "onset": 105,
    "date": 246.38
  },
  {
    "onset": 111,
    "date": 252.43
  },
  {
    "onset": 113,
    "date": 254.63
  },
  {
    "onset": 114,
    "date": 256.10
  },
  {
    "onset": 120,
    "date": 262.46
  },
  {
    "onset": 123,
    "date": 265.48
  },
  {
    "onset": 125,
    "date": 268.21
  },
  {
    "onset": 126,
    "date": 269.43
  },
  {
    "onset": 128,
    "date": 271.96
  },
  {
    "onset": 129,
    "date": 273.80
  }
]