[
  {
    "onset": 0,
    "date": 0
  },
  {
    "onset": 0.25,
    "date": 1.87
  },
  {
    "onset": 4,
    "date": 4.02
  },
  {
    "onset": 8,
    "date": 6.03
  },
  {
    "onset": 12,
    "date": 8.18
  },
  {
    "onset": 16,
    "date": 11.56
  },
  {
    "onset": 20,
    "date": 15.76
  },
  {
    "onset": 32,
    "date": 21.77
  },
  {
    "onset": 36,
    "date": 23.84
  },
  {
    "onset": 40,
    "date": 25.91
  },
  {
    "onset": 44,
    "date": 28.47
  },
  {
    "onset": 48,
    "date": 31.88
  },
  {
    "onset": 56,
    "date": 36.28
  },
  {
    "onset": 72,
    "date": 46.28
  },
  {
    "onset": 80,
    "date": 51.03
  },
  {
    "onset": 88,
    "date": 56.72
  },
  {
    "onset": 100,
    "date": 63.88
  },
  {
    "onset": 108,
    "date": 70.85
  },
  {
    "onset": 116,
    "date": 75.25
  },
  {
    "onset": 132,
    "date": 84.02
  },
  {
    "onset": 140,
    "date": 88.72
  },
  {
    "onset": 146,
    "date": 92.24
  },
  {
    "onset": 158,
    "date": 98.48
  },
  {
    "onset": 170,
    "date": 105.64
  },
  {
    "onset": 178,
    "date": 111.62
  },
  {
    "onset": 182,
    "date": 114.97
  },
  {
    "onset": 186,
    "date": 117.32
  },
  {
    "onset": 190,
    "date": 119.61
  },
  {
    "onset": 198,
    "date": 124.70
  },
  {
    "onset": 202,
    "date": 128.25
  },
  {
    "onset": 206,
    "date": 130.42
  },
  {
    "onset": 210,
    "date": 132.47
  },
  {
    "onset": 211,
    "date": 133.14
  }
]