[
    {
        "date": 0.66,
        "onset": 0
    },
    {
        "date": 1.29,
        "onset": 1
    },
    {
        "date": 1.93,
        "onset": 2
    },
    {
        "date": 2.64,
        "onset": 3
    },
    {
        "date": 3.40,
        "onset": 4
    },
    {
        "date": 4.08,
        "onset": 5
    },
    {
        "date": 4.75,
        "onset": 6
    },
    {
        "date": 5.39,
        "onset": 7
    },
    {
        "date": 6.02,
        "onset": 8
    },
    {
        "date": 6.71,
        "onset": 9
    },
    {
        "date": 7.34,
        "onset": 10
    },
    {
        "date": 8.03,
        "onset": 11
    },
    {
        "date": 8.71,
        "onset": 12
    },
    {
        "date": 9.35,
        "onset": 13
    },
    {
        "date": 9.96,
        "onset": 14
    },
    {
        "date": 10.59,
        "onset": 15
    },
    {
        "date": 11.22,
        "onset": 16
    },
    {
        "date": 11.87,
        "onset": 17
    },
    {
        "date": 12.49,
        "onset": 18
    },
    {
        "date": 13.14,
        "onset": 19
    },
    {
        "date": 13.80,
        "onset": 20
    },
    {
        "date": 14.47,
        "onset": 21
    },
    {
        "date": 15.11,
        "onset": 22
    },
    {
        "date": 15.78,
        "onset": 23
    },
    {
        "date": 16.46,
        "onset": 24
    },
    {
        "date": 17.10,
        "onset": 25
    },
    {
        "date": 17.72,
        "onset": 26
    },
    {
        "date": 18.36,
        "onset": 27
    },
    {
        "date": 19.00,
        "onset": 28
    },
    {
        "date": 19.67,
        "onset": 29
    },
    {
        "date": 20.30,
        "onset": 30
    },
    {
        "date": 20.97,
        "onset": 31
    },
    {
        "date": 21.64,
        "onset": 32
    },
    {
        "date": 22.28,
        "onset": 33
    },
    {
        "date": 22.93,
        "onset": 34
    },
    {
        "date": 23.58,
        "onset": 35
    },
    {
        "date": 24.26,
        "onset": 36
    },
    {
        "date": 24.96,
        "onset": 37
    },
    {
        "date": 25.59,
        "onset": 38
    },
    {
        "date": 26.22,
        "onset": 39
    },
    {
        "date": 26.87,
        "onset": 40
    },
    {
        "date": 27.55,
        "onset": 41
    },
    {
        "date": 28.20,
        "onset": 42
    },
    {
        "date": 28.88,
        "onset": 43
    },
    {
        "date": 29.58,
        "onset": 44
    },
    {
        "date": 30.24,
        "onset": 45
    },
    {
        "date": 30.92,
        "onset": 46
    },
    {
        "date": 31.59,
        "onset": 47
    },
    {
        "date": 32.21,
        "onset": 48
    },
    {
        "date": 32.84,
        "onset": 49
    },
    {
        "date": 33.50,
        "onset": 50
    },
    {
        "date": 34.15,
        "onset": 51
    },
    {
        "date": 34.78,
        "onset": 52
    },
    {
        "date": 35.43,
        "onset": 53
    },
    {
        "date": 36.08,
        "onset": 54
    },
    {
        "date": 36.75,
        "onset": 55
    },
    {
        "date": 37.39,
        "onset": 56
    },
    {
        "date": 38.08,
        "onset": 57
    },
    {
        "date": 38.68,
        "onset": 58
    },
    {
        "date": 39.36,
        "onset": 59
    },
    {
        "date": 40.01,
        "onset": 60
    },
    {
        "date": 40.69,
        "onset": 61
    },
    {
        "date": 41.32,
        "onset": 62
    },
    {
        "date": 42.00,
        "onset": 63
    },
    {
        "date": 42.66,
        "onset": 64
    },
    {
        "date": 43.32,
        "onset": 65
    },
    {
        "date": 43.97,
        "onset": 66
    },
    {
        "date": 44.67,
        "onset": 67
    },
    {
        "date": 45.29,
        "onset": 68
    },
    {
        "date": 45.98,
        "onset": 69
    },
    {
        "date": 46.63,
        "onset": 70
    },
    {
        "date": 47.29,
        "onset": 71
    },
    {
        "date": 47.90,
        "onset": 72
    },
    {
        "date": 48.54,
        "onset": 73
    },
    {
        "date": 49.18,
        "onset": 74
    },
    {
        "date": 49.82,
        "onset": 75
    },
    {
        "date": 50.47,
        "onset": 76
    },
    {
        "date": 51.13,
        "onset": 77
    },
    {
        "date": 51.76,
        "onset": 78
    },
    {
        "date": 52.42,
        "onset": 79
    },
    {
        "date": 53.10,
        "onset": 80
    },
    {
        "date": 53.77,
        "onset": 81
    },
    {
        "date": 54.42,
        "onset": 82
    },
    {
        "date": 55.08,
        "onset": 83
    },
    {
        "date": 55.74,
        "onset": 84
    },
    {
        "date": 56.39,
        "onset": 85
    },
    {
        "date": 57.03,
        "onset": 86
    },
    {
        "date": 57.70,
        "onset": 87
    },
    {
        "date": 58.35,
        "onset": 88
    },
    {
        "date": 59.02,
        "onset": 89
    },
    {
        "date": 59.65,
        "onset": 90
    },
    {
        "date": 60.32,
        "onset": 91
    },
    {
        "date": 60.97,
        "onset": 92
    },
    {
        "date": 61.64,
        "onset": 93
    },
    {
        "date": 62.31,
        "onset": 94
    },
    {
        "date": 62.93,
        "onset": 95
    },
    {
        "date": 63.56,
        "onset": 96
    },
    {
        "date": 64.24,
        "onset": 97
    },
    {
        "date": 64.88,
        "onset": 98
    },
    {
        "date": 65.52,
        "onset": 99
    },
    {
        "date": 66.19,
        "onset": 100
    },
    {
        "date": 66.85,
        "onset": 101
    },
    {
        "date": 67.53,
        "onset": 102
    },
    {
        "date": 68.19,
        "onset": 103
    },
    {
        "date": 68.84,
        "onset": 104
    },
    {
        "date": 69.50,
        "onset": 105
    },
    {
        "date": 70.13,
        "onset": 106
    },
    {
        "date": 70.80,
        "onset": 107
    },
    {
        "date": 71.43,
        "onset": 108
    },
    {
        "date": 72.11,
        "onset": 109
    },
    {
        "date": 72.77,
        "onset": 110
    },
    {
        "date": 73.41,
        "onset": 111
    },
    {
        "date": 74.08,
        "onset": 112
    },
    {
        "date": 74.75,
        "onset": 113
    },
    {
        "date": 75.42,
        "onset": 114
    },
    {
        "date": 76.12,
        "onset": 115
    },
    {
        "date": 76.79,
        "onset": 116
    },
    {
        "date": 77.45,
        "onset": 117
    },
    {
        "date": 78.09,
        "onset": 118
    },
    {
        "date": 78.78,
        "onset": 119
    },
    {
        "date": 79.46,
        "onset": 120
    },
    {
        "date": 80.17,
        "onset": 121
    },
    {
        "date": 80.84,
        "onset": 122
    },
    {
        "date": 81.50,
        "onset": 123
    },
    {
        "date": 82.15,
        "onset": 124
    },
    {
        "date": 82.80,
        "onset": 125
    },
    {
        "date": 83.46,
        "onset": 126
    },
    {
        "date": 84.15,
        "onset": 127
    },
    {
        "date": 84.83,
        "onset": 128
    },
    {
        "date": 85.56,
        "onset": 129
    },
    {
        "date": 86.22,
        "onset": 130
    },
    {
        "date": 86.86,
        "onset": 131
    },
    {
        "date": 87.51,
        "onset": 132
    },
    {
        "date": 88.16,
        "onset": 133
    },
    {
        "date": 88.84,
        "onset": 134
    },
    {
        "date": 89.60,
        "onset": 135
    },
    {
        "date": 90.35,
        "onset": 136
    },
    {
        "date": 91.09,
        "onset": 137
    },
    {
        "date": 91.86,
        "onset": 138
    },
    {
        "date": 92.56,
        "onset": 139
    },
    {
        "date": 93.17,
        "onset": 140
    },
    {
        "date": 93.82,
        "onset": 141
    },
    {
        "date": 94.55,
        "onset": 142
    },
    {
        "date": 95.32,
        "onset": 143
    },
    {
        "date": 96.03,
        "onset": 144
    },
    {
        "date": 96.69,
        "onset": 145
    },
    {
        "date": 97.46,
        "onset": 146
    },
    {
        "date": 98.33,
        "onset": 147
    }
]