[
  {
    "onset": 0,
    "date": 0.78
  },
  {
    "onset": 3,
    "date": 2.42
  },
  {
    "onset": 6,
    "date": 4.35
  },
  {
    "onset": 9,
    "date": 6.14
  },
  {
    "onset": 12,
    "date": 7.86
  },
  {
    "onset": 15,
    "date": 9.62
  },
  {
    "onset": 18,
    "date": 11.33
  },
  {
    "onset": 21,
    "date": 12.96
  },
  {
    "onset": 24,
    "date": 14.74
  },
  {
    "onset": 27,
    "date": 16.45
  },
  {
    "onset": 30,
    "date": 18.14
  },
  {
    "onset": 33,
    "date": 19.99
  },
  {
    "onset": 36,
    "date": 21.81
  },
  {
    "onset": 39,
    "date": 23.48
  },
  {
    "onset": 42,
    "date": 25.19
  },
  {
    "onset": 45,
    "date": 26.90
  },
  {
    "onset": 48,
    "date": 28.64
  },
  {
    "onset": 51,
    "date": 30.35
  },
  {
    "onset": 54,
    "date": 32.00
  },
  {
    "onset": 57,
    "date": 33.71
  },
  {
    "onset": 60,
    "date": 35.52
  },
  {
    "onset": 63,
    "date": 37.26
  },
  {
    "onset": 66,
    "date": 39.00
  },
  {
    "onset": 69,
    "date": 40.63
  },
  {
    "onset": 72,
    "date": 42.45
  },
  {
    "onset": 75,
    "date": 44.15
  },
  {
    "onset": 78,
    "date": 45.85
  },
  {
    "onset": 81,
    "date": 47.56
  },
  {
    "onset": 84,
    "date": 49.43
  },
  {
    "onset": 87,
    "date": 51.05
  },
  {
    "onset": 90,
    "date": 52.72
  },
  {
    "onset": 93,
    "date": 54.42
  },
  {
    "onset": 96,
    "date": 56.12
  },
  {
    "onset": 99,
    "date": 57.66
  },
  {
    "onset": 102,
    "date": 59.40
  },
  {
    "onset": 105,
    "date": 61.02
  },
  {
    "onset": 108,
    "date": 62.69
  },
  {
    "onset": 111,
    "date": 64.39
  },
  {
    "onset": 114,
    "date": 66.02
  },
  {
    "onset": 117,
    "date": 67.68
  },
  {
    "onset": 120,
    "date": 69.37
  },
  {
    "onset": 123,
    "date": 71.13
  },
  {
    "onset": 126,
    "date": 72.82
  },
  {
    "onset": 129,
    "date": 74.49
  },
  {
    "onset": 132,
    "date": 76.17
  },
  {
    "onset": 135,
    "date": 77.89
  },
  {
    "onset": 138,
    "date": 79.56
  },
  {
    "onset": 141,
    "date": 81.35
  },
  {
    "onset": 144,
    "date": 83.03
  },
  {
    "onset": 147,
    "date": 84.74
  },
  {
    "onset": 150,
    "date": 86.39
  },
  {
    "onset": 153,
    "date": 88.10
  },
  {
    "onset": 156,
    "date": 89.94
  },
  {
    "onset": 159,
    "date": 91.83
  },
  {
    "onset": 162,
    "date": 93.50
  },
  {
    "onset": 165,
    "date": 95.23
  },
  {
    "onset": 168,
    "date": 96.87
  },
  {
    "onset": 171,
    "date": 98.67
  },
  {
    "onset": 174,
    "date": 100.36
  },
  {
    "onset": 177,
    "date": 101.99
  },
  {
    "onset": 180,
    "date": 103.86
  },
  {
    "onset": 183,
    "date": 105.64
  },
  {
    "onset": 186,
    "date": 107.41
  },
  {
    "onset": 189,
    "date": 109.28
  },
  {
    "onset": 192,
    "date": 111.15
  },
  {
    "onset": 195,
    "date": 112.58
  },
  {
    "onset": 198,
    "date": 114.25
  },
  {
    "onset": 201,
    "date": 115.94
  },
  {
    "onset": 204,
    "date": 117.69
  },
  {
    "onset": 207,
    "date": 119.51
  },
  {
    "onset": 210,
    "date": 120.97
  },
  {
    "onset": 213,
    "date": 121.18
  },
  {
    "onset": 216,
    "date": 123.16
  },
  {
    "onset": 219,
    "date": 126.16
  },
  {
    "onset": 222,
    "date": 128.09
  },
  {
    "onset": 225,
    "date": 129.73
  },
  {
    "onset": 228,
    "date": 131.53
  },
  {
    "onset": 231,
    "date": 133.33
  },
  {
    "onset": 234,
    "date": 135.16
  },
  {
    "onset": 237,
    "date": 136.95
  },
  {
    "onset": 240,
    "date": 138.72
  },
  {
    "onset": 243,
    "date": 140.59
  },
  {
    "onset": 246,
    "date": 142.47
  },
  {
    "onset": 249,
    "date": 144.62
  },
  {
    "onset": 252,
    "date": 146.55
  },
  {
    "onset": 255,
    "date": 148.64
  },
  {
    "onset": 519,
    "date": 150.28
  }
]