[
  {
    "onset": 0,
    "date": 133.54
  },
  {
    "onset": 2.75,
    "date": 137.06
  },
  {
    "onset": 6.5,
    "date": 141.23
  },
  {
    "onset": 24.5,
    "date": 162.35
  },
  {
    "onset": 32.5,
    "date": 172.04
  },
  {
    "onset": 38.5,
    "date": 179.11
  },
  {
    "onset": 40,
    "date": 180.90
  },
  {
    "onset": 44.5,
    "date": 186.25
  },
  {
    "onset": 51.75,
    "date": 195.02
  },
  {
    "onset": 52.5,
    "date": 196.10
  },
  {
    "onset": 56.5,
    "date": 201.21
  },
  {
    "onset": 58.5,
    "date": 203.48
  },
  {
    "onset": 74,
    "date": 222.07
  },
  {
    "onset": 81.75,
    "date": 231.72
  },
  {
    "onset": 89,
    "date": 241.19
  },
  {
    "onset": 91,
    "date": 243.64
  },
  {
    "onset": 92.5,
    "date": 246.19
  },
  {
    "onset": 94.75,
    "date": 248.99
  },
  {
    "onset": 102.25,
    "date": 257.95
  },
  {
    "onset": 103.75,
    "date": 259.60
  },
  {
    "onset": 105,
    "date": 261.18
  },
  {
    "onset": 105.75,
    "date": 262.18
  },
  {
    "onset": 106,
    "date": 262.93
  }
]