[
  {
    "onset": 0,
    "date": 0.47
  },
  {
    "onset": 4,
    "date": 2.21
  },
  {
    "onset": 8,
    "date": 3.82
  },
  {
    "onset": 12,
    "date": 5.42
  },
  {
    "onset": 16,
    "date": 7.12
  },
  {
    "onset": 20,
    "date": 8.69
  },
  {
    "onset": 24,
    "date": 10.27
  },
  {
    "onset": 28,
    "date": 11.91
  },
  {
    "onset": 32,
    "date": 13.44
  },
  {
    "onset": 36,
    "date": 14.89
  },
  {
    "onset": 40,
    "date": 16.37
  },
  {
    "onset": 44,
    "date": 17.96
  },
  {
    "onset": 48,
    "date": 19.49
  },
  {
    "onset": 52,
    "date": 20.99
  },
  {
    "onset": 56,
    "date": 22.49
  },
  {
    "onset": 60,
    "date": 24.06
  },
  {
    "onset": 64,
    "date": 25.74
  },
  {
    "onset": 68,
    "date": 27.34
  },
  {
    "onset": 72,
    "date": 29.06
  },
  {
    "onset": 76,
    "date": 30.41
  },
  {
    "onset": 80,
    "date": 31.91
  },
  {
    "onset": 84,
    "date": 33.49
  },
  {
    "onset": 88,
    "date": 34.94
  },
  {
    "onset": 92,
    "date": 36.44
  },
  {
    "onset": 96,
    "date": 38.22
  },
  {
    "onset": 100,
    "date": 39.81
  },
  {
    "onset": 104,
    "date": 41.42
  },
  {
    "onset": 108,
    "date": 43.02
  },
  {
    "onset": 112,
    "date": 44.69
  },
  {
    "onset": 116,
    "date": 46.29
  },
  {
    "onset": 120,
    "date": 47.92
  },
  {
    "onset": 124,
    "date": 49.51
  },
  {
    "onset": 128,
    "date": 51.04
  },
  {
    "onset": 132,
    "date": 52.77
  },
  {
    "onset": 136,
    "date": 54.66
  },
  {
    "onset": 140,
    "date": 56.19
  },
  {
    "onset": 144,
    "date": 57.83
  },
  {
    "onset": 148,
    "date": 59.51
  },
  {
    "onset": 152,
    "date": 61.09
  },
  {
    "onset": 156,
    "date": 63.03
  },
  {
    "onset": 160,
    "date": 64.71
  },
  {
    "onset": 164,
    "date": 66.31
  },
  {
    "onset": 168,
    "date": 67.96
  },
  {
    "onset": 172,
    "date": 69.63
  },
  {
    "onset": 176,
    "date": 71.14
  },
  {
    "onset": 180,
    "date": 72.76
  },
  {
    "onset": 184,
    "date": 74.39
  },
  {
    "onset": 188,
    "date": 76.04
  },
  {
    "onset": 192,
    "date": 77.54
  },
  {
    "onset": 196,
    "date": 79.13
  },
  {
    "onset": 200,
    "date": 80.64
  },
  {
    "onset": 204,
    "date": 82.14
  },
  {
    "onset": 208,
    "date": 83.74
  },
  {
    "onset": 212,
    "date": 85.28
  },
  {
    "onset": 216,
    "date": 86.88
  },
  {
    "onset": 220,
    "date": 88.41
  },
  {
    "onset": 224,
    "date": 90.06
  },
  {
    "onset": 228,
    "date": 91.68
  },
  {
    "onset": 232,
    "date": 93.41
  },
  {
    "onset": 236,
    "date": 94.74
  },
  {
    "onset": 240,
    "date": 96.26
  },
  {
    "onset": 244,
    "date": 97.94
  },
  {
    "onset": 248,
    "date": 99.68
  },
  {
    "onset": 252,
    "date": 101.28
  },
  {
    "onset": 256,
    "date": 103.04
  },
  {
    "onset": 260,
    "date": 104.66
  },
  {
    "onset": 264,
    "date": 106.31
  },
  {
    "onset": 268,
    "date": 107.88
  },
  {
    "onset": 272,
    "date": 109.41
  },
  {
    "onset": 276,
    "date": 111.08
  },
  {
    "onset": 280,
    "date": 112.81
  },
  {
    "onset": 284,
    "date": 114.34
  },
  {
    "onset": 288,
    "date": 116.13
  },
  {
    "onset": 292,
    "date": 117.78
  },
  {
    "onset": 304,
    "date": 122.73
  },
  {
    "onset": 308,
    "date": 124.21
  },
  {
    "onset": 312,
    "date": 125.80
  },
  {
    "onset": 316,
    "date": 127.28
  },
  {
    "onset": 320,
    "date": 128.91
  },
  {
    "onset": 324,
    "date": 130.48
  },
  {
    "onset": 328,
    "date": 132.05
  },
  {
    "onset": 332,
    "date": 133.61
  },
  {
    "onset": 336,
    "date": 135.38
  },
  {
    "onset": 340,
    "date": 137.06
  },
  {
    "onset": 344,
    "date": 138.56
  },
  {
    "onset": 348,
    "date": 140.36
  },
  {
    "onset": 352,
    "date": 141.98
  },
  {
    "onset": 356,
    "date": 143.90
  },
  {
    "onset": 360,
    "date": 145.65
  },
  {
    "onset": 364,
    "date": 147.46
  },
  {
    "onset": 368,
    "date": 149.36
  },
  {
    "onset": 372,
    "date": 151.08
  },
  {
    "onset": 376,
    "date": 152.68
  },
  {
    "onset": 380,
    "date": 154.38
  },
  {
    "onset": 384,
    "date": 156.15
  },
  {
    "onset": 388,
    "date": 157.95
  },
  {
    "onset": 392,
    "date": 159.50
  },
  {
    "onset": 396,
    "date": 161.01
  },
  {
    "onset": 400,
    "date": 162.72
  },
  {
    "onset": 404,
    "date": 164.21
  },
  {
    "onset": 408,
    "date": 166.00
  },
  {
    "onset": 412,
    "date": 167.60
  },
  {
    "onset": 416,
    "date": 169.25
  },
  {
    "onset": 420,
    "date": 170.75
  },
  {
    "onset": 424,
    "date": 172.31
  },
  {
    "onset": 428,
    "date": 173.95
  },
  {
    "onset": 432,
    "date": 175.50
  },
  {
    "onset": 436,
    "date": 177.13
  },
  {
    "onset": 440,
    "date": 178.85
  },
  {
    "onset": 444,
    "date": 180.43
  },
  {
    "onset": 448,
    "date": 182.20
  },
  {
    "onset": 452,
    "date": 183.86
  },
  {
    "onset": 456,
    "date": 185.45
  },
  {
    "onset": 460,
    "date": 187.02
  },
  {
    "onset": 464,
    "date": 188.63
  },
  {
    "onset": 468,
    "date": 190.28
  },
  {
    "onset": 472,
    "date": 191.88
  },
  {
    "onset": 476,
    "date": 193.38
  },
  {
    "onset": 480,
    "date": 195.02
  },
  {
    "onset": 484,
    "date": 196.53
  },
  {
    "onset": 488,
    "date": 198.15
  },
  {
    "onset": 492,
    "date": 199.67
  },
  {
    "onset": 496,
    "date": 201.17
  },
  {
    "onset": 500,
    "date": 202.73
  },
  {
    "onset": 504,
    "date": 204.35
  },
  {
    "onset": 508,
    "date": 206.20
  },
  {
    "onset": 512,
    "date": 207.58
  },
  {
    "onset": 516,
    "date": 209.08
  },
  {
    "onset": 520,
    "date": 210.62
  },
  {
    "onset": 524,
    "date": 212.13
  },
  {
    "onset": 528,
    "date": 213.70
  },
  {
    "onset": 532,
    "date": 215.30
  },
  {
    "onset": 536,
    "date": 216.92
  },
  {
    "onset": 540,
    "date": 218.48
  },
  {
    "onset": 544,
    "date": 220.22
  },
  {
    "onset": 548,
    "date": 221.95
  },
  {
    "onset": 552,
    "date": 223.53
  },
  {
    "onset": 556,
    "date": 225.05
  },
  {
    "onset": 560,
    "date": 226.67
  },
  {
    "onset": 564,
    "date": 228.17
  },
  {
    "onset": 568,
    "date": 229.85
  },
  {
    "onset": 572,
    "date": 231.47
  },
  {
    "onset": 576,
    "date": 233.00
  },
  {
    "onset": 580,
    "date": 234.45
  },
  {
    "onset": 584,
    "date": 235.92
  },
  {
    "onset": 588,
    "date": 237.38
  },
  {
    "onset": 592,
    "date": 239.17
  },
  {
    "onset": 596,
    "date": 240.65
  },
  {
    "onset": 600,
    "date": 242.38
  },
  {
    "onset": 604,
    "date": 243.93
  },
  {
    "onset": 608,
    "date": 245.62
  },
  {
    "onset": 612,
    "date": 247.23
  },
  {
    "onset": 616,
    "date": 248.68
  },
  {
    "onset": 620,
    "date": 251.20
  },
  {
    "onset": 624,
    "date": 251.84
  },
  {
    "onset": 628,
    "date": 253.40
  },
  {
    "onset": 632,
    "date": 255.05
  },
  {
    "onset": 636,
    "date": 256.62
  },
  {
    "onset": 640,
    "date": 258.33
  },
  {
    "onset": 644,
    "date": 259.97
  },
  {
    "onset": 648,
    "date": 261.75
  },
  {
    "onset": 652,
    "date": 263.60
  },
  {
    "onset": 656,
    "date": 265.23
  },
  {
    "onset": 660,
    "date": 266.97
  },
  {
    "onset": 664,
    "date": 268.60
  },
  {
    "onset": 668,
    "date": 270.22
  },
  {
    "onset": 672,
    "date": 271.85
  },
  {
    "onset": 676,
    "date": 273.42
  },
  {
    "onset": 680,
    "date": 275.46
  },
  {
    "onset": 684,
    "date": 278.58
  },
  {
    "onset": 688,
    "date": 280.28
  },
  {
    "onset": 692,
    "date": 282.23
  },
  {
    "onset": 696,
    "date": 283.96
  },
  {
    "onset": 700,
    "date": 285.40
  },
  {
    "onset": 704,
    "date": 287.15
  },
  {
    "onset": 708,
    "date": 288.66
  },
  {
    "onset": 712,
    "date": 290.44
  },
  {
    "onset": 716,
    "date": 291.98
  },
  {
    "onset": 720,
    "date": 293.58
  },
  {
    "onset": 724,
    "date": 295.15
  },
  {
    "onset": 728,
    "date": 296.78
  },
  {
    "onset": 732,
    "date": 298.26
  },
  {
    "onset": 736,
    "date": 300.26
  },
  {
    "onset": 740,
    "date": 301.44
  },
  {
    "onset": 744,
    "date": 303.14
  },
  {
    "onset": 748,
    "date": 304.60
  },
  {
    "onset": 752,
    "date": 306.10
  },
  {
    "onset": 756,
    "date": 307.59
  },
  {
    "onset": 760,
    "date": 309.10
  },
  {
    "onset": 764,
    "date": 310.55
  },
  {
    "onset": 768,
    "date": 312.02
  },
  {
    "onset": 772,
    "date": 313.75
  },
  {
    "onset": 776,
    "date": 315.25
  },
  {
    "onset": 780,
    "date": 316.75
  },
  {
    "onset": 784,
    "date": 318.39
  },
  {
    "onset": 788,
    "date": 320.77
  },
  {
    "onset": 794,
    "date": 324.04
  },
  {
    "onset": 796,
    "date": 325.47
  },
  {
    "onset": 798.375,
    "date": 329.20
  },
  {
    "onset": 802,
    "date": 330.56
  },
  {
    "onset": 802.5,
    "date": 331.36
  },
  {
    "onset": 804,
    "date": 332.39
  },
  {
    "onset": 814,
    "date": 337.71
  },
  {
    "onset": 818,
    "date": 340.25
  },
  {
    "onset": 820,
    "date": 341.75
  },
  {
    "onset": 820.5,
    "date": 343.66
  },
  {
    "onset": 821,
    "date": 346.60
  },
  {
    "onset": 825,
    "date": 348.34
  },
  {
    "onset": 829,
    "date": 350.01
  },
  {
    "onset": 833,
    "date": 351.36
  },
  {
    "onset": 837,
    "date": 352.87
  },
  {
    "onset": 843,
    "date": 355.33
  },
  {
    "onset": 845,
    "date": 355.88
  },
  {
    "onset": 849,
    "date": 357.39
  },
  {
    "onset": 853,
    "date": 358.90
  },
  {
    "onset": 857,
    "date": 360.48
  },
  {
    "onset": 861,
    "date": 361.99
  },
  {
    "onset": 885,
    "date": 372.07
  },
  {
    "onset": 889,
    "date": 373.66
  },
  {
    "onset": 897,
    "date": 376.68
  },
  {
    "onset": 905,
    "date": 380.09
  },
  {
    "onset": 913,
    "date": 383.26
  },
  {
    "onset": 917,
    "date": 385.33
  },
  {
    "onset": 921,
    "date": 387.47
  }
]