[
  {
    "onset": 0,
    "date": 0
  },
  {
    "onset": 2,
    "date": 0.75
  },
  {
    "onset": 3,
    "date": 1.67
  },
  {
    "onset": 5,
    "date": 2.38
  },
  {
    "onset": 6,
    "date": 2.97
  },
  {
    "onset": 8,
    "date": 3.90
  },
  {
    "onset": 15,
    "date": 6.52
  },
  {
    "onset": 18,
    "date": 7.69
  },
  {
    "onset": 20,
    "date": 8.54
  },
  {
    "onset": 21,
    "date": 9.04
  },
  {
    "onset": 23,
    "date": 9.90
  },
  {
    "onset": 24,
    "date": 10.45
  },
  {
    "onset": 26,
    "date": 11.48
  },
  {
    "onset": 33,
    "date": 14.21
  },
  {
    "onset": 36,
    "date": 15.09
  },
  {
    "onset": 38,
    "date": 16.07
  },
  {
    "onset": 39,
    "date": 16.45
  },
  {
    "onset": 42,
    "date": 17.56
  },
  {
    "onset": 44,
    "date": 18.29
  },
  {
    "onset": 48,
    "date": 20.05
  },
  {
    "onset": 51,
    "date": 21.36
  },
  {
    "onset": 61,
    "date": 25.05
  },
  {
    "onset": 64,
    "date": 26.14
  },
  {
    "onset": 65,
    "date": 26.48
  },
  {
    "onset": 66,
    "date": 26.85
  },
  {
    "onset": 72,
    "date": 29.68
  },
  {
    "onset": 78,
    "date": 31.69
  },
  {
    "onset": 81,
    "date": 64.80
  },
  {
    "onset": 87,
    "date": 67.24
  },
  {
    "onset": 93,
    "date": 69.71
  },
  {
    "onset": 102,
    "date": 73.23
  },
  {
    "onset": 105,
    "date": 74.93
  },
  {
    "onset": 108,
    "date": 75.85
  },
  {
    "onset": 110,
    "date": 76.76
  },
  {
    "onset": 111,
    "date": 77.32
  },
  {
    "onset": 113,
    "date": 78.21
  },
  {
    "onset": 114,
    "date": 78.73
  },
  {
    "onset": 116,
    "date": 79.59
  },
  {
    "onset": 123,
    "date": 82.41
  },
  {
    "onset": 127,
    "date": 84.03
  },
  {
    "onset": 128,
    "date": 84.37
  },
  {
    "onset": 129,
    "date": 84.91
  },
  {
    "onset": 131,
    "date": 85.98
  },
  {
    "onset": 132,
    "date": 86.28
  },
  {
    "onset": 134,
    "date": 87.14
  },
  {
    "onset": 135,
    "date": 87.74
  },
  {
    "onset": 137,
    "date": 89.12
  },
  {
    "onset": 138,
    "date": 89.61
  },
  {
    "onset": 140,
    "date": 90.61
  },
  {
    "onset": 144,
    "date": 92.01
  },
  {
    "onset": 146,
    "date": 92.46
  },
  {
    "onset": 147,
    "date": 92.82
  },
  {
    "onset": 150,
    "date": 94.02
  },
  {
    "onset": 153,
    "date": 95.24
  },
  {
    "onset": 156,
    "date": 96.41
  },
  {
    "onset": 158,
    "date": 97.03
  },
  {
    "onset": 161,
    "date": 98.33
  },
  {
    "onset": 162,
    "date": 98.80
  },
  {
    "onset": 163.5,
    "date": 99.34
  },
  {
    "onset": 165,
    "date": 100.07
  },
  {
    "onset": 168,
    "date": 100.87
  },
  {
    "onset": 171,
    "date": 102.02
  },
  {
    "onset": 180,
    "date": 105.72
  },
  {
    "onset": 183,
    "date": 106.78
  },
  {
    "onset": 186,
    "date": 108.08
  },
  {
    "onset": 189,
    "date": 109.37
  },
  {
    "onset": 192,
    "date": 110.39
  },
  {
    "onset": 198,
    "date": 112.73
  },
  {
    "onset": 201,
    "date": 113.96
  },
  {
    "onset": 204,
    "date": 115.08
  },
  {
    "onset": 210,
    "date": 117.51
  },
  {
    "onset": 212,
    "date": 173.02
  },
  {
    "onset": 216,
    "date": 174.82
  },
  {
    "onset": 219,
    "date": 176.37
  },
  {
    "onset": 222,
    "date": 177.58
  },
  {
    "onset": 225,
    "date": 178.83
  },
  {
    "onset": 228,
    "date": 180.09
  },
  {
    "onset": 234,
    "date": 182.76
  },
  {
    "onset": 237,
    "date": 184.23
  },
  {
    "onset": 240,
    "date": 185.85
  },
  {
    "onset": 243,
    "date": 187.46
  },
  {
    "onset": 246,
    "date": 188.87
  },
  {
    "onset": 252,
    "date": 190.58
  },
  {
    "onset": 254,
    "date": 211.24
  },
  {
    "onset": 258,
    "date": 213.10
  },
  {
    "onset": 261,
    "date": 214.52
  },
  {
    "onset": 264,
    "date": 216.06
  },
  {
    "onset": 270,
    "date": 218.78
  },
  {
    "onset": 273,
    "date": 220.09
  },
  {
    "onset": 276,
    "date": 221.45
  },
  {
    "onset": 279,
    "date": 222.88
  },
  {
    "onset": 294,
    "date": 229.27
  },
  {
    "onset": 299.5,
    "date": 232.20
  },
  {
    "onset": 300,
    "date": 232.49
  },
  {
    "onset": 312,
    "date": 238.05
  },
  {
    "onset": 313,
    "date": 356.30
  }
]