[
  {
    "onset": 0,
    "date": 0.64
  },
  {
    "onset": 2,
    "date": 1.30
  },
  {
    "onset": 3,
    "date": 1.98
  },
  {
    "onset": 6,
    "date": 2.97
  },
  {
    "onset": 9,
    "date": 4.07
  },
  {
    "onset": 12,
    "date": 5.16
  },
  {
    "onset": 15,
    "date": 6.46
  },
  {
    "onset": 18,
    "date": 7.64
  },
  {
    "onset": 21,
    "date": 8.86
  },
  {
    "onset": 24,
    "date": 10.10
  },
  {
    "onset": 27,
    "date": 11.35
  },
  {
    "onset": 30,
    "date": 12.51
  },
  {
    "onset": 33,
    "date": 26.49
  },
  {
    "onset": 36,
    "date": 27.60
  },
  {
    "onset": 39,
    "date": 29.02
  },
  {
    "onset": 42,
    "date": 30.17
  },
  {
    "onset": 45,
    "date": 31.40
  },
  {
    "onset": 48,
    "date": 32.62
  },
  {
    "onset": 51,
    "date": 33.71
  },
  {
    "onset": 54,
    "date": 34.90
  },
  {
    "onset": 57,
    "date": 36.00
  },
  {
    "onset": 60,
    "date": 37.14
  },
  {
    "onset": 63,
    "date": 38.35
  },
  {
    "onset": 66,
    "date": 39.52
  },
  {
    "onset": 69,
    "date": 40.86
  },
  {
    "onset": 72,
    "date": 42.00
  },
  {
    "onset": 75,
    "date": 43.18
  },
  {
    "onset": 78,
    "date": 44.35
  },
  {
    "onset": 81,
    "date": 45.61
  },
  {
    "onset": 84,
    "date": 46.70
  },
  {
    "onset": 87,
    "date": 48.06
  },
  {
    "onset": 90,
    "date": 49.42
  },
  {
    "onset": 93,
    "date": 50.77
  },
  {
    "onset": 96,
    "date": 51.96
  },
  {
    "onset": 99,
    "date": 53.06
  },
  {
    "onset": 102,
    "date": 54.34
  },
  {
    "onset": 105,
    "date": 55.54
  },
  {
    "onset": 108,
    "date": 56.77
  },
  {
    "onset": 111,
    "date": 57.99
  },
  {
    "onset": 114,
    "date": 59.18
  },
  {
    "onset": 117,
    "date": 60.36
  },
  {
    "onset": 119,
    "date": 100.59
  },
  {
    "onset": 123,
    "date": 102.13
  },
  {
    "onset": 126,
    "date": 103.58
  },
  {
    "onset": 129,
    "date": 104.93
  },
  {
    "onset": 132,
    "date": 106.82
  },
  {
    "onset": 135,
    "date": 108.34
  },
  {
    "onset": 138,
    "date": 109.81
  },
  {
    "onset": 141,
    "date": 111.30
  },
  {
    "onset": 143,
    "date": 126.22
  },
  {
    "onset": 144,
    "date": 126.94
  },
  {
    "onset": 147,
    "date": 128.57
  },
  {
    "onset": 150,
    "date": 130.15
  },
  {
    "onset": 153,
    "date": 131.65
  },
  {
    "onset": 156,
    "date": 133.25
  },
  {
    "onset": 159,
    "date": 134.82
  },
  {
    "onset": 162,
    "date": 136.45
  },
  {
    "onset": 165,
    "date": 137.77
  },
  {
    "onset": 168,
    "date": 139.95
  },
  {
    "onset": 171,
    "date": 141.72
  },
  {
    "onset": 174,
    "date": 143.08
  },
  {
    "onset": 177,
    "date": 144.58
  },
  {
    "onset": 180,
    "date": 146.33
  },
  {
    "onset": 183,
    "date": 147.98
  },
  {
    "onset": 186,
    "date": 149.57
  },
  {
    "onset": 189,
    "date": 151.34
  },
  {
    "onset": 191,
    "date": 152.60
  }
]