[
  {
    "onset": 0,
    "date": 0.56
  },
  {
    "onset": 2,
    "date": 1.62
  },
  {
    "onset": 4,
    "date": 2.63
  },
  {
    "onset": 6,
    "date": 3.61
  },
  {
    "onset": 8,
    "date": 4.56
  },
  {
    "onset": 10,
    "date": 5.56
  },
  {
    "onset": 12,
    "date": 6.56
  },
  {
    "onset": 14,
    "date": 7.54
  },
  {
    "onset": 16,
    "date": 8.51
  },
  {
    "onset": 18,
    "date": 9.39
  },
  {
    "onset": 20,
    "date": 10.36
  },
  {
    "onset": 22,
    "date": 11.32
  },
  {
    "onset": 24,
    "date": 12.26
  },
  {
    "onset": 26,
    "date": 13.21
  },
  {
    "onset": 28,
    "date": 14.22
  },
  {
    "onset": 30,
    "date": 15.17
  },
  {
    "onset": 32,
    "date": 16.07
  },
  {
    "onset": 34,
    "date": 17.06
  },
  {
    "onset": 36,
    "date": 17.91
  },
  {
    "onset": 38,
    "date": 18.86
  },
  {
    "onset": 40,
    "date": 19.79
  },
  {
    "onset": 42,
    "date": 20.76
  },
  {
    "onset": 44,
    "date": 21.72
  },
  {
    "onset": 46,
    "date": 22.72
  },
  {
    "onset": 48,
    "date": 23.69
  },
  {
    "onset": 50,
    "date": 24.72
  },
  {
    "onset": 52,
    "date": 25.69
  },
  {
    "onset": 54,
    "date": 26.67
  },
  {
    "onset": 56,
    "date": 27.62
  },
  {
    "onset": 58,
    "date": 28.57
  },
  {
    "onset": 60,
    "date": 29.54
  },
  {
    "onset": 62,
    "date": 30.47
  },
  {
    "onset": 64,
    "date": 31.46
  },
  {
    "onset": 66,
    "date": 32.41
  },
  {
    "onset": 68,
    "date": 33.32
  },
  {
    "onset": 70,
    "date": 34.22
  },
  {
    "onset": 72,
    "date": 35.09
  },
  {
    "onset": 74,
    "date": 36.04
  },
  {
    "onset": 76,
    "date": 37.01
  },
  {
    "onset": 78,
    "date": 37.96
  },
  {
    "onset": 80,
    "date": 38.84
  },
  {
    "onset": 82,
    "date": 39.91
  },
  {
    "onset": 84,
    "date": 40.82
  },
  {
    "onset": 86,
    "date": 41.83
  },
  {
    "onset": 88,
    "date": 42.79
  },
  {
    "onset": 90,
    "date": 43.72
  },
  {
    "onset": 92,
    "date": 44.74
  },
  {
    "onset": 94,
    "date": 45.73
  },
  {
    "onset": 96,
    "date": 46.78
  },
  {
    "onset": 98,
    "date": 47.64
  },
  {
    "onset": 100,
    "date": 48.59
  },
  {
    "onset": 102,
    "date": 49.59
  },
  {
    "onset": 104,
    "date": 50.48
  },
  {
    "onset": 106,
    "date": 51.53
  },
  {
    "onset": 108,
    "date": 52.44
  },
  {
    "onset": 110,
    "date": 53.46
  },
  {
    "onset": 112,
    "date": 108.09
  },
  {
    "onset": 114,
    "date": 109.14
  },
  {
    "onset": 116,
    "date": 110.03
  },
  {
    "onset": 118,
    "date": 110.98
  },
  {
    "onset": 120,
    "date": 111.91
  },
  {
    "onset": 122,
    "date": 112.83
  },
  {
    "onset": 124,
    "date": 113.80
  },
  {
    "onset": 126,
    "date": 114.75
  },
  {
    "onset": 128,
    "date": 115.70
  },
  {
    "onset": 130,
    "date": 116.65
  },
  {
    "onset": 132,
    "date": 117.53
  },
  {
    "onset": 134,
    "date": 118.53
  },
  {
    "onset": 136,
    "date": 119.40
  },
  {
    "onset": 138,
    "date": 120.35
  },
  {
    "onset": 140,
    "date": 121.28
  },
  {
    "onset": 142,
    "date": 122.28
  },
  {
    "onset": 144,
    "date": 123.21
  },
  {
    "onset": 146,
    "date": 124.18
  },
  {
    "onset": 148,
    "date": 125.16
  },
  {
    "onset": 150,
    "date": 126.18
  },
  {
    "onset": 152,
    "date": 127.08
  },
  {
    "onset": 154,
    "date": 128.06
  },
  {
    "onset": 156,
    "date": 129.06
  },
  {
    "onset": 158,
    "date": 130.10
  },
  {
    "onset": 160,
    "date": 131.01
  },
  {
    "onset": 162,
    "date": 132.08
  },
  {
    "onset": 164,
    "date": 133.13
  },
  {
    "onset": 166,
    "date": 134.35
  },
  {
    "onset": 168,
    "date": 135.33
  },
  {
    "onset": 170,
    "date": 136.28
  },
  {
    "onset": 172,
    "date": 137.30
  },
  {
    "onset": 174,
    "date": 138.26
  },
  {
    "onset": 176,
    "date": 139.28
  },
  {
    "onset": 178,
    "date": 140.20
  },
  {
    "onset": 180,
    "date": 141.08
  },
  {
    "onset": 182,
    "date": 142.06
  },
  {
    "onset": 184,
    "date": 142.93
  },
  {
    "onset": 186,
    "date": 143.90
  },
  {
    "onset": 188,
    "date": 144.80
  },
  {
    "onset": 190,
    "date": 145.73
  },
  {
    "onset": 192,
    "date": 146.58
  },
  {
    "onset": 194,
    "date": 147.53
  },
  {
    "onset": 196,
    "date": 148.46
  },
  {
    "onset": 198,
    "date": 149.38
  },
  {
    "onset": 200,
    "date": 150.35
  },
  {
    "onset": 202,
    "date": 151.33
  },
  {
    "onset": 204,
    "date": 152.28
  },
  {
    "onset": 206,
    "date": 153.31
  },
  {
    "onset": 208,
    "date": 154.26
  },
  {
    "onset": 210,
    "date": 155.30
  },
  {
    "onset": 212,
    "date": 156.21
  },
  {
    "onset": 214,
    "date": 157.23
  },
  {
    "onset": 216,
    "date": 158.18
  },
  {
    "onset": 218,
    "date": 159.13
  },
  {
    "onset": 220,
    "date": 160.03
  },
  {
    "onset": 222,
    "date": 160.98
  },
  {
    "onset": 224,
    "date": 161.90
  },
  {
    "onset": 226,
    "date": 162.91
  },
  {
    "onset": 228,
    "date": 163.90
  },
  {
    "onset": 230,
    "date": 164.98
  },
  {
    "onset": 232,
    "date": 165.98
  },
  {
    "onset": 234,
    "date": 166.96
  },
  {
    "onset": 236,
    "date": 167.93
  },
  {
    "onset": 238,
    "date": 168.95
  },
  {
    "onset": 240,
    "date": 169.82
  },
  {
    "onset": 242,
    "date": 170.82
  },
  {
    "onset": 244,
    "date": 171.80
  },
  {
    "onset": 246,
    "date": 172.76
  },
  {
    "onset": 248,
    "date": 173.73
  },
  {
    "onset": 250,
    "date": 174.61
  },
  {
    "onset": 252,
    "date": 175.61
  },
  {
    "onset": 254,
    "date": 176.60
  },
  {
    "onset": 256,
    "date": 177.48
  },
  {
    "onset": 258,
    "date": 178.40
  },
  {
    "onset": 260,
    "date": 179.28
  },
  {
    "onset": 262,
    "date": 180.21
  },
  {
    "onset": 264,
    "date": 181.25
  },
  {
    "onset": 266,
    "date": 182.20
  },
  {
    "onset": 268,
    "date": 183.16
  },
  {
    "onset": 270,
    "date": 184.23
  },
  {
    "onset": 272,
    "date": 185.25
  },
  {
    "onset": 274,
    "date": 186.25
  },
  {
    "onset": 276,
    "date": 187.16
  },
  {
    "onset": 278,
    "date": 188.03
  },
  {
    "onset": 280,
    "date": 188.98
  },
  {
    "onset": 282,
    "date": 190.08
  },
  {
    "onset": 284,
    "date": 191.02
  },
  {
    "onset": 286,
    "date": 192.00
  },
  {
    "onset": 288,
    "date": 192.90
  },
  {
    "onset": 290,
    "date": 194.15
  },
  {
    "onset": 291,
    "date": 195.35
  }
]