[
  {
    "onset": 0,
    "date": 0
  },
  {
    "onset": 28,
    "date": 13.91
  },
  {
    "onset": 46,
    "date": 21.22
  },
  {
    "onset": 65,
    "date": 29.11
  },
  {
    "onset": 77,
    "date": 35.19
  },
  {
    "onset": 91,
    "date": 41.02
  },
  {
    "onset": 103,
    "date": 46.37
  },
  {
    "onset": 116,
    "date": 51.75
  },
  {
    "onset": 127,
    "date": 56.89
  },
  {
    "onset": 134,
    "date": 59.87
  },
  {
    "onset": 143,
    "date": 63.91
  },
  {
    "onset": 151,
    "date": 67.35
  },
  {
    "onset": 159,
    "date": 69.86
  },
  {
    "onset": 159.25,
    "date": 141.53
  },
  {
    "onset": 166,
    "date": 144.66
  },
  {
    "onset": 177,
    "date": 149.49
  },
  {
    "onset": 184,
    "date": 152.99
  },
  {
    "onset": 202,
    "date": 160.26
  },
  {
    "onset": 214,
    "date": 166.18
  },
  {
    "onset": 238,
    "date": 176.70
  },
  {
    "onset": 266,
    "date": 188.65
  },
  {
    "onset": 278,
    "date": 194.72
  },
  {
    "onset": 290,
    "date": 199.88
  },
  {
    "onset": 304,
    "date": 205.97
  },
  {
    "onset": 313,
    "date": 209.87
  },
  {
    "onset": 325,
    "date": 215.06
  },
  {
    "onset": 340,
    "date": 221.97
  },
  {
    "onset": 352,
    "date": 227.15
  },
  {
    "onset": 358,
    "date": 230.50
  },
  {
    "onset": 359,
    "date": 326.56
  }
]