[
  {
    "onset": 0,
    "date": 129.08
  },
  {
    "onset": 0.5,
    "date": 129.89
  },
  {
    "onset": 2,
    "date": 131.51
  },
  {
    "onset": 6,
    "date": 135.35
  },
  {
    "onset": 9,
    "date": 138.38
  },
  {
    "onset": 12,
    "date": 141.29
  },
  {
    "onset": 16,
    "date": 144.59
  },
  {
    "onset": 24,
    "date": 152.48
  },
  {
    "onset": 32,
    "date": 159.83
  },
  {
    "onset": 42,
    "date": 169.07
  },
  {
    "onset": 46,
    "date": 173.12
  },
  {
    "onset": 50,
    "date": 176.85
  },
  {
    "onset": 58,
    "date": 184.52
  },
  {
    "onset": 64,
    "date": 189.71
  },
  {
    "onset": 70,
    "date": 195.81
  },
  {
    "onset": 76.5,
    "date": 202.03
  },
  {
    "onset": 84,
    "date": 209.11
  },
  {
    "onset": 89,
    "date": 213.54
  },
  {
    "onset": 94,
    "date": 218.13
  },
  {
    "onset": 96,
    "date": 220.29
  },
  {
    "onset": 108,
    "date": 231.64
  },
  {
    "onset": 110,
    "date": 233.96
  },
  {
    "onset": 116,
    "date": 240.01
  },
  {
    "onset": 120,
    "date": 243.63
  },
  {
    "onset": 126,
    "date": 248.71
  },
  {
    "onset": 129,
    "date": 251.85
  },
  {
    "onset": 132,
    "date": 255.09
  },
  {
    "onset": 133,
    "date": 256.28
  },
  {
    "onset": 134,
    "date": 258.87
  }
]