[
  {
    "onset": 0,
    "date": 1.6002901178603806
  },
  {
    "onset": 4,
    "date": 9.100010579175803
  },
  {
    "onset": 8,
    "date": 16.182166817354293
  },
  {
    "onset": 16,
    "date": 30.946727153447124
  },
  {
    "onset": 20,
    "date": 38.24011798528655
  },
  {
    "onset": 28,
    "date": 52.91801360573377
  },
  {
    "onset": 30,
    "date": 56.61098663146911
  },
  {
    "onset": 32,
    "date": 60.07322942692655
  },
  {
    "onset": 40,
    "date": 73.93759772797736
  },
  {
    "onset": 48,
    "date": 88.4163785645575
  },
  {
    "onset": 52,
    "date": 94.9479044989005
  },
  {
    "onset": 56,
    "date": 102.41608209404494
  },
  {
    "onset": 60,
    "date": 109.65547251233502
  },
  {
    "onset": 66,
    "date": 120.2484040802742
  },
  {
    "onset": 67.75,
    "date": 123.85382045628243
  },
  {
    "onset": 72,
    "date": 132.384
  }
]