[
  {
    "onset": 0,
    "date": 0
  },
  {
    "onset": 2,
    "date": 3.20
  },
  {
    "onset": 4,
    "date": 5.73
  },
  {
    "onset": 6,
    "date": 8.92
  },
  {
    "onset": 8,
    "date": 11.25
  },
  {
    "onset": 10,
    "date": 13.87
  },
  {
    "onset": 12,
    "date": 16.34
  },
  {
    "onset": 14,
    "date": 19.15
  },
  {
    "onset": 16,
    "date": 21.47
  },
  {
    "onset": 18,
    "date": 24.09
  },
  {
    "onset": 20,
    "date": 26.49
  },
  {
    "onset": 22,
    "date": 29.38
  },
  {
    "onset": 24,
    "date": 31.52
  },
  {
    "onset": 26,
    "date": 34.14
  },
  {
    "onset": 28,
    "date": 36.61
  },
  {
    "onset": 30,
    "date": 39.11
  },
  {
    "onset": 32,
    "date": 41.84
  },
  {
    "onset": 34,
    "date": 44.52
  },
  {
    "onset": 36,
    "date": 47.19
  },
  {
    "onset": 38,
    "date": 49.89
  },
  {
    "onset": 40,
    "date": 52.51
  },
  {
    "onset": 42,
    "date": 55.06
  },
  {
    "onset": 44,
    "date": 57.58
  },
  {
    "onset": 46,
    "date": 60.16
  },
  {
    "onset": 48,
    "date": 62.69
  },
  {
    "onset": 50,
    "date": 65.26
  },
  {
    "onset": 52,
    "date": 67.79
  },
  {
    "onset": 54,
    "date": 70.51
  },
  {
    "onset": 56,
    "date": 73.19
  },
  {
    "onset": 58,
    "date": 74.60
  },
  {
    "onset": 60,
    "date": 78.46
  },
  {
    "onset": 62,
    "date": 81.10
  },
  {
    "onset": 64,
    "date": 83.76
  },
  {
    "onset": 66,
    "date": 86.36
  },
  {
    "onset": 68,
    "date": 89.01
  },
  {
    "onset": 70,
    "date": 91.78
  },
  {
    "onset": 72,
    "date": 94.45
  },
  {
    "onset": 74,
    "date": 97.10
  },
  {
    "onset": 76,
    "date": 99.80
  },
  {
    "onset": 78,
    "date": 102.50
  },
  {
    "onset": 80,
    "date": 105.17
  },
  {
    "onset": 82,
    "date": 107.93
  },
  {
    "onset": 84,
    "date": 111.06
  },
  {
    "onset": 86,
    "date": 113.98
  },
  {
    "onset": 88,
    "date": 116.68
  },
  {
    "onset": 90,
    "date": 119.15
  },
  {
    "onset": 92,
    "date": 121.71
  },
  {
    "onset": 94,
    "date": 124.56
  },
  {
    "onset": 96,
    "date": 127.59
  },
  {
    "onset": 98,
    "date": 130.51
  },
  {
    "onset": 100,
    "date": 127.59
  },
  {
    "onset": 101,
    "date": 133.71
  },
  {
    "onset": 102,
    "date": 134.68
  },
  {
    "onset": 103,
    "date": 135.01
  },
  {
    "onset": 104,
    "date": 135.45
  },
  {
    "onset": 105,
    "date": 135.83
  },
  {
    "onset": 106,
    "date": 136.28
  },
  {
    "onset": 107,
    "date": 136.71
  },
  {
    "onset": 108,
    "date": 137.16
  },
  {
    "onset": 109,
    "date": 137.60
  },
  {
    "onset": 110,
    "date": 138.00
  },
  {
    "onset": 111,
    "date": 138.46
  },
  {
    "onset": 112,
    "date": 138.91
  },
  {
    "onset": 113,
    "date": 139.35
  },
  {
    "onset": 114,
    "date": 139.75
  },
  {
    "onset": 115,
    "date": 140.20
  },
  {
    "onset": 116,
    "date": 140.62
  },
  {
    "onset": 117,
    "date": 141.05
  },
  {
    "onset": 118,
    "date": 141.51
  },
  {
    "onset": 119,
    "date": 141.93
  },
  {
    "onset": 120,
    "date": 142.33
  },
  {
    "onset": 121,
    "date": 142.75
  },
  {
    "onset": 122,
    "date": 143.13
  },
  {
    "onset": 123,
    "date": 143.58
  },
  {
    "onset": 124,
    "date": 144.03
  },
  {
    "onset": 125,
    "date": 144.45
  },
  {
    "onset": 126,
    "date": 144.86
  },
  {
    "onset": 127,
    "date": 145.26
  },
  {
    "onset": 128,
    "date": 145.68
  },
  {
    "onset": 129,
    "date": 146.08
  },
  {
    "onset": 130,
    "date": 146.53
  },
  {
    "onset": 131,
    "date": 146.93
  },
  {
    "onset": 132,
    "date": 147.33
  },
  {
    "onset": 133,
    "date": 147.78
  },
  {
    "onset": 134,
    "date": 148.18
  },
  {
    "onset": 135,
    "date": 148.63
  },
  {
    "onset": 136,
    "date": 149.06
  },
  {
    "onset": 137,
    "date": 149.48
  },
  {
    "onset": 138,
    "date": 149.90
  },
  {
    "onset": 139,
    "date": 150.36
  },
  {
    "onset": 140,
    "date": 150.80
  },
  {
    "onset": 141,
    "date": 151.23
  },
  {
    "onset": 142,
    "date": 151.68
  },
  {
    "onset": 143,
    "date": 152.10
  },
  {
    "onset": 144,
    "date": 152.63
  },
  {
    "onset": 145,
    "date": 153.03
  },
  {
    "onset": 146,
    "date": 153.45
  },
  {
    "onset": 147,
    "date": 153.88
  },
  {
    "onset": 148,
    "date": 154.31
  },
  {
    "onset": 149,
    "date": 154.73
  },
  {
    "onset": 150,
    "date": 155.13
  },
  {
    "onset": 151,
    "date": 155.53
  },
  {
    "onset": 152,
    "date": 155.95
  },
  {
    "onset": 153,
    "date": 156.38
  },
  {
    "onset": 154,
    "date": 156.83
  },
  {
    "onset": 155,
    "date": 157.23
  },
  {
    "onset": 156,
    "date": 157.67
  },
  {
    "onset": 157,
    "date": 158.08
  },
  {
    "onset": 158,
    "date": 158.50
  },
  {
    "onset": 159,
    "date": 158.90
  },
  {
    "onset": 160,
    "date": 159.35
  },
  {
    "onset": 161,
    "date": 159.72
  },
  {
    "onset": 162,
    "date": 160.15
  },
  {
    "onset": 163,
    "date": 160.45
  },
  {
    "onset": 164,
    "date": 160.93
  },
  {
    "onset": 165,
    "date": 161.37
  },
  {
    "onset": 166,
    "date": 161.80
  },
  {
    "onset": 167,
    "date": 162.23
  },
  {
    "onset": 168,
    "date": 162.62
  },
  {
    "onset": 169,
    "date": 163.08
  },
  {
    "onset": 170,
    "date": 163.52
  },
  {
    "onset": 171,
    "date": 163.90
  },
  {
    "onset": 172,
    "date": 164.33
  },
  {
    "onset": 173,
    "date": 164.77
  },
  {
    "onset": 174,
    "date": 165.17
  },
  {
    "onset": 175,
    "date": 165.58
  },
  {
    "onset": 176,
    "date": 166.02
  },
  {
    "onset": 177,
    "date": 166.40
  },
  {
    "onset": 178,
    "date": 166.80
  },
  {
    "onset": 179,
    "date": 167.23
  },
  {
    "onset": 180,
    "date": 167.68
  },
  {
    "onset": 181,
    "date": 168.10
  },
  {
    "onset": 182,
    "date": 168.52
  },
  {
    "onset": 183,
    "date": 168.92
  },
  {
    "onset": 184,
    "date": 169.33
  },
  {
    "onset": 185,
    "date": 169.73
  },
  {
    "onset": 186,
    "date": 170.13
  },
  {
    "onset": 187,
    "date": 170.52
  },
  {
    "onset": 188,
    "date": 170.95
  },
  {
    "onset": 189,
    "date": 171.37
  },
  {
    "onset": 190,
    "date": 171.73
  },
  {
    "onset": 191,
    "date": 172.12
  },
  {
    "onset": 192,
    "date": 172.52
  },
  {
    "onset": 193,
    "date": 172.88
  },
  {
    "onset": 194,
    "date": 173.26
  },
  {
    "onset": 195,
    "date": 173.62
  },
  {
    "onset": 196,
    "date": 174.03
  },
  {
    "onset": 197,
    "date": 174.42
  },
  {
    "onset": 198,
    "date": 174.82
  },
  {
    "onset": 199,
    "date": 175.18
  },
  {
    "onset": 200,
    "date": 175.57
  },
  {
    "onset": 201,
    "date": 175.95
  },
  {
    "onset": 202,
    "date": 176.33
  },
  {
    "onset": 203,
    "date": 176.68
  },
  {
    "onset": 204,
    "date": 177.07
  },
  {
    "onset": 205,
    "date": 177.49
  },
  {
    "onset": 206,
    "date": 177.87
  },
  {
    "onset": 207,
    "date": 178.29
  },
  {
    "onset": 208,
    "date": 178.69
  },
  {
    "onset": 209,
    "date": 179.07
  },
  {
    "onset": 210,
    "date": 179.49
  },
  {
    "onset": 211,
    "date": 179.79
  },
  {
    "onset": 212,
    "date": 180.25
  },
  {
    "onset": 213,
    "date": 180.64
  },
  {
    "onset": 214,
    "date": 181.02
  },
  {
    "onset": 215,
    "date": 181.40
  },
  {
    "onset": 216,
    "date": 181.85
  },
  {
    "onset": 217,
    "date": 182.25
  },
  {
    "onset": 218,
    "date": 182.59
  },
  {
    "onset": 219,
    "date": 182.99
  },
  {
    "onset": 220,
    "date": 183.37
  },
  {
    "onset": 221,
    "date": 183.79
  },
  {
    "onset": 222,
    "date": 184.19
  },
  {
    "onset": 223,
    "date": 184.60
  },
  {
    "onset": 224,
    "date": 184.97
  },
  {
    "onset": 225,
    "date": 185.41
  },
  {
    "onset": 226,
    "date": 185.78
  },
  {
    "onset": 227,
    "date": 186.18
  },
  {
    "onset": 228,
    "date": 186.54
  },
  {
    "onset": 229,
    "date": 186.93
  },
  {
    "onset": 230,
    "date": 187.32
  },
  {
    "onset": 231,
    "date": 187.71
  },
  {
    "onset": 232,
    "date": 188.08
  },
  {
    "onset": 233,
    "date": 188.46
  },
  {
    "onset": 234,
    "date": 188.86
  },
  {
    "onset": 235,
    "date": 189.30
  },
  {
    "onset": 236,
    "date": 189.69
  },
  {
    "onset": 237,
    "date": 190.16
  },
  {
    "onset": 238,
    "date": 190.45
  },
  {
    "onset": 239,
    "date": 190.95
  },
  {
    "onset": 240,
    "date": 191.31
  },
  {
    "onset": 241,
    "date": 191.71
  },
  {
    "onset": 242,
    "date": 192.11
  },
  {
    "onset": 243,
    "date": 192.50
  },
  {
    "onset": 244,
    "date": 192.95
  },
  {
    "onset": 245,
    "date": 193.32
  },
  {
    "onset": 246,
    "date": 193.74
  },
  {
    "onset": 247,
    "date": 194.14
  },
  {
    "onset": 248,
    "date": 194.50
  },
  {
    "onset": 249,
    "date": 194.90
  },
  {
    "onset": 250,
    "date": 195.30
  },
  {
    "onset": 251,
    "date": 195.69
  },
  {
    "onset": 252,
    "date": 196.07
  },
  {
    "onset": 253,
    "date": 196.47
  },
  {
    "onset": 254,
    "date": 196.85
  },
  {
    "onset": 255,
    "date": 197.24
  },
  {
    "onset": 256,
    "date": 197.64
  },
  {
    "onset": 257,
    "date": 197.95
  },
  {
    "onset": 258,
    "date": 198.40
  },
  {
    "onset": 259,
    "date": 198.80
  },
  {
    "onset": 260,
    "date": 199.19
  },
  {
    "onset": 261,
    "date": 199.59
  },
  {
    "onset": 262,
    "date": 199.99
  },
  {
    "onset": 263,
    "date": 200.39
  },
  {
    "onset": 264,
    "date": 200.66
  },
  {
    "onset": 265,
    "date": 201.16
  },
  {
    "onset": 266,
    "date": 201.57
  },
  {
    "onset": 267,
    "date": 202.01
  },
  {
    "onset": 268,
    "date": 202.39
  },
  {
    "onset": 269,
    "date": 202.72
  },
  {
    "onset": 270,
    "date": 203.16
  },
  {
    "onset": 271,
    "date": 203.57
  },
  {
    "onset": 272,
    "date": 203.96
  },
  {
    "onset": 273,
    "date": 204.36
  },
  {
    "onset": 274,
    "date": 204.77
  },
  {
    "onset": 275,
    "date": 205.16
  },
  {
    "onset": 276,
    "date": 205.54
  },
  {
    "onset": 277,
    "date": 205.96
  },
  {
    "onset": 278,
    "date": 206.34
  },
  {
    "onset": 279,
    "date": 206.74
  },
  {
    "onset": 280,
    "date": 207.09
  },
  {
    "onset": 281,
    "date": 207.49
  },
  {
    "onset": 282,
    "date": 207.89
  },
  {
    "onset": 283,
    "date": 208.29
  },
  {
    "onset": 284,
    "date": 208.66
  },
  {
    "onset": 285,
    "date": 209.04
  },
  {
    "onset": 286,
    "date": 209.44
  },
  {
    "onset": 287,
    "date": 209.82
  },
  {
    "onset": 288,
    "date": 210.17
  },
  {
    "onset": 289,
    "date": 210.56
  },
  {
    "onset": 290,
    "date": 210.94
  },
  {
    "onset": 291,
    "date": 211.32
  },
  {
    "onset": 292,
    "date": 211.72
  },
  {
    "onset": 293,
    "date": 212.17
  },
  {
    "onset": 294,
    "date": 212.62
  },
  {
    "onset": 295,
    "date": 213.11
  },
  {
    "onset": 296,
    "date": 213.51
  },
  {
    "onset": 297,
    "date": 213.91
  },
  {
    "onset": 298,
    "date": 214.27
  },
  {
    "onset": 299,
    "date": 214.74
  },
  {
    "onset": 300,
    "date": 215.02
  },
  {
    "onset": 301,
    "date": 215.59
  },
  {
    "onset": 302,
    "date": 215.96
  },
  {
    "onset": 303,
    "date": 216.37
  },
  {
    "onset": 304,
    "date": 216.79
  },
  {
    "onset": 305,
    "date": 217.21
  },
  {
    "onset": 306,
    "date": 217.64
  },
  {
    "onset": 307,
    "date": 218.09
  },
  {
    "onset": 308,
    "date": 218.51
  },
  {
    "onset": 309,
    "date": 218.94
  },
  {
    "onset": 310,
    "date": 219.36
  },
  {
    "onset": 311,
    "date": 219.77
  },
  {
    "onset": 312,
    "date": 220.19
  },
  {
    "onset": 313,
    "date": 220.44
  },
  {
    "onset": 314,
    "date": 221.07
  },
  {
    "onset": 315,
    "date": 221.48
  },
  {
    "onset": 316,
    "date": 221.90
  },
  {
    "onset": 317,
    "date": 222.30
  },
  {
    "onset": 318,
    "date": 222.73
  },
  {
    "onset": 319,
    "date": 223.17
  },
  {
    "onset": 320,
    "date": 223.60
  },
  {
    "onset": 321,
    "date": 224.01
  },
  {
    "onset": 322,
    "date": 224.40
  },
  {
    "onset": 323,
    "date": 224.83
  },
  {
    "onset": 324,
    "date": 225.25
  },
  {
    "onset": 325,
    "date": 225.70
  },
  {
    "onset": 326,
    "date": 226.13
  },
  {
    "onset": 327,
    "date": 226.57
  },
  {
    "onset": 328,
    "date": 227.00
  },
  {
    "onset": 329,
    "date": 227.40
  },
  {
    "onset": 330,
    "date": 227.82
  },
  {
    "onset": 331,
    "date": 228.22
  },
  {
    "onset": 332,
    "date": 228.52
  },
  {
    "onset": 333,
    "date": 229.03
  },
  {
    "onset": 334,
    "date": 229.46
  },
  {
    "onset": 335,
    "date": 229.86
  },
  {
    "onset": 336,
    "date": 230.31
  },
  {
    "onset": 337,
    "date": 230.76
  },
  {
    "onset": 338,
    "date": 231.16
  },
  {
    "onset": 339,
    "date": 231.63
  },
  {
    "onset": 340,
    "date": 232.03
  },
  {
    "onset": 341,
    "date": 232.44
  },
  {
    "onset": 342,
    "date": 232.88
  },
  {
    "onset": 343,
    "date": 233.33
  },
  {
    "onset": 344,
    "date": 233.78
  },
  {
    "onset": 345,
    "date": 234.24
  },
  {
    "onset": 346,
    "date": 234.65
  },
  {
    "onset": 347,
    "date": 235.14
  },
  {
    "onset": 348,
    "date": 235.61
  },
  {
    "onset": 349,
    "date": 236.08
  },
  {
    "onset": 350,
    "date": 236.51
  },
  {
    "onset": 351,
    "date": 236.86
  },
  {
    "onset": 352,
    "date": 237.33
  },
  {
    "onset": 353,
    "date": 237.78
  },
  {
    "onset": 354,
    "date": 238.23
  },
  {
    "onset": 355,
    "date": 238.71
  },
  {
    "onset": 356,
    "date": 239.16
  },
  {
    "onset": 357,
    "date": 239.58
  },
  {
    "onset": 358,
    "date": 240.03
  },
  {
    "onset": 359,
    "date": 240.46
  },
  {
    "onset": 360,
    "date": 240.89
  },
  {
    "onset": 361,
    "date": 241.33
  },
  {
    "onset": 362,
    "date": 241.74
  },
  {
    "onset": 363,
    "date": 242.04
  },
  {
    "onset": 364,
    "date": 242.62
  },
  {
    "onset": 365,
    "date": 243.04
  },
  {
    "onset": 366,
    "date": 243.47
  },
  {
    "onset": 367,
    "date": 243.90
  },
  {
    "onset": 368,
    "date": 244.34
  },
  {
    "onset": 369,
    "date": 244.79
  },
  {
    "onset": 370,
    "date": 245.22
  },
  {
    "onset": 371,
    "date": 245.65
  },
  {
    "onset": 372,
    "date": 246.09
  },
  {
    "onset": 373,
    "date": 246.54
  },
  {
    "onset": 374,
    "date": 246.92
  },
  {
    "onset": 375,
    "date": 247.32
  },
  {
    "onset": 376,
    "date": 247.74
  },
  {
    "onset": 377,
    "date": 248.15
  },
  {
    "onset": 378,
    "date": 248.55
  },
  {
    "onset": 379,
    "date": 249.02
  },
  {
    "onset": 380,
    "date": 249.42
  },
  {
    "onset": 381,
    "date": 249.85
  },
  {
    "onset": 382,
    "date": 250.27
  },
  {
    "onset": 383,
    "date": 250.45
  },
  {
    "onset": 384,
    "date": 251.09
  },
  {
    "onset": 385,
    "date": 251.49
  },
  {
    "onset": 386,
    "date": 251.85
  },
  {
    "onset": 387,
    "date": 252.29
  },
  {
    "onset": 388,
    "date": 252.65
  },
  {
    "onset": 389,
    "date": 253.10
  },
  {
    "onset": 390,
    "date": 253.40
  },
  {
    "onset": 391,
    "date": 253.90
  },
  {
    "onset": 392,
    "date": 254.25
  },
  {
    "onset": 393,
    "date": 254.70
  },
  {
    "onset": 394,
    "date": 255.10
  },
  {
    "onset": 395,
    "date": 255.47
  },
  {
    "onset": 396,
    "date": 255.88
  },
  {
    "onset": 397,
    "date": 256.31
  },
  {
    "onset": 398,
    "date": 256.69
  },
  {
    "onset": 399,
    "date": 257.07
  },
  {
    "onset": 400,
    "date": 257.47
  },
  {
    "onset": 401,
    "date": 257.86
  },
  {
    "onset": 402,
    "date": 258.31
  },
  {
    "onset": 403,
    "date": 258.71
  },
  {
    "onset": 404,
    "date": 259.18
  },
  {
    "onset": 405,
    "date": 259.60
  },
  {
    "onset": 406,
    "date": 259.98
  },
  {
    "onset": 407,
    "date": 260.36
  },
  {
    "onset": 408,
    "date": 260.76
  },
  {
    "onset": 409,
    "date": 261.12
  },
  {
    "onset": 410,
    "date": 261.54
  },
  {
    "onset": 411,
    "date": 261.97
  },
  {
    "onset": 412,
    "date": 262.37
  },
  {
    "onset": 413,
    "date": 262.79
  },
  {
    "onset": 414,
    "date": 263.19
  },
  {
    "onset": 415,
    "date": 263.62
  },
  {
    "onset": 416,
    "date": 264.01
  },
  {
    "onset": 417,
    "date": 264.44
  },
  {
    "onset": 418,
    "date": 264.85
  },
  {
    "onset": 419,
    "date": 265.29
  },
  {
    "onset": 420,
    "date": 265.72
  },
  {
    "onset": 421,
    "date": 266.09
  },
  {
    "onset": 422,
    "date": 266.47
  },
  {
    "onset": 423,
    "date": 266.91
  },
  {
    "onset": 424,
    "date": 267.27
  },
  {
    "onset": 425,
    "date": 267.66
  },
  {
    "onset": 426,
    "date": 268.08
  },
  {
    "onset": 427,
    "date": 268.47
  },
  {
    "onset": 428,
    "date": 268.87
  },
  {
    "onset": 429,
    "date": 269.27
  },
  {
    "onset": 430,
    "date": 269.67
  },
  {
    "onset": 431,
    "date": 270.07
  },
  {
    "onset": 432,
    "date": 270.46
  },
  {
    "onset": 433,
    "date": 270.84
  },
  {
    "onset": 434,
    "date": 271.19
  },
  {
    "onset": 435,
    "date": 271.64
  },
  {
    "onset": 436,
    "date": 272.03
  },
  {
    "onset": 437,
    "date": 272.40
  },
  {
    "onset": 438,
    "date": 272.78
  },
  {
    "onset": 439,
    "date": 273.17
  },
  {
    "onset": 440,
    "date": 273.55
  },
  {
    "onset": 441,
    "date": 273.95
  },
  {
    "onset": 442,
    "date": 274.37
  },
  {
    "onset": 443,
    "date": 274.77
  },
  {
    "onset": 444,
    "date": 275.17
  },
  {
    "onset": 445,
    "date": 275.56
  },
  {
    "onset": 446,
    "date": 275.94
  },
  {
    "onset": 447,
    "date": 276.37
  },
  {
    "onset": 448,
    "date": 276.79
  },
  {
    "onset": 449,
    "date": 277.23
  },
  {
    "onset": 450,
    "date": 277.33
  },
  {
    "onset": 451,
    "date": 278.38
  },
  {
    "onset": 452,
    "date": 278.63
  },
  {
    "onset": 453,
    "date": 279.04
  },
  {
    "onset": 454,
    "date": 279.46
  },
  {
    "onset": 455,
    "date": 279.83
  },
  {
    "onset": 456,
    "date": 280.33
  },
  {
    "onset": 457,
    "date": 280.78
  },
  {
    "onset": 458,
    "date": 281.19
  },
  {
    "onset": 459,
    "date": 281.67
  },
  {
    "onset": 460,
    "date": 282.09
  },
  {
    "onset": 461,
    "date": 282.54
  },
  {
    "onset": 462,
    "date": 283.15
  },
  {
    "onset": 463,
    "date": 284.96
  },
  {
    "onset": 464,
    "date": 285.48
  },
  {
    "onset": 465,
    "date": 285.96
  },
  {
    "onset": 466,
    "date": 286.39
  },
  {
    "onset": 467,
    "date": 286.83
  },
  {
    "onset": 468,
    "date": 287.33
  },
  {
    "onset": 469,
    "date": 287.77
  },
  {
    "onset": 470,
    "date": 288.13
  },
  {
    "onset": 471,
    "date": 288.68
  },
  {
    "onset": 472,
    "date": 289.13
  },
  {
    "onset": 473,
    "date": 289.54
  },
  {
    "onset": 474,
    "date": 290.00
  },
  {
    "onset": 475,
    "date": 290.49
  },
  {
    "onset": 476,
    "date": 290.98
  },
  {
    "onset": 477,
    "date": 291.39
  },
  {
    "onset": 478,
    "date": 291.85
  },
  {
    "onset": 479,
    "date": 292.27
  },
  {
    "onset": 480,
    "date": 292.72
  },
  {
    "onset": 481,
    "date": 293.13
  },
  {
    "onset": 482,
    "date": 293.54
  },
  {
    "onset": 483,
    "date": 293.97
  },
  {
    "onset": 484,
    "date": 294.42
  },
  {
    "onset": 485,
    "date": 294.86
  },
  {
    "onset": 486,
    "date": 295.29
  },
  {
    "onset": 487,
    "date": 295.69
  },
  {
    "onset": 488,
    "date": 296.13
  },
  {
    "onset": 489,
    "date": 296.54
  },
  {
    "onset": 490,
    "date": 297.01
  },
  {
    "onset": 491,
    "date": 297.46
  },
  {
    "onset": 492,
    "date": 297.89
  },
  {
    "onset": 493,
    "date": 298.29
  },
  {
    "onset": 494,
    "date": 298.67
  },
  {
    "onset": 495,
    "date": 299.13
  },
  {
    "onset": 496,
    "date": 299.60
  },
  {
    "onset": 497,
    "date": 300.03
  },
  {
    "onset": 498,
    "date": 300.43
  },
  {
    "onset": 499,
    "date": 300.89
  },
  {
    "onset": 500,
    "date": 301.30
  },
  {
    "onset": 501,
    "date": 301.74
  },
  {
    "onset": 502,
    "date": 302.17
  },
  {
    "onset": 503,
    "date": 302.59
  },
  {
    "onset": 504,
    "date": 303.06
  },
  {
    "onset": 505,
    "date": 303.46
  },
  {
    "onset": 506,
    "date": 303.86
  },
  {
    "onset": 507,
    "date": 304.29
  },
  {
    "onset": 508,
    "date": 304.70
  },
  {
    "onset": 509,
    "date": 305.15
  },
  {
    "onset": 510,
    "date": 305.56
  },
  {
    "onset": 511,
    "date": 305.97
  },
  {
    "onset": 512,
    "date": 306.36
  },
  {
    "onset": 513,
    "date": 306.76
  },
  {
    "onset": 514,
    "date": 307.20
  },
  {
    "onset": 515,
    "date": 307.60
  },
  {
    "onset": 516,
    "date": 308.04
  },
  {
    "onset": 517,
    "date": 308.40
  },
  {
    "onset": 518,
    "date": 308.85
  },
  {
    "onset": 519,
    "date": 309.29
  },
  {
    "onset": 520,
    "date": 309.72
  },
  {
    "onset": 521,
    "date": 310.08
  },
  {
    "onset": 522,
    "date": 310.50
  },
  {
    "onset": 523,
    "date": 310.71
  },
  {
    "onset": 524,
    "date": 311.31
  },
  {
    "onset": 525,
    "date": 311.65
  },
  {
    "onset": 526,
    "date": 312.08
  },
  {
    "onset": 527,
    "date": 312.50
  },
  {
    "onset": 528,
    "date": 312.92
  },
  {
    "onset": 529,
    "date": 313.37
  },
  {
    "onset": 530,
    "date": 313.75
  },
  {
    "onset": 531,
    "date": 314.15
  },
  {
    "onset": 532,
    "date": 314.60
  },
  {
    "onset": 533,
    "date": 315.00
  },
  {
    "onset": 534,
    "date": 315.38
  },
  {
    "onset": 535,
    "date": 315.76
  },
  {
    "onset": 536,
    "date": 316.19
  },
  {
    "onset": 537,
    "date": 316.57
  },
  {
    "onset": 538,
    "date": 317.01
  },
  {
    "onset": 539,
    "date": 317.37
  },
  {
    "onset": 540,
    "date": 317.81
  },
  {
    "onset": 541,
    "date": 318.23
  },
  {
    "onset": 542,
    "date": 318.65
  },
  {
    "onset": 543,
    "date": 319.06
  },
  {
    "onset": 544,
    "date": 319.36
  },
  {
    "onset": 545,
    "date": 319.86
  },
  {
    "onset": 546,
    "date": 320.27
  },
  {
    "onset": 547,
    "date": 320.67
  },
  {
    "onset": 548,
    "date": 321.08
  },
  {
    "onset": 549,
    "date": 321.51
  },
  {
    "onset": 550,
    "date": 321.89
  },
  {
    "onset": 551,
    "date": 322.28
  },
  {
    "onset": 552,
    "date": 322.71
  },
  {
    "onset": 553,
    "date": 323.11
  },
  {
    "onset": 554,
    "date": 323.52
  },
  {
    "onset": 555,
    "date": 323.91
  },
  {
    "onset": 556,
    "date": 324.31
  },
  {
    "onset": 557,
    "date": 324.71
  },
  {
    "onset": 558,
    "date": 325.10
  },
  {
    "onset": 559,
    "date": 325.29
  },
  {
    "onset": 560,
    "date": 325.93
  },
  {
    "onset": 561,
    "date": 326.35
  },
  {
    "onset": 562,
    "date": 326.85
  },
  {
    "onset": 563,
    "date": 327.30
  },
  {
    "onset": 564,
    "date": 327.85
  },
  {
    "onset": 565,
    "date": 328.36
  },
  {
    "onset": 566,
    "date": 329.00
  },
  {
    "onset": 567,
    "date": 329.56
  },
  {
    "onset": 568,
    "date": 330.09
  },
  {
    "onset": 569,
    "date": 330.58
  },
  {
    "onset": 570,
    "date": 331.09
  },
  {
    "onset": 571,
    "date": 331.63
  },
  {
    "onset": 572,
    "date": 332.19
  },
  {
    "onset": 573,
    "date": 332.89
  },
  {
    "onset": 574,
    "date": 334.29
  },
  {
    "onset": 575,
    "date": 334.75
  },
  {
    "onset": 576,
    "date": 335.11
  },
  {
    "onset": 577,
    "date": 335.54
  },
  {
    "onset": 578,
    "date": 335.96
  },
  {
    "onset": 579,
    "date": 336.40
  },
  {
    "onset": 580,
    "date": 336.87
  },
  {
    "onset": 581,
    "date": 337.32
  },
  {
    "onset": 582,
    "date": 337.75
  },
  {
    "onset": 583,
    "date": 338.21
  },
  {
    "onset": 584,
    "date": 338.63
  },
  {
    "onset": 585,
    "date": 339.12
  },
  {
    "onset": 586,
    "date": 339.56
  },
  {
    "onset": 587,
    "date": 339.99
  },
  {
    "onset": 588,
    "date": 340.38
  },
  {
    "onset": 589,
    "date": 340.69
  },
  {
    "onset": 590,
    "date": 341.30
  },
  {
    "onset": 591,
    "date": 341.30
  },
  {
    "onset": 592,
    "date": 342.15
  },
  {
    "onset": 593,
    "date": 342.57
  },
  {
    "onset": 594,
    "date": 343.02
  },
  {
    "onset": 595,
    "date": 343.47
  },
  {
    "onset": 596,
    "date": 343.89
  },
  {
    "onset": 597,
    "date": 344.38
  },
  {
    "onset": 598,
    "date": 344.85
  },
  {
    "onset": 599,
    "date": 345.26
  },
  {
    "onset": 600,
    "date": 345.63
  },
  {
    "onset": 601,
    "date": 346.07
  },
  {
    "onset": 602,
    "date": 346.50
  },
  {
    "onset": 603,
    "date": 346.92
  },
  {
    "onset": 604,
    "date": 347.36
  },
  {
    "onset": 605,
    "date": 347.79
  },
  {
    "onset": 606,
    "date": 348.20
  },
  {
    "onset": 607,
    "date": 348.64
  },
  {
    "onset": 608,
    "date": 349.08
  },
  {
    "onset": 609,
    "date": 349.55
  },
  {
    "onset": 610,
    "date": 349.96
  },
  {
    "onset": 611,
    "date": 350.38
  },
  {
    "onset": 612,
    "date": 350.82
  },
  {
    "onset": 613,
    "date": 351.25
  },
  {
    "onset": 614,
    "date": 351.66
  },
  {
    "onset": 615,
    "date": 352.12
  },
  {
    "onset": 616,
    "date": 352.55
  },
  {
    "onset": 617,
    "date": 352.99
  },
  {
    "onset": 618,
    "date": 353.43
  },
  {
    "onset": 619,
    "date": 353.89
  },
  {
    "onset": 620,
    "date": 354.36
  },
  {
    "onset": 621,
    "date": 354.77
  },
  {
    "onset": 622,
    "date": 355.28
  },
  {
    "onset": 623,
    "date": 355.69
  },
  {
    "onset": 624,
    "date": 356.14
  },
  {
    "onset": 625,
    "date": 356.62
  },
  {
    "onset": 626,
    "date": 357.03
  },
  {
    "onset": 627,
    "date": 357.49
  },
  {
    "onset": 628,
    "date": 357.94
  },
  {
    "onset": 629,
    "date": 358.37
  },
  {
    "onset": 630,
    "date": 358.81
  },
  {
    "onset": 631,
    "date": 359.23
  },
  {
    "onset": 632,
    "date": 359.67
  },
  {
    "onset": 633,
    "date": 360.09
  },
  {
    "onset": 634,
    "date": 360.53
  },
  {
    "onset": 635,
    "date": 360.99
  },
  {
    "onset": 636,
    "date": 361.44
  },
  {
    "onset": 637,
    "date": 361.85
  },
  {
    "onset": 638,
    "date": 362.25
  },
  {
    "onset": 639,
    "date": 362.66
  },
  {
    "onset": 640,
    "date": 363.15
  },
  {
    "onset": 641,
    "date": 363.60
  },
  {
    "onset": 642,
    "date": 364.03
  },
  {
    "onset": 643,
    "date": 364.50
  },
  {
    "onset": 644,
    "date": 364.93
  },
  {
    "onset": 645,
    "date": 365.35
  },
  {
    "onset": 646,
    "date": 365.77
  },
  {
    "onset": 647,
    "date": 366.20
  },
  {
    "onset": 648,
    "date": 366.62
  },
  {
    "onset": 649,
    "date": 367.08
  },
  {
    "onset": 650,
    "date": 367.50
  },
  {
    "onset": 651,
    "date": 367.83
  },
  {
    "onset": 652,
    "date": 368.35
  },
  {
    "onset": 653,
    "date": 368.81
  },
  {
    "onset": 654,
    "date": 369.24
  },
  {
    "onset": 655,
    "date": 369.64
  },
  {
    "onset": 656,
    "date": 370.09
  },
  {
    "onset": 657,
    "date": 370.51
  },
  {
    "onset": 658,
    "date": 370.77
  },
  {
    "onset": 659,
    "date": 371.42
  },
  {
    "onset": 660,
    "date": 371.88
  },
  {
    "onset": 661,
    "date": 372.30
  },
  {
    "onset": 662,
    "date": 372.65
  },
  {
    "onset": 663,
    "date": 373.06
  },
  {
    "onset": 664,
    "date": 373.37
  },
  {
    "onset": 665,
    "date": 373.83
  },
  {
    "onset": 666,
    "date": 374.21
  },
  {
    "onset": 667,
    "date": 374.62
  },
  {
    "onset": 668,
    "date": 375.01
  },
  {
    "onset": 669,
    "date": 375.40
  },
  {
    "onset": 670,
    "date": 375.80
  },
  {
    "onset": 671,
    "date": 376.18
  },
  {
    "onset": 672,
    "date": 376.56
  },
  {
    "onset": 673,
    "date": 376.96
  },
  {
    "onset": 674,
    "date": 377.30
  },
  {
    "onset": 675,
    "date": 377.76
  },
  {
    "onset": 676,
    "date": 378.14
  },
  {
    "onset": 677,
    "date": 378.51
  },
  {
    "onset": 678,
    "date": 378.91
  },
  {
    "onset": 679,
    "date": 379.31
  },
  {
    "onset": 680,
    "date": 379.72
  },
  {
    "onset": 681,
    "date": 380.12
  },
  {
    "onset": 682,
    "date": 380.47
  },
  {
    "onset": 683,
    "date": 380.94
  },
  {
    "onset": 684,
    "date": 381.35
  },
  {
    "onset": 685,
    "date": 381.76
  },
  {
    "onset": 686,
    "date": 382.16
  },
  {
    "onset": 687,
    "date": 382.54
  },
  {
    "onset": 688,
    "date": 382.95
  },
  {
    "onset": 689,
    "date": 383.36
  },
  {
    "onset": 690,
    "date": 383.77
  },
  {
    "onset": 691,
    "date": 384.15
  },
  {
    "onset": 692,
    "date": 384.54
  },
  {
    "onset": 693,
    "date": 384.94
  },
  {
    "onset": 694,
    "date": 385.33
  },
  {
    "onset": 695,
    "date": 385.72
  },
  {
    "onset": 696,
    "date": 386.09
  },
  {
    "onset": 697,
    "date": 386.57
  },
  {
    "onset": 698,
    "date": 386.98
  },
  {
    "onset": 699,
    "date": 387.38
  },
  {
    "onset": 700,
    "date": 387.80
  },
  {
    "onset": 701,
    "date": 388.18
  },
  {
    "onset": 702,
    "date": 388.58
  },
  {
    "onset": 703,
    "date": 388.97
  },
  {
    "onset": 704,
    "date": 389.33
  },
  {
    "onset": 705,
    "date": 389.78
  },
  {
    "onset": 706,
    "date": 390.21
  },
  {
    "onset": 707,
    "date": 390.61
  },
  {
    "onset": 708,
    "date": 391.02
  },
  {
    "onset": 709,
    "date": 391.44
  },
  {
    "onset": 710,
    "date": 391.72
  },
  {
    "onset": 711,
    "date": 392.23
  },
  {
    "onset": 712,
    "date": 392.66
  },
  {
    "onset": 713,
    "date": 393.09
  },
  {
    "onset": 714,
    "date": 393.47
  },
  {
    "onset": 715,
    "date": 393.86
  },
  {
    "onset": 716,
    "date": 394.25
  },
  {
    "onset": 717,
    "date": 394.63
  },
  {
    "onset": 718,
    "date": 395.07
  },
  {
    "onset": 719,
    "date": 395.46
  },
  {
    "onset": 720,
    "date": 395.86
  },
  {
    "onset": 721,
    "date": 396.21
  },
  {
    "onset": 722,
    "date": 396.60
  },
  {
    "onset": 723,
    "date": 397.04
  },
  {
    "onset": 724,
    "date": 397.45
  },
  {
    "onset": 725,
    "date": 397.73
  },
  {
    "onset": 726,
    "date": 398.24
  },
  {
    "onset": 727,
    "date": 398.63
  },
  {
    "onset": 728,
    "date": 399.03
  },
  {
    "onset": 729,
    "date": 399.43
  },
  {
    "onset": 730,
    "date": 399.83
  },
  {
    "onset": 731,
    "date": 400.22
  },
  {
    "onset": 732,
    "date": 400.66
  },
  {
    "onset": 733,
    "date": 401.32
  },
  {
    "onset": 734,
    "date": 401.52
  },
  {
    "onset": 735,
    "date": 401.85
  },
  {
    "onset": 736,
    "date": 402.24
  },
  {
    "onset": 737,
    "date": 402.63
  },
  {
    "onset": 738,
    "date": 402.91
  },
  {
    "onset": 739,
    "date": 403.45
  },
  {
    "onset": 740,
    "date": 403.84
  },
  {
    "onset": 741,
    "date": 404.26
  },
  {
    "onset": 742,
    "date": 404.68
  },
  {
    "onset": 743,
    "date": 405.04
  },
  {
    "onset": 744,
    "date": 405.43
  },
  {
    "onset": 745,
    "date": 405.83
  },
  {
    "onset": 746,
    "date": 406.22
  },
  {
    "onset": 747,
    "date": 406.64
  },
  {
    "onset": 748,
    "date": 407.05
  },
  {
    "onset": 749,
    "date": 407.42
  },
  {
    "onset": 750,
    "date": 407.83
  },
  {
    "onset": 751,
    "date": 408.21
  },
  {
    "onset": 752,
    "date": 408.60
  },
  {
    "onset": 753,
    "date": 408.89
  },
  {
    "onset": 754,
    "date": 409.42
  },
  {
    "onset": 755,
    "date": 409.81
  },
  {
    "onset": 756,
    "date": 410.20
  },
  {
    "onset": 757,
    "date": 410.59
  },
  {
    "onset": 758,
    "date": 410.98
  },
  {
    "onset": 759,
    "date": 411.39
  },
  {
    "onset": 760,
    "date": 411.78
  },
  {
    "onset": 761,
    "date": 412.14
  },
  {
    "onset": 762,
    "date": 412.58
  },
  {
    "onset": 763,
    "date": 412.99
  },
  {
    "onset": 764,
    "date": 413.39
  },
  {
    "onset": 765,
    "date": 413.80
  },
  {
    "onset": 766,
    "date": 414.29
  },
  {
    "onset": 767,
    "date": 414.67
  },
  {
    "onset": 768,
    "date": 414.96
  },
  {
    "onset": 769,
    "date": 415.49
  },
  {
    "onset": 770,
    "date": 415.91
  },
  {
    "onset": 771,
    "date": 416.33
  },
  {
    "onset": 772,
    "date": 416.78
  },
  {
    "onset": 773,
    "date": 417.16
  },
  {
    "onset": 774,
    "date": 417.57
  },
  {
    "onset": 775,
    "date": 417.97
  },
  {
    "onset": 776,
    "date": 418.40
  },
  {
    "onset": 777,
    "date": 418.80
  },
  {
    "onset": 778,
    "date": 419.25
  },
  {
    "onset": 779,
    "date": 419.67
  },
  {
    "onset": 780,
    "date": 420.06
  },
  {
    "onset": 781,
    "date": 420.46
  },
  {
    "onset": 782,
    "date": 420.84
  },
  {
    "onset": 783,
    "date": 421.32
  },
  {
    "onset": 784,
    "date": 421.77
  },
  {
    "onset": 785,
    "date": 422.20
  },
  {
    "onset": 786,
    "date": 422.64
  },
  {
    "onset": 787,
    "date": 423.16
  },
  {
    "onset": 788,
    "date": 423.49
  },
  {
    "onset": 789,
    "date": 423.88
  },
  {
    "onset": 790,
    "date": 424.30
  },
  {
    "onset": 791,
    "date": 424.70
  },
  {
    "onset": 792,
    "date": 425.11
  },
  {
    "onset": 793,
    "date": 425.50
  },
  {
    "onset": 794,
    "date": 425.97
  },
  {
    "onset": 795,
    "date": 426.41
  },
  {
    "onset": 796,
    "date": 426.85
  },
  {
    "onset": 797,
    "date": 427.25
  },
  {
    "onset": 798,
    "date": 427.65
  },
  {
    "onset": 799,
    "date": 428.10
  },
  {
    "onset": 800,
    "date": 428.54
  },
  {
    "onset": 801,
    "date": 428.97
  },
  {
    "onset": 802,
    "date": 429.36
  },
  {
    "onset": 803,
    "date": 429.77
  },
  {
    "onset": 804,
    "date": 430.16
  },
  {
    "onset": 805,
    "date": 430.54
  },
  {
    "onset": 806,
    "date": 430.54
  },
  {
    "onset": 807,
    "date": 431.38
  },
  {
    "onset": 808,
    "date": 431.89
  },
  {
    "onset": 809,
    "date": 432.32
  },
  {
    "onset": 810,
    "date": 432.73
  },
  {
    "onset": 811,
    "date": 433.20
  },
  {
    "onset": 812,
    "date": 433.56
  },
  {
    "onset": 813,
    "date": 434.01
  },
  {
    "onset": 814,
    "date": 434.46
  },
  {
    "onset": 815,
    "date": 434.91
  },
  {
    "onset": 816,
    "date": 435.35
  },
  {
    "onset": 817,
    "date": 435.86
  },
  {
    "onset": 818,
    "date": 436.29
  },
  {
    "onset": 819,
    "date": 436.72
  },
  {
    "onset": 820,
    "date": 437.12
  },
  {
    "onset": 821,
    "date": 437.61
  },
  {
    "onset": 822,
    "date": 438.04
  },
  {
    "onset": 823,
    "date": 438.51
  },
  {
    "onset": 824,
    "date": 438.96
  },
  {
    "onset": 825,
    "date": 439.40
  },
  {
    "onset": 826,
    "date": 439.84
  },
  {
    "onset": 827,
    "date": 440.27
  },
  {
    "onset": 828,
    "date": 440.70
  },
  {
    "onset": 829,
    "date": 441.17
  },
  {
    "onset": 830,
    "date": 441.59
  },
  {
    "onset": 831,
    "date": 442.06
  },
  {
    "onset": 832,
    "date": 442.50
  },
  {
    "onset": 833,
    "date": 442.92
  },
  {
    "onset": 834,
    "date": 443.32
  },
  {
    "onset": 835,
    "date": 443.77
  },
  {
    "onset": 836,
    "date": 444.22
  },
  {
    "onset": 837,
    "date": 444.69
  },
  {
    "onset": 838,
    "date": 445.08
  },
  {
    "onset": 839,
    "date": 445.57
  },
  {
    "onset": 840,
    "date": 446.00
  },
  {
    "onset": 841,
    "date": 446.44
  },
  {
    "onset": 842,
    "date": 446.86
  },
  {
    "onset": 843,
    "date": 447.28
  },
  {
    "onset": 844,
    "date": 447.72
  },
  {
    "onset": 845,
    "date": 448.11
  },
  {
    "onset": 846,
    "date": 448.52
  },
  {
    "onset": 847,
    "date": 448.83
  },
  {
    "onset": 848,
    "date": 449.35
  },
  {
    "onset": 849,
    "date": 449.77
  },
  {
    "onset": 850,
    "date": 450.22
  },
  {
    "onset": 851,
    "date": 450.62
  },
  {
    "onset": 852,
    "date": 451.03
  },
  {
    "onset": 853,
    "date": 451.46
  },
  {
    "onset": 854,
    "date": 451.84
  },
  {
    "onset": 855,
    "date": 452.26
  },
  {
    "onset": 856,
    "date": 452.65
  },
  {
    "onset": 857,
    "date": 453.03
  },
  {
    "onset": 858,
    "date": 453.46
  },
  {
    "onset": 859,
    "date": 453.88
  },
  {
    "onset": 860,
    "date": 454.26
  },
  {
    "onset": 861,
    "date": 454.56
  },
  {
    "onset": 862,
    "date": 455.04
  },
  {
    "onset": 863,
    "date": 455.44
  },
  {
    "onset": 864,
    "date": 455.83
  },
  {
    "onset": 865,
    "date": 456.21
  },
  {
    "onset": 866,
    "date": 456.61
  },
  {
    "onset": 867,
    "date": 457.02
  },
  {
    "onset": 868,
    "date": 457.41
  },
  {
    "onset": 869,
    "date": 457.81
  },
  {
    "onset": 870,
    "date": 458.24
  },
  {
    "onset": 871,
    "date": 458.63
  },
  {
    "onset": 872,
    "date": 459.01
  },
  {
    "onset": 873,
    "date": 459.42
  },
  {
    "onset": 874,
    "date": 459.87
  },
  {
    "onset": 875,
    "date": 460.30
  },
  {
    "onset": 876,
    "date": 460.55
  },
  {
    "onset": 877,
    "date": 461.41
  },
  {
    "onset": 878,
    "date": 461.67
  },
  {
    "onset": 879,
    "date": 462.18
  },
  {
    "onset": 880,
    "date": 462.49
  },
  {
    "onset": 881,
    "date": 462.80
  },
  {
    "onset": 882,
    "date": 463.11
  },
  {
    "onset": 883,
    "date": 463.42
  },
  {
    "onset": 884,
    "date": 463.97
  },
  {
    "onset": 885,
    "date": 464.38
  },
  {
    "onset": 886,
    "date": 464.76
  },
  {
    "onset": 887,
    "date": 465.15
  },
  {
    "onset": 888,
    "date": 465.55
  },
  {
    "onset": 889,
    "date": 465.97
  },
  {
    "onset": 890,
    "date": 466.38
  },
  {
    "onset": 891,
    "date": 466.79
  },
  {
    "onset": 892,
    "date": 467.19
  },
  {
    "onset": 893,
    "date": 467.58
  },
  {
    "onset": 894,
    "date": 467.58
  },
  {
    "onset": 895,
    "date": 468.39
  },
  {
    "onset": 896,
    "date": 468.79
  },
  {
    "onset": 897,
    "date": 469.19
  },
  {
    "onset": 898,
    "date": 469.61
  },
  {
    "onset": 899,
    "date": 469.99
  },
  {
    "onset": 900,
    "date": 470.39
  },
  {
    "onset": 901,
    "date": 470.79
  },
  {
    "onset": 902,
    "date": 471.18
  },
  {
    "onset": 903,
    "date": 471.52
  },
  {
    "onset": 904,
    "date": 471.99
  },
  {
    "onset": 905,
    "date": 472.39
  },
  {
    "onset": 906,
    "date": 472.79
  },
  {
    "onset": 907,
    "date": 473.17
  },
  {
    "onset": 908,
    "date": 473.55
  },
  {
    "onset": 909,
    "date": 473.55
  },
  {
    "onset": 910,
    "date": 474.34
  },
  {
    "onset": 911,
    "date": 474.74
  },
  {
    "onset": 912,
    "date": 475.10
  },
  {
    "onset": 913,
    "date": 475.49
  },
  {
    "onset": 914,
    "date": 475.87
  },
  {
    "onset": 915,
    "date": 476.26
  },
  {
    "onset": 916,
    "date": 476.65
  },
  {
    "onset": 917,
    "date": 477.07
  },
  {
    "onset": 918,
    "date": 477.45
  },
  {
    "onset": 919,
    "date": 477.87
  },
  {
    "onset": 920,
    "date": 478.29
  },
  {
    "onset": 921,
    "date": 478.70
  },
  {
    "onset": 922,
    "date": 479.11
  },
  {
    "onset": 923,
    "date": 479.11
  },
  {
    "onset": 924,
    "date": 479.87
  },
  {
    "onset": 925,
    "date": 480.34
  },
  {
    "onset": 926,
    "date": 480.75
  },
  {
    "onset": 927,
    "date": 481.16
  },
  {
    "onset": 928,
    "date": 481.55
  },
  {
    "onset": 929,
    "date": 481.96
  },
  {
    "onset": 930,
    "date": 482.35
  },
  {
    "onset": 931,
    "date": 482.76
  },
  {
    "onset": 932,
    "date": 483.15
  },
  {
    "onset": 933,
    "date": 483.58
  },
  {
    "onset": 934,
    "date": 484.00
  },
  {
    "onset": 935,
    "date": 484.41
  },
  {
    "onset": 936,
    "date": 484.84
  },
  {
    "onset": 937,
    "date": 485.24
  },
  {
    "onset": 938,
    "date": 485.65
  },
  {
    "onset": 939,
    "date": 486.05
  },
  {
    "onset": 940,
    "date": 486.05
  },
  {
    "onset": 941,
    "date": 486.84
  },
  {
    "onset": 942,
    "date": 487.27
  },
  {
    "onset": 943,
    "date": 487.68
  },
  {
    "onset": 944,
    "date": 488.08
  },
  {
    "onset": 945,
    "date": 488.53
  },
  {
    "onset": 946,
    "date": 488.96
  },
  {
    "onset": 947,
    "date": 489.44
  },
  {
    "onset": 948,
    "date": 489.92
  },
  {
    "onset": 949,
    "date": 490.46
  },
  {
    "onset": 950,
    "date": 490.88
  },
  {
    "onset": 951,
    "date": 491.76
  },
  {
    "onset": 951,
    "date": 499.17
  }
]