[
    {
        "date": 0.0,
        "onset": 0
    },
    {
        "date": 0.580498866,
        "onset": 1
    },
    {
        "date": 1.439614512,
        "onset": 2
    },
    {
        "date": 2.247346938,
        "onset": 3
    },
    {
        "date": 3.119183673,
        "onset": 4
    },
    {
        "date": 4.007414965,
        "onset": 5
    },
    {
        "date": 4.815442176,
        "onset": 6
    },
    {
        "date": 5.591088435,
        "onset": 7
    },
    {
        "date": 6.407278911,
        "onset": 8
    },
    {
        "date": 7.143537414,
        "onset": 9
    },
    {
        "date": 7.9192517,
        "onset": 10
    },
    {
        "date": 8.751292517,
        "onset": 11
    },
    {
        "date": 9.591201814,
        "onset": 12
    },
    {
        "date": 10.399433106,
        "onset": 13
    },
    {
        "date": 11.207414965,
        "onset": 14
    },
    {
        "date": 12.03941043,
        "onset": 15
    },
    {
        "date": 12.751224489,
        "onset": 16
    },
    {
        "date": 13.511405895,
        "onset": 17
    },
    {
        "date": 14.311609977,
        "onset": 18
    },
    {
        "date": 15.055328798,
        "onset": 19
    },
    {
        "date": 15.840249433,
        "onset": 20
    },
    {
        "date": 16.631201814,
        "onset": 21
    },
    {
        "date": 17.439637188,
        "onset": 22
    },
    {
        "date": 18.223378684,
        "onset": 23
    },
    {
        "date": 19.015328798,
        "onset": 24
    },
    {
        "date": 19.791428571,
        "onset": 25
    },
    {
        "date": 20.551315192,
        "onset": 26
    },
    {
        "date": 21.311043083,
        "onset": 27
    },
    {
        "date": 22.039160997,
        "onset": 28
    },
    {
        "date": 22.80739229,
        "onset": 29
    },
    {
        "date": 23.535215419,
        "onset": 30
    },
    {
        "date": 24.383015873,
        "onset": 31
    },
    {
        "date": 25.151224489,
        "onset": 32
    },
    {
        "date": 25.911315192,
        "onset": 33
    },
    {
        "date": 26.687324263,
        "onset": 34
    },
    {
        "date": 27.455600907,
        "onset": 35
    },
    {
        "date": 28.239160997,
        "onset": 36
    },
    {
        "date": 29.039501133,
        "onset": 37
    },
    {
        "date": 29.815419501,
        "onset": 38
    },
    {
        "date": 30.599387755,
        "onset": 39
    },
    {
        "date": 31.375306122,
        "onset": 40
    },
    {
        "date": 32.111428571,
        "onset": 41
    },
    {
        "date": 32.855804988,
        "onset": 42
    },
    {
        "date": 33.599478458,
        "onset": 43
    },
    {
        "date": 34.415827664,
        "onset": 44
    },
    {
        "date": 35.151269841,
        "onset": 45
    },
    {
        "date": 35.911723356,
        "onset": 46
    },
    {
        "date": 36.647301587,
        "onset": 47
    },
    {
        "date": 37.407097505,
        "onset": 48
    },
    {
        "date": 38.143197278,
        "onset": 49
    },
    {
        "date": 38.967641723,
        "onset": 50
    },
    {
        "date": 39.783537414,
        "onset": 51
    },
    {
        "date": 40.535510204,
        "onset": 52
    },
    {
        "date": 41.247482993,
        "onset": 53
    },
    {
        "date": 42.015124716,
        "onset": 54
    },
    {
        "date": 42.791428571,
        "onset": 55
    },
    {
        "date": 43.599183673,
        "onset": 56
    },
    {
        "date": 44.359433106,
        "onset": 57
    },
    {
        "date": 45.1430839,
        "onset": 58
    },
    {
        "date": 45.927324263,
        "onset": 59
    },
    {
        "date": 46.719160997,
        "onset": 60
    },
    {
        "date": 47.487210884,
        "onset": 61
    },
    {
        "date": 48.215215419,
        "onset": 62
    },
    {
        "date": 49.031292517,
        "onset": 63
    },
    {
        "date": 49.775215419,
        "onset": 64
    },
    {
        "date": 50.511723356,
        "onset": 65
    },
    {
        "date": 51.311360544,
        "onset": 66
    },
    {
        "date": 52.079433106,
        "onset": 67
    },
    {
        "date": 52.895532879,
        "onset": 68
    },
    {
        "date": 53.687596371,
        "onset": 69
    },
    {
        "date": 54.455079365,
        "onset": 70
    },
    {
        "date": 55.200408163,
        "onset": 71
    },
    {
        "date": 55.999047619,
        "onset": 72
    },
    {
        "date": 56.799387755,
        "onset": 73
    },
    {
        "date": 57.55941043,
        "onset": 74
    },
    {
        "date": 58.303605442,
        "onset": 75
    },
    {
        "date": 59.039070294,
        "onset": 76
    },
    {
        "date": 59.799319727,
        "onset": 77
    },
    {
        "date": 60.575510204,
        "onset": 78
    },
    {
        "date": 61.375442176,
        "onset": 79
    },
    {
        "date": 62.151315192,
        "onset": 80
    },
    {
        "date": 62.911428571,
        "onset": 81
    },
    {
        "date": 63.703356009,
        "onset": 82
    },
    {
        "date": 64.519319727,
        "onset": 83
    },
    {
        "date": 65.303333333,
        "onset": 84
    },
    {
        "date": 66.063333333,
        "onset": 85
    },
    {
        "date": 66.839229024,
        "onset": 86
    },
    {
        "date": 67.598956916,
        "onset": 87
    },
    {
        "date": 68.399024943,
        "onset": 88
    },
    {
        "date": 69.175328798,
        "onset": 89
    },
    {
        "date": 69.959206349,
        "onset": 90
    },
    {
        "date": 70.751405895,
        "onset": 91
    },
    {
        "date": 71.535306122,
        "onset": 92
    },
    {
        "date": 72.271587301,
        "onset": 93
    },
    {
        "date": 73.079365079,
        "onset": 94
    },
    {
        "date": 73.847256235,
        "onset": 95
    },
    {
        "date": 74.647165532,
        "onset": 96
    },
    {
        "date": 75.46356009,
        "onset": 97
    },
    {
        "date": 76.231247165,
        "onset": 98
    },
    {
        "date": 77.039478458,
        "onset": 99
    },
    {
        "date": 77.799319727,
        "onset": 100
    },
    {
        "date": 78.607074829,
        "onset": 101
    },
    {
        "date": 79.423492063,
        "onset": 102
    },
    {
        "date": 80.223492063,
        "onset": 103
    },
    {
        "date": 80.991292517,
        "onset": 104
    },
    {
        "date": 81.751292517,
        "onset": 105
    },
    {
        "date": 82.519523809,
        "onset": 106
    },
    {
        "date": 83.271428571,
        "onset": 107
    },
    {
        "date": 84.11170068,
        "onset": 108
    },
    {
        "date": 84.84723356,
        "onset": 109
    },
    {
        "date": 85.663219954,
        "onset": 110
    },
    {
        "date": 86.447369614,
        "onset": 111
    },
    {
        "date": 87.223537414,
        "onset": 112
    },
    {
        "date": 87.951428571,
        "onset": 113
    },
    {
        "date": 88.767120181,
        "onset": 114
    },
    {
        "date": 89.58340136,
        "onset": 115
    },
    {
        "date": 90.319455782,
        "onset": 116
    },
    {
        "date": 91.095646258,
        "onset": 117
    },
    {
        "date": 91.879546485,
        "onset": 118
    },
    {
        "date": 92.655623582,
        "onset": 119
    },
    {
        "date": 93.471836734,
        "onset": 120
    },
    {
        "date": 94.255646258,
        "onset": 121
    },
    {
        "date": 95.031496598,
        "onset": 122
    },
    {
        "date": 95.823287981,
        "onset": 123
    },
    {
        "date": 96.599206349,
        "onset": 124
    },
    {
        "date": 97.391179138,
        "onset": 125
    },
    {
        "date": 98.175056689,
        "onset": 126
    },
    {
        "date": 98.983356009,
        "onset": 127
    },
    {
        "date": 99.791405895,
        "onset": 128
    },
    {
        "date": 100.647324263,
        "onset": 129
    },
    {
        "date": 101.495283446,
        "onset": 130
    },
    {
        "date": 102.447664399,
        "onset": 131
    },
    {
        "date": 103.239523809,
        "onset": 132
    },
    {
        "date": 104.01510204,
        "onset": 133
    },
    {
        "date": 104.799229024,
        "onset": 134
    },
    {
        "date": 105.591269841,
        "onset": 135
    },
    {
        "date": 106.407256235,
        "onset": 136
    },
    {
        "date": 107.414875283,
        "onset": 137
    },
    {
        "date": 108.44723356,
        "onset": 138
    }
]