[
    {
        "date": 0.044897959,
        "onset": 0
    },
    {
        "date": 1.044897959,
        "onset": 1
    },
    {
        "date": 2.037528344,
        "onset": 2
    },
    {
        "date": 3.134693877,
        "onset": 3
    },
    {
        "date": 4.179591836,
        "onset": 4
    },
    {
        "date": 5.224489795,
        "onset": 5
    },
    {
        "date": 6.385487528,
        "onset": 6
    },
    {
        "date": 7.523265306,
        "onset": 7
    },
    {
        "date": 8.661043083,
        "onset": 8
    },
    {
        "date": 9.682721088,
        "onset": 9
    },
    {
        "date": 10.797278911,
        "onset": 10
    },
    {
        "date": 11.604036281,
        "onset": 11
    },
    {
        "date": 12.739750566,
        "onset": 12
    },
    {
        "date": 13.855668934,
        "onset": 13
    },
    {
        "date": 14.861814058,
        "onset": 14
    },
    {
        "date": 15.788458049,
        "onset": 15
    },
    {
        "date": 16.814875283,
        "onset": 16
    },
    {
        "date": 17.811020408,
        "onset": 17
    },
    {
        "date": 18.787482993,
        "onset": 18
    },
    {
        "date": 19.823900226,
        "onset": 19
    },
    {
        "date": 20.810272108,
        "onset": 20
    },
    {
        "date": 21.79664399,
        "onset": 21
    },
    {
        "date": 22.842721088,
        "onset": 22
    },
    {
        "date": 23.819138321,
        "onset": 23
    },
    {
        "date": 24.885396825,
        "onset": 24
    },
    {
        "date": 25.89170068,
        "onset": 25
    },
    {
        "date": 26.818526077,
        "onset": 26
    },
    {
        "date": 27.765215419,
        "onset": 27
    },
    {
        "date": 28.672086167,
        "onset": 28
    },
    {
        "date": 29.687981859,
        "onset": 29
    },
    {
        "date": 30.574739229,
        "onset": 30
    },
    {
        "date": 31.521655328,
        "onset": 31
    },
    {
        "date": 32.438208616,
        "onset": 32
    },
    {
        "date": 33.364580498,
        "onset": 33
    },
    {
        "date": 34.261587301,
        "onset": 34
    },
    {
        "date": 35.288072562,
        "onset": 35
    },
    {
        "date": 36.304603174,
        "onset": 36
    },
    {
        "date": 37.33079365,
        "onset": 37
    },
    {
        "date": 38.24755102,
        "onset": 38
    },
    {
        "date": 39.283832199,
        "onset": 39
    },
    {
        "date": 40.200748299,
        "onset": 40
    },
    {
        "date": 41.157414965,
        "onset": 41
    },
    {
        "date": 42.093832199,
        "onset": 42
    },
    {
        "date": 43.110385487,
        "onset": 43
    },
    {
        "date": 44.097029478,
        "onset": 44
    },
    {
        "date": 45.063673469,
        "onset": 45
    },
    {
        "date": 46.100045351,
        "onset": 46
    },
    {
        "date": 47.08664399,
        "onset": 47
    },
    {
        "date": 48.083696145,
        "onset": 48
    },
    {
        "date": 49.020090702,
        "onset": 49
    },
    {
        "date": 50.006916099,
        "onset": 50
    },
    {
        "date": 51.073809523,
        "onset": 51
    },
    {
        "date": 52.0,
        "onset": 52
    },
    {
        "date": 52.966893424,
        "onset": 53
    },
    {
        "date": 53.854172335,
        "onset": 54
    },
    {
        "date": 54.781111111,
        "onset": 55
    },
    {
        "date": 55.707936507,
        "onset": 56
    },
    {
        "date": 56.644920634,
        "onset": 57
    },
    {
        "date": 57.541927437,
        "onset": 58
    },
    {
        "date": 58.588662131,
        "onset": 59
    },
    {
        "date": 59.555487528,
        "onset": 60
    },
    {
        "date": 60.472607709,
        "onset": 61
    },
    {
        "date": 61.499115646,
        "onset": 62
    },
    {
        "date": 62.486099773,
        "onset": 63
    },
    {
        "date": 63.373197278,
        "onset": 64
    },
    {
        "date": 64.340113378,
        "onset": 65
    },
    {
        "date": 65.386870748,
        "onset": 66
    },
    {
        "date": 66.324104308,
        "onset": 67
    },
    {
        "date": 67.281043083,
        "onset": 68
    },
    {
        "date": 68.178480725,
        "onset": 69
    },
    {
        "date": 69.205170068,
        "onset": 70
    },
    {
        "date": 70.182426303,
        "onset": 71
    },
    {
        "date": 71.169546485,
        "onset": 72
    },
    {
        "date": 72.166553287,
        "onset": 73
    },
    {
        "date": 73.133650793,
        "onset": 74
    },
    {
        "date": 74.130702947,
        "onset": 75
    },
    {
        "date": 75.117460317,
        "onset": 76
    },
    {
        "date": 76.104648526,
        "onset": 77
    },
    {
        "date": 77.051927437,
        "onset": 78
    },
    {
        "date": 77.899183673,
        "onset": 79
    },
    {
        "date": 78.776598639,
        "onset": 80
    },
    {
        "date": 79.664648526,
        "onset": 81
    },
    {
        "date": 80.581587301,
        "onset": 82
    },
    {
        "date": 81.678684807,
        "onset": 83
    },
    {
        "date": 82.695578231,
        "onset": 84
    },
    {
        "date": 83.593106575,
        "onset": 85
    },
    {
        "date": 84.650408163,
        "onset": 86
    },
    {
        "date": 85.577505668,
        "onset": 87
    },
    {
        "date": 86.54494331,
        "onset": 88
    },
    {
        "date": 87.472108843,
        "onset": 89
    },
    {
        "date": 88.489433106,
        "onset": 90
    },
    {
        "date": 89.476984126,
        "onset": 91
    },
    {
        "date": 90.36446712,
        "onset": 92
    },
    {
        "date": 91.341655328,
        "onset": 93
    },
    {
        "date": 92.338956916,
        "onset": 94
    },
    {
        "date": 93.32664399,
        "onset": 95
    },
    {
        "date": 94.313945578,
        "onset": 96
    },
    {
        "date": 95.271428571,
        "onset": 97
    },
    {
        "date": 96.358367346,
        "onset": 98
    },
    {
        "date": 97.345578231,
        "onset": 99
    },
    {
        "date": 98.372970521,
        "onset": 100
    },
    {
        "date": 99.390249433,
        "onset": 101
    },
    {
        "date": 100.417369614,
        "onset": 102
    },
    {
        "date": 101.344920634,
        "onset": 103
    },
    {
        "date": 102.332244897,
        "onset": 104
    },
    {
        "date": 103.190385487,
        "onset": 105
    },
    {
        "date": 104.127981859,
        "onset": 106
    },
    {
        "date": 105.045374149,
        "onset": 107
    },
    {
        "date": 106.092902494,
        "onset": 108
    },
    {
        "date": 107.100272108,
        "onset": 109
    },
    {
        "date": 108.018004535,
        "onset": 110
    },
    {
        "date": 108.965578231,
        "onset": 111
    },
    {
        "date": 109.923219954,
        "onset": 112
    },
    {
        "date": 110.831655328,
        "onset": 113
    },
    {
        "date": 111.758594104,
        "onset": 114
    },
    {
        "date": 112.686439909,
        "onset": 115
    },
    {
        "date": 113.584104308,
        "onset": 116
    },
    {
        "date": 114.591451247,
        "onset": 117
    },
    {
        "date": 115.509297052,
        "onset": 118
    },
    {
        "date": 116.516734693,
        "onset": 119
    },
    {
        "date": 117.444376417,
        "onset": 120
    },
    {
        "date": 118.462063492,
        "onset": 121
    },
    {
        "date": 119.479523809,
        "onset": 122
    },
    {
        "date": 120.44739229,
        "onset": 123
    },
    {
        "date": 121.375283446,
        "onset": 124
    },
    {
        "date": 122.392902494,
        "onset": 125
    },
    {
        "date": 123.260589569,
        "onset": 126
    },
    {
        "date": 124.238321995,
        "onset": 127
    },
    {
        "date": 125.285804988,
        "onset": 128
    },
    {
        "date": 126.213673469,
        "onset": 129
    },
    {
        "date": 127.141496598,
        "onset": 130
    },
    {
        "date": 128.04909297,
        "onset": 131
    },
    {
        "date": 129.026870748,
        "onset": 132
    },
    {
        "date": 129.974535147,
        "onset": 133
    },
    {
        "date": 131.002403628,
        "onset": 134
    },
    {
        "date": 132.109795918,
        "onset": 135
    },
    {
        "date": 133.077619047,
        "onset": 136
    },
    {
        "date": 133.966281179,
        "onset": 137
    },
    {
        "date": 134.943333333,
        "onset": 138
    },
    {
        "date": 135.891111111,
        "onset": 139
    },
    {
        "date": 136.819229024,
        "onset": 140
    },
    {
        "date": 137.737097505,
        "onset": 141
    },
    {
        "date": 138.684988662,
        "onset": 142
    },
    {
        "date": 139.592766439,
        "onset": 143
    },
    {
        "date": 140.500907029,
        "onset": 144
    },
    {
        "date": 141.389183673,
        "onset": 145
    },
    {
        "date": 142.31739229,
        "onset": 146
    },
    {
        "date": 143.245532879,
        "onset": 147
    },
    {
        "date": 144.173219954,
        "onset": 148
    },
    {
        "date": 145.061587301,
        "onset": 149
    },
    {
        "date": 145.999841269,
        "onset": 150
    },
    {
        "date": 146.897823129,
        "onset": 151
    },
    {
        "date": 147.775941043,
        "onset": 152
    },
    {
        "date": 148.694126984,
        "onset": 153
    },
    {
        "date": 149.59585034,
        "onset": 154
    },
    {
        "date": 150.500136054,
        "onset": 155
    },
    {
        "date": 151.408662131,
        "onset": 156
    },
    {
        "date": 152.346689342,
        "onset": 157
    },
    {
        "date": 153.294807256,
        "onset": 158
    },
    {
        "date": 154.312834467,
        "onset": 159
    },
    {
        "date": 155.382902494,
        "onset": 160
    },
    {
        "date": 156.408503401,
        "onset": 161
    },
    {
        "date": 157.277029478,
        "onset": 162
    },
    {
        "date": 158.23494331,
        "onset": 163
    },
    {
        "date": 159.123469387,
        "onset": 164
    },
    {
        "date": 160.011814058,
        "onset": 165
    },
    {
        "date": 160.95,
        "onset": 166
    },
    {
        "date": 161.868548752,
        "onset": 167
    },
    {
        "date": 162.906507936,
        "onset": 168
    },
    {
        "date": 163.844535147,
        "onset": 169
    },
    {
        "date": 164.792857142,
        "onset": 170
    },
    {
        "date": 165.780975056,
        "onset": 171
    },
    {
        "date": 166.8192517,
        "onset": 172
    },
    {
        "date": 167.687687074,
        "onset": 173
    },
    {
        "date": 168.596145124,
        "onset": 174
    },
    {
        "date": 169.51462585,
        "onset": 175
    },
    {
        "date": 170.45324263,
        "onset": 176
    },
    {
        "date": 171.351678004,
        "onset": 177
    },
    {
        "date": 172.269773242,
        "onset": 178
    },
    {
        "date": 173.238072562,
        "onset": 179
    },
    {
        "date": 174.146802721,
        "onset": 180
    },
    {
        "date": 175.074920634,
        "onset": 181
    },
    {
        "date": 175.983605442,
        "onset": 182
    },
    {
        "date": 176.921519274,
        "onset": 183
    },
    {
        "date": 177.959841269,
        "onset": 184
    },
    {
        "date": 179.547528344,
        "onset": 185
    },
    {
        "date": 180.68632653,
        "onset": 186
    },
    {
        "date": 181.554058956,
        "onset": 187
    },
    {
        "date": 182.552108843,
        "onset": 188
    },
    {
        "date": 183.540204081,
        "onset": 189
    },
    {
        "date": 184.508662131,
        "onset": 190
    },
    {
        "date": 185.437142857,
        "onset": 191
    },
    {
        "date": 186.375283446,
        "onset": 192
    },
    {
        "date": 187.343900226,
        "onset": 193
    },
    {
        "date": 188.232766439,
        "onset": 194
    },
    {
        "date": 189.131315192,
        "onset": 195
    },
    {
        "date": 190.069773242,
        "onset": 196
    },
    {
        "date": 191.008412698,
        "onset": 197
    },
    {
        "date": 191.99739229,
        "onset": 198
    },
    {
        "date": 193.035895691,
        "onset": 199
    },
    {
        "date": 194.034580498,
        "onset": 200
    },
    {
        "date": 194.992811791,
        "onset": 201
    },
    {
        "date": 196.001405895,
        "onset": 202
    },
    {
        "date": 197.029750566,
        "onset": 203
    },
    {
        "date": 198.008390022,
        "onset": 204
    },
    {
        "date": 198.897505668,
        "onset": 205
    },
    {
        "date": 199.91585034,
        "onset": 206
    },
    {
        "date": 200.914444444,
        "onset": 207
    },
    {
        "date": 201.903582766,
        "onset": 208
    },
    {
        "date": 202.782267573,
        "onset": 209
    },
    {
        "date": 203.870839002,
        "onset": 210
    },
    {
        "date": 204.95941043,
        "onset": 211
    },
    {
        "date": 205.878253968,
        "onset": 212
    },
    {
        "date": 206.807301587,
        "onset": 213
    },
    {
        "date": 207.786145124,
        "onset": 214
    },
    {
        "date": 208.674648526,
        "onset": 215
    },
    {
        "date": 209.603424036,
        "onset": 216
    },
    {
        "date": 210.542517006,
        "onset": 217
    },
    {
        "date": 211.401632653,
        "onset": 218
    },
    {
        "date": 212.460385487,
        "onset": 219
    },
    {
        "date": 213.359206349,
        "onset": 220
    },
    {
        "date": 214.437936507,
        "onset": 221
    },
    {
        "date": 215.356893424,
        "onset": 222
    },
    {
        "date": 216.325600907,
        "onset": 223
    },
    {
        "date": 217.184807256,
        "onset": 224
    },
    {
        "date": 218.393537414,
        "onset": 225
    },
    {
        "date": 219.322607709,
        "onset": 226
    },
    {
        "date": 220.331473922,
        "onset": 227
    },
    {
        "date": 221.78,
        "onset": 228
    },
    {
        "date": 223.458412698,
        "onset": 229
    },
    {
        "date": 224.587210884,
        "onset": 230
    }
]