[
  {
    "onset": 0,
    "date": 0
  },
  {
    "onset": 8,
    "date": 13.238942255064302
  },
  {
    "onset": 12,
    "date": 20.602614278591194
  },
  {
    "onset": 16,
    "date": 27.41792774717459
  },
  {
    "onset": 24,
    "date": 41.59691323928488
  },
  {
    "onset": 32,
    "date": 55.070866303610686
  },
  {
    "onset": 44,
    "date": 75.04678509083789
  },
  {
    "onset": 48,
    "date": 81.15706613163681
  },
  {
    "onset": 72,
    "date": 119.46382804126074
  },
  {
    "onset": 84,
    "date": 137.71633422723698
  },
  {
    "onset": 92,
    "date": 149.8585593724143
  },
  {
    "onset": 112,
    "date": 180.40996457640884
  },
  {
    "onset": 126,
    "date": 201.40426353710257
  },
  {
    "onset": 136,
    "date": 215.97493371131534
  },
  {
    "onset": 148,
    "date": 233.91409215160957
  },
  {
    "onset": 160,
    "date": 252.2449352740063
  },
  {
    "onset": 168,
    "date": 264.1521496099221
  },
  {
    "onset": 172,
    "date": 270.1840937143005
  },
  {
    "onset": 180,
    "date": 282.0129711137959
  },
  {
    "onset": 188,
    "date": 293.9201854497117
  },
  {
    "onset": 192,
    "date": 299.95212955409005
  },
  {
    "onset": 196,
    "date": 305.9840736584685
  },
  {
    "onset": 200,
    "date": 311.5459961443239
  },
  {
    "onset": 213,
    "date": 331.6785888043922
  },
  {
    "onset": 222,
    "date": 345.23087880513845
  },
  {
    "onset": 238,
    "date": 369.1236444133906
  },
  {
    "onset": 248,
    "date": 384.8693686339108
  },
  {
    "onset": 276,
    "date": 426.85796655529816
  },
  {
    "onset": 280,
    "date": 432.5765629139946
  },
  {
    "onset": 286,
    "date": 442.055332220875
  },
  {
    "onset": 288,
    "date": 444.7187880591719
  },
  {
    "onset": 292,
    "date": 451.14241684565286
  },
  {
    "onset": 296,
    "date": 457.8010564413953
  },
  {
    "onset": 298.02150537634407,
    "date": 461.4045555167381
  },
  {
    "onset": 300,
    "date": 465.0863915285017
  }
]