-- Merging decision tree log ---
application
INJECTED from /home/alfonso/Documentos/app2TaxiApp-main (otra copia)/android/app/src/main/AndroidManifest.xml:19:5-53:19
MERGED from [:flutter_email_sender] /home/alfonso/Documentos/app2TaxiApp-main (otra copia)/build/flutter_email_sender/intermediates/merged_manifest/release/AndroidManifest.xml:9:5-19:19
MERGED from [:flutter_email_sender] /home/alfonso/Documentos/app2TaxiApp-main (otra copia)/build/flutter_email_sender/intermediates/merged_manifest/release/AndroidManifest.xml:9:5-19:19
MERGED from [:image_picker_android] /home/alfonso/Documentos/app2TaxiApp-main (otra copia)/build/image_picker_android/intermediates/merged_manifest/release/AndroidManifest.xml:9:5-19:19
MERGED from [:image_picker_android] /home/alfonso/Documentos/app2TaxiApp-main (otra copia)/build/image_picker_android/intermediates/merged_manifest/release/AndroidManifest.xml:9:5-19:19
MERGED from [:url_launcher_android] /home/alfonso/Documentos/app2TaxiApp-main (otra copia)/build/url_launcher_android/intermediates/merged_manifest/release/AndroidManifest.xml:9:5-14:19
MERGED from [:url_launcher_android] /home/alfonso/Documentos/app2TaxiApp-main (otra copia)/build/url_launcher_android/intermediates/merged_manifest/release/AndroidManifest.xml:9:5-14:19
MERGED from [:share_plus] /home/alfonso/Documentos/app2TaxiApp-main (otra copia)/build/share_plus/intermediates/merged_manifest/release/AndroidManifest.xml:9:5-35:19
MERGED from [:share_plus] /home/alfonso/Documentos/app2TaxiApp-main (otra copia)/build/share_plus/intermediates/merged_manifest/release/AndroidManifest.xml:9:5-35:19
MERGED from [:share] /home/alfonso/Documentos/app2TaxiApp-main (otra copia)/build/share/intermediates/merged_manifest/release/AndroidManifest.xml:9:5-19:19
MERGED from [:share] /home/alfonso/Documentos/app2TaxiApp-main (otra copia)/build/share/intermediates/merged_manifest/release/AndroidManifest.xml:9:5-19:19
MERGED from [androidx.emoji2:emoji2:1.2.0] /home/alfonso/.gradle/caches/transforms-3/3f4870f52e66a35beb5313c1c423bc49/transformed/jetified-emoji2-1.2.0/AndroidManifest.xml:23:5-33:19
MERGED from [androidx.emoji2:emoji2:1.2.0] /home/alfonso/.gradle/caches/transforms-3/3f4870f52e66a35beb5313c1c423bc49/transformed/jetified-emoji2-1.2.0/AndroidManifest.xml:23:5-33:19
MERGED from [androidx.window:window:1.0.0-beta04] /home/alfonso/.gradle/caches/transforms-3/86a1a9f6804c8fc691a553244f0de821/transformed/jetified-window-1.0.0-beta04/AndroidManifest.xml:24:5-31:19
MERGED from [androidx.window:window:1.0.0-beta04] /home/alfonso/.gradle/caches/transforms-3/86a1a9f6804c8fc691a553244f0de821/transformed/jetified-window-1.0.0-beta04/AndroidManifest.xml:24:5-31:19
MERGED from [androidx.core:core:1.10.1] /home/alfonso/.gradle/caches/transforms-3/4b92544d0249f0b3f3043d7256944654/transformed/core-1.10.1/AndroidManifest.xml:28:5-89
MERGED from [androidx.core:core:1.10.1] /home/alfonso/.gradle/caches/transforms-3/4b92544d0249f0b3f3043d7256944654/transformed/core-1.10.1/AndroidManifest.xml:28:5-89
MERGED from [androidx.lifecycle:lifecycle-process:2.6.1] /home/alfonso/.gradle/caches/transforms-3/6dc013a577521d6e7ca2fcdf9bbc8700/transformed/jetified-lifecycle-process-2.6.1/AndroidManifest.xml:23:5-33:19
MERGED from [androidx.lifecycle:lifecycle-process:2.6.1] /home/alfonso/.gradle/caches/transforms-3/6dc013a577521d6e7ca2fcdf9bbc8700/transformed/jetified-lifecycle-process-2.6.1/AndroidManifest.xml:23:5-33:19
MERGED from [androidx.profileinstaller:profileinstaller:1.3.0] /home/alfonso/.gradle/caches/transforms-3/944dd7286e61e5229e404ec4831130f9/transformed/jetified-profileinstaller-1.3.0/AndroidManifest.xml:23:5-53:19
MERGED from [androidx.profileinstaller:profileinstaller:1.3.0] /home/alfonso/.gradle/caches/transforms-3/944dd7286e61e5229e404ec4831130f9/transformed/jetified-profileinstaller-1.3.0/AndroidManifest.xml:23:5-53:19
MERGED from [androidx.startup:startup-runtime:1.1.1] /home/alfonso/.gradle/caches/transforms-3/c7a9c6623619f1dd977da03d5042e4d6/transformed/jetified-startup-runtime-1.1.1/AndroidManifest.xml:25:5-31:19
MERGED from [androidx.startup:startup-runtime:1.1.1] /home/alfonso/.gradle/caches/transforms-3/c7a9c6623619f1dd977da03d5042e4d6/transformed/jetified-startup-runtime-1.1.1/AndroidManifest.xml:25:5-31:19
MERGED from [androidx.versionedparcelable:versionedparcelable:1.1.1] /home/alfonso/.gradle/caches/transforms-3/3757e4ba9f7c57762e08b8a0c6c81bbe/transformed/versionedparcelable-1.1.1/AndroidManifest.xml:24:5-25:19
MERGED from [androidx.versionedparcelable:versionedparcelable:1.1.1] /home/alfonso/.gradle/caches/transforms-3/3757e4ba9f7c57762e08b8a0c6c81bbe/transformed/versionedparcelable-1.1.1/AndroidManifest.xml:24:5-25:19
	android:requestLegacyExternalStorage
		ADDED from /home/alfonso/Documentos/app2TaxiApp-main (otra copia)/android/app/src/main/AndroidManifest.xml:20:9-52
	android:appComponentFactory
		ADDED from [androidx.core:core:1.10.1] /home/alfonso/.gradle/caches/transforms-3/4b92544d0249f0b3f3043d7256944654/transformed/core-1.10.1/AndroidManifest.xml:28:18-86
	android:label
		ADDED from /home/alfonso/Documentos/app2TaxiApp-main (otra copia)/android/app/src/main/AndroidManifest.xml:21:9-49
	android:icon
		ADDED from /home/alfonso/Documentos/app2TaxiApp-main (otra copia)/android/app/src/main/AndroidManifest.xml:23:9-43
	android:name
		INJECTED from /home/alfonso/Documentos/app2TaxiApp-main (otra copia)/android/app/src/main/AndroidManifest.xml
		ADDED from /home/alfonso/Documentos/app2TaxiApp-main (otra copia)/android/app/src/main/AndroidManifest.xml:22:9-42
manifest
ADDED from /home/alfonso/Documentos/app2TaxiApp-main (otra copia)/android/app/src/main/AndroidManifest.xml:1:1-54:12
INJECTED from /home/alfonso/Documentos/app2TaxiApp-main (otra copia)/android/app/src/main/AndroidManifest.xml:1:1-54:12
INJECTED from /home/alfonso/Documentos/app2TaxiApp-main (otra copia)/android/app/src/main/AndroidManifest.xml:1:1-54:12
INJECTED from /home/alfonso/Documentos/app2TaxiApp-main (otra copia)/android/app/src/main/AndroidManifest.xml:1:1-54:12
MERGED from [:flutter_pdfview] /home/alfonso/Documentos/app2TaxiApp-main (otra copia)/build/flutter_pdfview/intermediates/merged_manifest/release/AndroidManifest.xml:2:1-9:12
MERGED from [:flutter_email_sender] /home/alfonso/Documentos/app2TaxiApp-main (otra copia)/build/flutter_email_sender/intermediates/merged_manifest/release/AndroidManifest.xml:2:1-21:12
MERGED from [:image_picker_android] /home/alfonso/Documentos/app2TaxiApp-main (otra copia)/build/image_picker_android/intermediates/merged_manifest/release/AndroidManifest.xml:2:1-21:12
MERGED from [:flutter_plugin_android_lifecycle] /home/alfonso/Documentos/app2TaxiApp-main (otra copia)/build/flutter_plugin_android_lifecycle/intermediates/merged_manifest/release/AndroidManifest.xml:2:1-9:12
MERGED from [:sqflite] /home/alfonso/Documentos/app2TaxiApp-main (otra copia)/build/sqflite/intermediates/merged_manifest/release/AndroidManifest.xml:2:1-9:12
MERGED from [:url_launcher_android] /home/alfonso/Documentos/app2TaxiApp-main (otra copia)/build/url_launcher_android/intermediates/merged_manifest/release/AndroidManifest.xml:2:1-16:12
MERGED from [:path_provider_android] /home/alfonso/Documentos/app2TaxiApp-main (otra copia)/build/path_provider_android/intermediates/merged_manifest/release/AndroidManifest.xml:2:1-9:12
MERGED from [:shared_preferences_android] /home/alfonso/Documentos/app2TaxiApp-main (otra copia)/build/shared_preferences_android/intermediates/merged_manifest/release/AndroidManifest.xml:2:1-9:12
MERGED from [:permission_handler_android] /home/alfonso/Documentos/app2TaxiApp-main (otra copia)/build/permission_handler_android/intermediates/merged_manifest/release/AndroidManifest.xml:2:1-9:12
MERGED from [:flutter_localization] /home/alfonso/Documentos/app2TaxiApp-main (otra copia)/build/flutter_localization/intermediates/merged_manifest/release/AndroidManifest.xml:2:1-9:12
MERGED from [:file_saver] /home/alfonso/Documentos/app2TaxiApp-main (otra copia)/build/file_saver/intermediates/merged_manifest/release/AndroidManifest.xml:2:1-9:12
MERGED from [:share_plus] /home/alfonso/Documentos/app2TaxiApp-main (otra copia)/build/share_plus/intermediates/merged_manifest/release/AndroidManifest.xml:2:1-37:12
MERGED from [:fluttertoast] /home/alfonso/Documentos/app2TaxiApp-main (otra copia)/build/fluttertoast/intermediates/merged_manifest/release/AndroidManifest.xml:2:1-9:12
MERGED from [:share] /home/alfonso/Documentos/app2TaxiApp-main (otra copia)/build/share/intermediates/merged_manifest/release/AndroidManifest.xml:2:1-21:12
MERGED from [:ssh2] /home/alfonso/Documentos/app2TaxiApp-main (otra copia)/build/ssh2/intermediates/merged_manifest/release/AndroidManifest.xml:2:1-9:12
MERGED from [:package_info] /home/alfonso/Documentos/app2TaxiApp-main (otra copia)/build/package_info/intermediates/merged_manifest/release/AndroidManifest.xml:2:1-9:12
MERGED from [androidx.multidex:multidex:2.0.0] /home/alfonso/.gradle/caches/transforms-3/22097d077dc99ac107e21d594a6c0fe5/transformed/multidex-2.0.0/AndroidManifest.xml:17:1-22:12
MERGED from [androidx.appcompat:appcompat-resources:1.6.1] /home/alfonso/.gradle/caches/transforms-3/30e7b5ea2a21ba0f4c18caaf8346bbbd/transformed/jetified-appcompat-resources-1.6.1/AndroidManifest.xml:17:1-22:12
MERGED from [androidx.appcompat:appcompat:1.6.1] /home/alfonso/.gradle/caches/transforms-3/cace34fd55611e5e01a680882ae9663e/transformed/appcompat-1.6.1/AndroidManifest.xml:17:1-22:12
MERGED from [androidx.fragment:fragment:1.3.6] /home/alfonso/.gradle/caches/transforms-3/2330095f494b7857251464fc57c40089/transformed/fragment-1.3.6/AndroidManifest.xml:17:1-24:12
MERGED from [androidx.activity:activity:1.7.2] /home/alfonso/.gradle/caches/transforms-3/672f0cb6d94bd06893c8f8336b808675/transformed/jetified-activity-1.7.2/AndroidManifest.xml:17:1-22:12
MERGED from [com.github.mhiew:android-pdf-viewer:3.2.0-beta.3] /home/alfonso/.gradle/caches/transforms-3/9480ab05d832635d1ee81d31369fd5a3/transformed/jetified-android-pdf-viewer-3.2.0-beta.3/AndroidManifest.xml:2:1-9:12
MERGED from [androidx.browser:browser:1.5.0] /home/alfonso/.gradle/caches/transforms-3/30027bfbd9e54405aceee619331e1acd/transformed/browser-1.5.0/AndroidManifest.xml:17:1-22:12
MERGED from [androidx.core:core-ktx:1.10.1] /home/alfonso/.gradle/caches/transforms-3/945efad9495c3aac72d41212ece9d33a/transformed/jetified-core-ktx-1.10.1/AndroidManifest.xml:2:1-7:12
MERGED from [androidx.window:window-java:1.0.0-beta04] /home/alfonso/.gradle/caches/transforms-3/5a5a752a30ef8f927b89ee5d02868eb5/transformed/jetified-window-java-1.0.0-beta04/AndroidManifest.xml:17:1-23:12
MERGED from [androidx.drawerlayout:drawerlayout:1.0.0] /home/alfonso/.gradle/caches/transforms-3/7aac97f11010ffaee482f38819d0ff82/transformed/drawerlayout-1.0.0/AndroidManifest.xml:17:1-22:12
MERGED from [androidx.emoji2:emoji2-views-helper:1.2.0] /home/alfonso/.gradle/caches/transforms-3/322b4c2c99b96150743fdae02de0602c/transformed/jetified-emoji2-views-helper-1.2.0/AndroidManifest.xml:2:1-7:12
MERGED from [androidx.emoji2:emoji2:1.2.0] /home/alfonso/.gradle/caches/transforms-3/3f4870f52e66a35beb5313c1c423bc49/transformed/jetified-emoji2-1.2.0/AndroidManifest.xml:17:1-35:12
MERGED from [androidx.window:window:1.0.0-beta04] /home/alfonso/.gradle/caches/transforms-3/86a1a9f6804c8fc691a553244f0de821/transformed/jetified-window-1.0.0-beta04/AndroidManifest.xml:17:1-33:12
MERGED from [androidx.viewpager:viewpager:1.0.0] /home/alfonso/.gradle/caches/transforms-3/5faa45a78a86daacdf37cfcbaa2d92bf/transformed/viewpager-1.0.0/AndroidManifest.xml:17:1-22:12
MERGED from [androidx.loader:loader:1.0.0] /home/alfonso/.gradle/caches/transforms-3/eb8270a030bd61ed24fb89e4f5417e6b/transformed/loader-1.0.0/AndroidManifest.xml:17:1-22:12
MERGED from [androidx.vectordrawable:vectordrawable-animated:1.1.0] /home/alfonso/.gradle/caches/transforms-3/0773dbe781a6f7546880987adee57d97/transformed/vectordrawable-animated-1.1.0/AndroidManifest.xml:17:1-24:12
MERGED from [androidx.vectordrawable:vectordrawable:1.1.0] /home/alfonso/.gradle/caches/transforms-3/794e1a09ecd1dae88f4f0c07f7da530b/transformed/vectordrawable-1.1.0/AndroidManifest.xml:17:1-24:12
MERGED from [androidx.customview:customview:1.0.0] /home/alfonso/.gradle/caches/transforms-3/ccaf06dd2e117bc9a446ec93cce838cf/transformed/customview-1.0.0/AndroidManifest.xml:17:1-22:12
MERGED from [androidx.core:core:1.10.1] /home/alfonso/.gradle/caches/transforms-3/4b92544d0249f0b3f3043d7256944654/transformed/core-1.10.1/AndroidManifest.xml:17:1-30:12
MERGED from [androidx.savedstate:savedstate:1.2.1] /home/alfonso/.gradle/caches/transforms-3/734735b133d6dd1aaede5bcf1f7e70b3/transformed/jetified-savedstate-1.2.1/AndroidManifest.xml:17:1-22:12
MERGED from [androidx.lifecycle:lifecycle-livedata:2.6.1] /home/alfonso/.gradle/caches/transforms-3/f3972de4a328129a485128b25e672d80/transformed/lifecycle-livedata-2.6.1/AndroidManifest.xml:17:1-22:12
MERGED from [androidx.lifecycle:lifecycle-process:2.6.1] /home/alfonso/.gradle/caches/transforms-3/6dc013a577521d6e7ca2fcdf9bbc8700/transformed/jetified-lifecycle-process-2.6.1/AndroidManifest.xml:17:1-35:12
MERGED from [androidx.lifecycle:lifecycle-livedata-core:2.6.1] /home/alfonso/.gradle/caches/transforms-3/ee9ddd3f34581c52ab6e8f6ffbb8e6b9/transformed/lifecycle-livedata-core-2.6.1/AndroidManifest.xml:17:1-22:12
MERGED from [androidx.lifecycle:lifecycle-viewmodel:2.6.1] /home/alfonso/.gradle/caches/transforms-3/3d77cac0c5bd08c98068aad033b07920/transformed/lifecycle-viewmodel-2.6.1/AndroidManifest.xml:17:1-22:12
MERGED from [androidx.lifecycle:lifecycle-runtime:2.6.1] /home/alfonso/.gradle/caches/transforms-3/a28155e884e31b6853935e2fdf155b2f/transformed/lifecycle-runtime-2.6.1/AndroidManifest.xml:2:1-7:12
MERGED from [androidx.lifecycle:lifecycle-viewmodel-savedstate:2.6.1] /home/alfonso/.gradle/caches/transforms-3/ede134254ad8b5df06d14c6c5f05e505/transformed/jetified-lifecycle-viewmodel-savedstate-2.6.1/AndroidManifest.xml:17:1-22:12
MERGED from [androidx.exifinterface:exifinterface:1.3.6] /home/alfonso/.gradle/caches/transforms-3/19e36f6b7bf87af1139bc100bce23ada/transformed/exifinterface-1.3.6/AndroidManifest.xml:17:1-24:12
MERGED from [androidx.profileinstaller:profileinstaller:1.3.0] /home/alfonso/.gradle/caches/transforms-3/944dd7286e61e5229e404ec4831130f9/transformed/jetified-profileinstaller-1.3.0/AndroidManifest.xml:17:1-55:12
MERGED from [androidx.startup:startup-runtime:1.1.1] /home/alfonso/.gradle/caches/transforms-3/c7a9c6623619f1dd977da03d5042e4d6/transformed/jetified-startup-runtime-1.1.1/AndroidManifest.xml:17:1-33:12
MERGED from [androidx.tracing:tracing:1.0.0] /home/alfonso/.gradle/caches/transforms-3/2a5ae7bc1fe485d15cb7371532c3b957/transformed/jetified-tracing-1.0.0/AndroidManifest.xml:17:1-24:12
MERGED from [androidx.cursoradapter:cursoradapter:1.0.0] /home/alfonso/.gradle/caches/transforms-3/62c37de77671fe1592b8503b43755d2f/transformed/cursoradapter-1.0.0/AndroidManifest.xml:17:1-22:12
MERGED from [androidx.interpolator:interpolator:1.0.0] /home/alfonso/.gradle/caches/transforms-3/9f68adf02329b3da2d4e3a77227a93aa/transformed/interpolator-1.0.0/AndroidManifest.xml:17:1-22:12
MERGED from [androidx.versionedparcelable:versionedparcelable:1.1.1] /home/alfonso/.gradle/caches/transforms-3/3757e4ba9f7c57762e08b8a0c6c81bbe/transformed/versionedparcelable-1.1.1/AndroidManifest.xml:17:1-27:12
MERGED from [androidx.arch.core:core-runtime:2.2.0] /home/alfonso/.gradle/caches/transforms-3/83423b23084a10a491581626c565712f/transformed/core-runtime-2.2.0/AndroidManifest.xml:17:1-22:12
MERGED from [androidx.annotation:annotation-experimental:1.3.0] /home/alfonso/.gradle/caches/transforms-3/44049b3042c2654fa25a6d78148e1e65/transformed/jetified-annotation-experimental-1.3.0/AndroidManifest.xml:17:1-22:12
MERGED from [com.github.mhiew:pdfium-android:1.9.2] /home/alfonso/.gradle/caches/transforms-3/efca1deafb878acfd338294094dcab34/transformed/jetified-pdfium-android-1.9.2/AndroidManifest.xml:2:1-9:12
INJECTED from /home/alfonso/Documentos/app2TaxiApp-main (otra copia)/android/app/src/main/AndroidManifest.xml:1:1-54:12
INJECTED from /home/alfonso/Documentos/app2TaxiApp-main (otra copia)/android/app/src/main/AndroidManifest.xml:1:1-54:12
INJECTED from /home/alfonso/Documentos/app2TaxiApp-main (otra copia)/android/app/src/main/AndroidManifest.xml:1:1-54:12
	package
		INJECTED from /home/alfonso/Documentos/app2TaxiApp-main (otra copia)/android/app/src/main/AndroidManifest.xml
		ADDED from /home/alfonso/Documentos/app2TaxiApp-main (otra copia)/android/app/src/main/AndroidManifest.xml:1:1-54:12
		INJECTED from /home/alfonso/Documentos/app2TaxiApp-main (otra copia)/android/app/src/main/AndroidManifest.xml
	android:versionName
		INJECTED from /home/alfonso/Documentos/app2TaxiApp-main (otra copia)/android/app/src/main/AndroidManifest.xml
		ADDED from /home/alfonso/Documentos/app2TaxiApp-main (otra copia)/android/app/src/main/AndroidManifest.xml:1:1-54:12
		INJECTED from /home/alfonso/Documentos/app2TaxiApp-main (otra copia)/android/app/src/main/AndroidManifest.xml
	android:versionCode
		INJECTED from /home/alfonso/Documentos/app2TaxiApp-main (otra copia)/android/app/src/main/AndroidManifest.xml
		ADDED from /home/alfonso/Documentos/app2TaxiApp-main (otra copia)/android/app/src/main/AndroidManifest.xml:1:1-54:12
		INJECTED from /home/alfonso/Documentos/app2TaxiApp-main (otra copia)/android/app/src/main/AndroidManifest.xml
	xmlns:android
		ADDED from /home/alfonso/Documentos/app2TaxiApp-main (otra copia)/android/app/src/main/AndroidManifest.xml:1:11-69
queries
ADDED from /home/alfonso/Documentos/app2TaxiApp-main (otra copia)/android/app/src/main/AndroidManifest.xml:3:5-8:15
intent#action:name:android.intent.action.SENDTO+data:scheme:mailto
ADDED from /home/alfonso/Documentos/app2TaxiApp-main (otra copia)/android/app/src/main/AndroidManifest.xml:4:9-7:18
action#android.intent.action.SENDTO
ADDED from /home/alfonso/Documentos/app2TaxiApp-main (otra copia)/android/app/src/main/AndroidManifest.xml:5:13-67
	android:name
		ADDED from /home/alfonso/Documentos/app2TaxiApp-main (otra copia)/android/app/src/main/AndroidManifest.xml:5:21-64
data
ADDED from /home/alfonso/Documentos/app2TaxiApp-main (otra copia)/android/app/src/main/AndroidManifest.xml:6:13-45
	android:scheme
		ADDED from /home/alfonso/Documentos/app2TaxiApp-main (otra copia)/android/app/src/main/AndroidManifest.xml:6:19-42
uses-feature#android.hardware.camera
ADDED from /home/alfonso/Documentos/app2TaxiApp-main (otra copia)/android/app/src/main/AndroidManifest.xml:10:5-12:36
	android:required
		ADDED from /home/alfonso/Documentos/app2TaxiApp-main (otra copia)/android/app/src/main/AndroidManifest.xml:12:9-33
	android:name
		ADDED from /home/alfonso/Documentos/app2TaxiApp-main (otra copia)/android/app/src/main/AndroidManifest.xml:11:9-47
uses-permission#android.permission.INTERNET
ADDED from /home/alfonso/Documentos/app2TaxiApp-main (otra copia)/android/app/src/main/AndroidManifest.xml:14:5-67
	android:name
		ADDED from /home/alfonso/Documentos/app2TaxiApp-main (otra copia)/android/app/src/main/AndroidManifest.xml:14:22-64
uses-permission#android.permission.ACCESS_NETWORK_STATE
ADDED from /home/alfonso/Documentos/app2TaxiApp-main (otra copia)/android/app/src/main/AndroidManifest.xml:15:5-79
	android:name
		ADDED from /home/alfonso/Documentos/app2TaxiApp-main (otra copia)/android/app/src/main/AndroidManifest.xml:15:22-76
uses-permission#android.permission.CAMERA
ADDED from /home/alfonso/Documentos/app2TaxiApp-main (otra copia)/android/app/src/main/AndroidManifest.xml:16:5-65
	android:name
		ADDED from /home/alfonso/Documentos/app2TaxiApp-main (otra copia)/android/app/src/main/AndroidManifest.xml:16:22-62
uses-permission#android.permission.FLASHLIGHT
ADDED from /home/alfonso/Documentos/app2TaxiApp-main (otra copia)/android/app/src/main/AndroidManifest.xml:17:5-69
	android:name
		ADDED from /home/alfonso/Documentos/app2TaxiApp-main (otra copia)/android/app/src/main/AndroidManifest.xml:17:22-66
uses-sdk
INJECTED from /home/alfonso/Documentos/app2TaxiApp-main (otra copia)/android/app/src/main/AndroidManifest.xml reason: use-sdk injection requested
INJECTED from /home/alfonso/Documentos/app2TaxiApp-main (otra copia)/android/app/src/main/AndroidManifest.xml
INJECTED from /home/alfonso/Documentos/app2TaxiApp-main (otra copia)/android/app/src/main/AndroidManifest.xml
MERGED from [:flutter_pdfview] /home/alfonso/Documentos/app2TaxiApp-main (otra copia)/build/flutter_pdfview/intermediates/merged_manifest/release/AndroidManifest.xml:5:5-7:41
MERGED from [:flutter_pdfview] /home/alfonso/Documentos/app2TaxiApp-main (otra copia)/build/flutter_pdfview/intermediates/merged_manifest/release/AndroidManifest.xml:5:5-7:41
MERGED from [:flutter_email_sender] /home/alfonso/Documentos/app2TaxiApp-main (otra copia)/build/flutter_email_sender/intermediates/merged_manifest/release/AndroidManifest.xml:5:5-7:41
MERGED from [:flutter_email_sender] /home/alfonso/Documentos/app2TaxiApp-main (otra copia)/build/flutter_email_sender/intermediates/merged_manifest/release/AndroidManifest.xml:5:5-7:41
MERGED from [:image_picker_android] /home/alfonso/Documentos/app2TaxiApp-main (otra copia)/build/image_picker_android/intermediates/merged_manifest/release/AndroidManifest.xml:5:5-7:41
MERGED from [:image_picker_android] /home/alfonso/Documentos/app2TaxiApp-main (otra copia)/build/image_picker_android/intermediates/merged_manifest/release/AndroidManifest.xml:5:5-7:41
MERGED from [:flutter_plugin_android_lifecycle] /home/alfonso/Documentos/app2TaxiApp-main (otra copia)/build/flutter_plugin_android_lifecycle/intermediates/merged_manifest/release/AndroidManifest.xml:5:5-7:41
MERGED from [:flutter_plugin_android_lifecycle] /home/alfonso/Documentos/app2TaxiApp-main (otra copia)/build/flutter_plugin_android_lifecycle/intermediates/merged_manifest/release/AndroidManifest.xml:5:5-7:41
MERGED from [:sqflite] /home/alfonso/Documentos/app2TaxiApp-main (otra copia)/build/sqflite/intermediates/merged_manifest/release/AndroidManifest.xml:5:5-7:41
MERGED from [:sqflite] /home/alfonso/Documentos/app2TaxiApp-main (otra copia)/build/sqflite/intermediates/merged_manifest/release/AndroidManifest.xml:5:5-7:41
MERGED from [:url_launcher_android] /home/alfonso/Documentos/app2TaxiApp-main (otra copia)/build/url_launcher_android/intermediates/merged_manifest/release/AndroidManifest.xml:5:5-7:41
MERGED from [:url_launcher_android] /home/alfonso/Documentos/app2TaxiApp-main (otra copia)/build/url_launcher_android/intermediates/merged_manifest/release/AndroidManifest.xml:5:5-7:41
MERGED from [:path_provider_android] /home/alfonso/Documentos/app2TaxiApp-main (otra copia)/build/path_provider_android/intermediates/merged_manifest/release/AndroidManifest.xml:5:5-7:41
MERGED from [:path_provider_android] /home/alfonso/Documentos/app2TaxiApp-main (otra copia)/build/path_provider_android/intermediates/merged_manifest/release/AndroidManifest.xml:5:5-7:41
MERGED from [:shared_preferences_android] /home/alfonso/Documentos/app2TaxiApp-main (otra copia)/build/shared_preferences_android/intermediates/merged_manifest/release/AndroidManifest.xml:5:5-7:41
MERGED from [:shared_preferences_android] /home/alfonso/Documentos/app2TaxiApp-main (otra copia)/build/shared_preferences_android/intermediates/merged_manifest/release/AndroidManifest.xml:5:5-7:41
MERGED from [:permission_handler_android] /home/alfonso/Documentos/app2TaxiApp-main (otra copia)/build/permission_handler_android/intermediates/merged_manifest/release/AndroidManifest.xml:5:5-7:41
MERGED from [:permission_handler_android] /home/alfonso/Documentos/app2TaxiApp-main (otra copia)/build/permission_handler_android/intermediates/merged_manifest/release/AndroidManifest.xml:5:5-7:41
MERGED from [:flutter_localization] /home/alfonso/Documentos/app2TaxiApp-main (otra copia)/build/flutter_localization/intermediates/merged_manifest/release/AndroidManifest.xml:5:5-7:41
MERGED from [:flutter_localization] /home/alfonso/Documentos/app2TaxiApp-main (otra copia)/build/flutter_localization/intermediates/merged_manifest/release/AndroidManifest.xml:5:5-7:41
MERGED from [:file_saver] /home/alfonso/Documentos/app2TaxiApp-main (otra copia)/build/file_saver/intermediates/merged_manifest/release/AndroidManifest.xml:5:5-7:41
MERGED from [:file_saver] /home/alfonso/Documentos/app2TaxiApp-main (otra copia)/build/file_saver/intermediates/merged_manifest/release/AndroidManifest.xml:5:5-7:41
MERGED from [:share_plus] /home/alfonso/Documentos/app2TaxiApp-main (otra copia)/build/share_plus/intermediates/merged_manifest/release/AndroidManifest.xml:5:5-7:41
MERGED from [:share_plus] /home/alfonso/Documentos/app2TaxiApp-main (otra copia)/build/share_plus/intermediates/merged_manifest/release/AndroidManifest.xml:5:5-7:41
MERGED from [:fluttertoast] /home/alfonso/Documentos/app2TaxiApp-main (otra copia)/build/fluttertoast/intermediates/merged_manifest/release/AndroidManifest.xml:5:5-7:41
MERGED from [:fluttertoast] /home/alfonso/Documentos/app2TaxiApp-main (otra copia)/build/fluttertoast/intermediates/merged_manifest/release/AndroidManifest.xml:5:5-7:41
MERGED from [:share] /home/alfonso/Documentos/app2TaxiApp-main (otra copia)/build/share/intermediates/merged_manifest/release/AndroidManifest.xml:5:5-7:41
MERGED from [:share] /home/alfonso/Documentos/app2TaxiApp-main (otra copia)/build/share/intermediates/merged_manifest/release/AndroidManifest.xml:5:5-7:41
MERGED from [:ssh2] /home/alfonso/Documentos/app2TaxiApp-main (otra copia)/build/ssh2/intermediates/merged_manifest/release/AndroidManifest.xml:5:5-7:41
MERGED from [:ssh2] /home/alfonso/Documentos/app2TaxiApp-main (otra copia)/build/ssh2/intermediates/merged_manifest/release/AndroidManifest.xml:5:5-7:41
MERGED from [:package_info] /home/alfonso/Documentos/app2TaxiApp-main (otra copia)/build/package_info/intermediates/merged_manifest/release/AndroidManifest.xml:5:5-7:41
MERGED from [:package_info] /home/alfonso/Documentos/app2TaxiApp-main (otra copia)/build/package_info/intermediates/merged_manifest/release/AndroidManifest.xml:5:5-7:41
MERGED from [androidx.multidex:multidex:2.0.0] /home/alfonso/.gradle/caches/transforms-3/22097d077dc99ac107e21d594a6c0fe5/transformed/multidex-2.0.0/AndroidManifest.xml:20:5-43
MERGED from [androidx.multidex:multidex:2.0.0] /home/alfonso/.gradle/caches/transforms-3/22097d077dc99ac107e21d594a6c0fe5/transformed/multidex-2.0.0/AndroidManifest.xml:20:5-43
MERGED from [androidx.appcompat:appcompat-resources:1.6.1] /home/alfonso/.gradle/caches/transforms-3/30e7b5ea2a21ba0f4c18caaf8346bbbd/transformed/jetified-appcompat-resources-1.6.1/AndroidManifest.xml:20:5-44
MERGED from [androidx.appcompat:appcompat-resources:1.6.1] /home/alfonso/.gradle/caches/transforms-3/30e7b5ea2a21ba0f4c18caaf8346bbbd/transformed/jetified-appcompat-resources-1.6.1/AndroidManifest.xml:20:5-44
MERGED from [androidx.appcompat:appcompat:1.6.1] /home/alfonso/.gradle/caches/transforms-3/cace34fd55611e5e01a680882ae9663e/transformed/appcompat-1.6.1/AndroidManifest.xml:20:5-44
MERGED from [androidx.appcompat:appcompat:1.6.1] /home/alfonso/.gradle/caches/transforms-3/cace34fd55611e5e01a680882ae9663e/transformed/appcompat-1.6.1/AndroidManifest.xml:20:5-44
MERGED from [androidx.fragment:fragment:1.3.6] /home/alfonso/.gradle/caches/transforms-3/2330095f494b7857251464fc57c40089/transformed/fragment-1.3.6/AndroidManifest.xml:20:5-22:41
MERGED from [androidx.fragment:fragment:1.3.6] /home/alfonso/.gradle/caches/transforms-3/2330095f494b7857251464fc57c40089/transformed/fragment-1.3.6/AndroidManifest.xml:20:5-22:41
MERGED from [androidx.activity:activity:1.7.2] /home/alfonso/.gradle/caches/transforms-3/672f0cb6d94bd06893c8f8336b808675/transformed/jetified-activity-1.7.2/AndroidManifest.xml:20:5-44
MERGED from [androidx.activity:activity:1.7.2] /home/alfonso/.gradle/caches/transforms-3/672f0cb6d94bd06893c8f8336b808675/transformed/jetified-activity-1.7.2/AndroidManifest.xml:20:5-44
MERGED from [com.github.mhiew:android-pdf-viewer:3.2.0-beta.3] /home/alfonso/.gradle/caches/transforms-3/9480ab05d832635d1ee81d31369fd5a3/transformed/jetified-android-pdf-viewer-3.2.0-beta.3/AndroidManifest.xml:5:5-7:41
MERGED from [com.github.mhiew:android-pdf-viewer:3.2.0-beta.3] /home/alfonso/.gradle/caches/transforms-3/9480ab05d832635d1ee81d31369fd5a3/transformed/jetified-android-pdf-viewer-3.2.0-beta.3/AndroidManifest.xml:5:5-7:41
MERGED from [androidx.browser:browser:1.5.0] /home/alfonso/.gradle/caches/transforms-3/30027bfbd9e54405aceee619331e1acd/transformed/browser-1.5.0/AndroidManifest.xml:20:5-44
MERGED from [androidx.browser:browser:1.5.0] /home/alfonso/.gradle/caches/transforms-3/30027bfbd9e54405aceee619331e1acd/transformed/browser-1.5.0/AndroidManifest.xml:20:5-44
MERGED from [androidx.core:core-ktx:1.10.1] /home/alfonso/.gradle/caches/transforms-3/945efad9495c3aac72d41212ece9d33a/transformed/jetified-core-ktx-1.10.1/AndroidManifest.xml:5:5-44
MERGED from [androidx.core:core-ktx:1.10.1] /home/alfonso/.gradle/caches/transforms-3/945efad9495c3aac72d41212ece9d33a/transformed/jetified-core-ktx-1.10.1/AndroidManifest.xml:5:5-44
MERGED from [androidx.window:window-java:1.0.0-beta04] /home/alfonso/.gradle/caches/transforms-3/5a5a752a30ef8f927b89ee5d02868eb5/transformed/jetified-window-java-1.0.0-beta04/AndroidManifest.xml:19:5-21:41
MERGED from [androidx.window:window-java:1.0.0-beta04] /home/alfonso/.gradle/caches/transforms-3/5a5a752a30ef8f927b89ee5d02868eb5/transformed/jetified-window-java-1.0.0-beta04/AndroidManifest.xml:19:5-21:41
MERGED from [androidx.drawerlayout:drawerlayout:1.0.0] /home/alfonso/.gradle/caches/transforms-3/7aac97f11010ffaee482f38819d0ff82/transformed/drawerlayout-1.0.0/AndroidManifest.xml:20:5-44
MERGED from [androidx.drawerlayout:drawerlayout:1.0.0] /home/alfonso/.gradle/caches/transforms-3/7aac97f11010ffaee482f38819d0ff82/transformed/drawerlayout-1.0.0/AndroidManifest.xml:20:5-44
MERGED from [androidx.emoji2:emoji2-views-helper:1.2.0] /home/alfonso/.gradle/caches/transforms-3/322b4c2c99b96150743fdae02de0602c/transformed/jetified-emoji2-views-helper-1.2.0/AndroidManifest.xml:5:5-44
MERGED from [androidx.emoji2:emoji2-views-helper:1.2.0] /home/alfonso/.gradle/caches/transforms-3/322b4c2c99b96150743fdae02de0602c/transformed/jetified-emoji2-views-helper-1.2.0/AndroidManifest.xml:5:5-44
MERGED from [androidx.emoji2:emoji2:1.2.0] /home/alfonso/.gradle/caches/transforms-3/3f4870f52e66a35beb5313c1c423bc49/transformed/jetified-emoji2-1.2.0/AndroidManifest.xml:21:5-44
MERGED from [androidx.emoji2:emoji2:1.2.0] /home/alfonso/.gradle/caches/transforms-3/3f4870f52e66a35beb5313c1c423bc49/transformed/jetified-emoji2-1.2.0/AndroidManifest.xml:21:5-44
MERGED from [androidx.window:window:1.0.0-beta04] /home/alfonso/.gradle/caches/transforms-3/86a1a9f6804c8fc691a553244f0de821/transformed/jetified-window-1.0.0-beta04/AndroidManifest.xml:20:5-22:41
MERGED from [androidx.window:window:1.0.0-beta04] /home/alfonso/.gradle/caches/transforms-3/86a1a9f6804c8fc691a553244f0de821/transformed/jetified-window-1.0.0-beta04/AndroidManifest.xml:20:5-22:41
MERGED from [androidx.viewpager:viewpager:1.0.0] /home/alfonso/.gradle/caches/transforms-3/5faa45a78a86daacdf37cfcbaa2d92bf/transformed/viewpager-1.0.0/AndroidManifest.xml:20:5-44
MERGED from [androidx.viewpager:viewpager:1.0.0] /home/alfonso/.gradle/caches/transforms-3/5faa45a78a86daacdf37cfcbaa2d92bf/transformed/viewpager-1.0.0/AndroidManifest.xml:20:5-44
MERGED from [androidx.loader:loader:1.0.0] /home/alfonso/.gradle/caches/transforms-3/eb8270a030bd61ed24fb89e4f5417e6b/transformed/loader-1.0.0/AndroidManifest.xml:20:5-44
MERGED from [androidx.loader:loader:1.0.0] /home/alfonso/.gradle/caches/transforms-3/eb8270a030bd61ed24fb89e4f5417e6b/transformed/loader-1.0.0/AndroidManifest.xml:20:5-44
MERGED from [androidx.vectordrawable:vectordrawable-animated:1.1.0] /home/alfonso/.gradle/caches/transforms-3/0773dbe781a6f7546880987adee57d97/transformed/vectordrawable-animated-1.1.0/AndroidManifest.xml:20:5-22:41
MERGED from [androidx.vectordrawable:vectordrawable-animated:1.1.0] /home/alfonso/.gradle/caches/transforms-3/0773dbe781a6f7546880987adee57d97/transformed/vectordrawable-animated-1.1.0/AndroidManifest.xml:20:5-22:41
MERGED from [androidx.vectordrawable:vectordrawable:1.1.0] /home/alfonso/.gradle/caches/transforms-3/794e1a09ecd1dae88f4f0c07f7da530b/transformed/vectordrawable-1.1.0/AndroidManifest.xml:20:5-22:41
MERGED from [androidx.vectordrawable:vectordrawable:1.1.0] /home/alfonso/.gradle/caches/transforms-3/794e1a09ecd1dae88f4f0c07f7da530b/transformed/vectordrawable-1.1.0/AndroidManifest.xml:20:5-22:41
MERGED from [androidx.customview:customview:1.0.0] /home/alfonso/.gradle/caches/transforms-3/ccaf06dd2e117bc9a446ec93cce838cf/transformed/customview-1.0.0/AndroidManifest.xml:20:5-44
MERGED from [androidx.customview:customview:1.0.0] /home/alfonso/.gradle/caches/transforms-3/ccaf06dd2e117bc9a446ec93cce838cf/transformed/customview-1.0.0/AndroidManifest.xml:20:5-44
MERGED from [androidx.core:core:1.10.1] /home/alfonso/.gradle/caches/transforms-3/4b92544d0249f0b3f3043d7256944654/transformed/core-1.10.1/AndroidManifest.xml:20:5-44
MERGED from [androidx.core:core:1.10.1] /home/alfonso/.gradle/caches/transforms-3/4b92544d0249f0b3f3043d7256944654/transformed/core-1.10.1/AndroidManifest.xml:20:5-44
MERGED from [androidx.savedstate:savedstate:1.2.1] /home/alfonso/.gradle/caches/transforms-3/734735b133d6dd1aaede5bcf1f7e70b3/transformed/jetified-savedstate-1.2.1/AndroidManifest.xml:20:5-44
MERGED from [androidx.savedstate:savedstate:1.2.1] /home/alfonso/.gradle/caches/transforms-3/734735b133d6dd1aaede5bcf1f7e70b3/transformed/jetified-savedstate-1.2.1/AndroidManifest.xml:20:5-44
MERGED from [androidx.lifecycle:lifecycle-livedata:2.6.1] /home/alfonso/.gradle/caches/transforms-3/f3972de4a328129a485128b25e672d80/transformed/lifecycle-livedata-2.6.1/AndroidManifest.xml:20:5-44
MERGED from [androidx.lifecycle:lifecycle-livedata:2.6.1] /home/alfonso/.gradle/caches/transforms-3/f3972de4a328129a485128b25e672d80/transformed/lifecycle-livedata-2.6.1/AndroidManifest.xml:20:5-44
MERGED from [androidx.lifecycle:lifecycle-process:2.6.1] /home/alfonso/.gradle/caches/transforms-3/6dc013a577521d6e7ca2fcdf9bbc8700/transformed/jetified-lifecycle-process-2.6.1/AndroidManifest.xml:21:5-44
MERGED from [androidx.lifecycle:lifecycle-process:2.6.1] /home/alfonso/.gradle/caches/transforms-3/6dc013a577521d6e7ca2fcdf9bbc8700/transformed/jetified-lifecycle-process-2.6.1/AndroidManifest.xml:21:5-44
MERGED from [androidx.lifecycle:lifecycle-livedata-core:2.6.1] /home/alfonso/.gradle/caches/transforms-3/ee9ddd3f34581c52ab6e8f6ffbb8e6b9/transformed/lifecycle-livedata-core-2.6.1/AndroidManifest.xml:20:5-44
MERGED from [androidx.lifecycle:lifecycle-livedata-core:2.6.1] /home/alfonso/.gradle/caches/transforms-3/ee9ddd3f34581c52ab6e8f6ffbb8e6b9/transformed/lifecycle-livedata-core-2.6.1/AndroidManifest.xml:20:5-44
MERGED from [androidx.lifecycle:lifecycle-viewmodel:2.6.1] /home/alfonso/.gradle/caches/transforms-3/3d77cac0c5bd08c98068aad033b07920/transformed/lifecycle-viewmodel-2.6.1/AndroidManifest.xml:20:5-44
MERGED from [androidx.lifecycle:lifecycle-viewmodel:2.6.1] /home/alfonso/.gradle/caches/transforms-3/3d77cac0c5bd08c98068aad033b07920/transformed/lifecycle-viewmodel-2.6.1/AndroidManifest.xml:20:5-44
MERGED from [androidx.lifecycle:lifecycle-runtime:2.6.1] /home/alfonso/.gradle/caches/transforms-3/a28155e884e31b6853935e2fdf155b2f/transformed/lifecycle-runtime-2.6.1/AndroidManifest.xml:5:5-44
MERGED from [androidx.lifecycle:lifecycle-runtime:2.6.1] /home/alfonso/.gradle/caches/transforms-3/a28155e884e31b6853935e2fdf155b2f/transformed/lifecycle-runtime-2.6.1/AndroidManifest.xml:5:5-44
MERGED from [androidx.lifecycle:lifecycle-viewmodel-savedstate:2.6.1] /home/alfonso/.gradle/caches/transforms-3/ede134254ad8b5df06d14c6c5f05e505/transformed/jetified-lifecycle-viewmodel-savedstate-2.6.1/AndroidManifest.xml:20:5-44
MERGED from [androidx.lifecycle:lifecycle-viewmodel-savedstate:2.6.1] /home/alfonso/.gradle/caches/transforms-3/ede134254ad8b5df06d14c6c5f05e505/transformed/jetified-lifecycle-viewmodel-savedstate-2.6.1/AndroidManifest.xml:20:5-44
MERGED from [androidx.exifinterface:exifinterface:1.3.6] /home/alfonso/.gradle/caches/transforms-3/19e36f6b7bf87af1139bc100bce23ada/transformed/exifinterface-1.3.6/AndroidManifest.xml:20:5-22:41
MERGED from [androidx.exifinterface:exifinterface:1.3.6] /home/alfonso/.gradle/caches/transforms-3/19e36f6b7bf87af1139bc100bce23ada/transformed/exifinterface-1.3.6/AndroidManifest.xml:20:5-22:41
MERGED from [androidx.profileinstaller:profileinstaller:1.3.0] /home/alfonso/.gradle/caches/transforms-3/944dd7286e61e5229e404ec4831130f9/transformed/jetified-profileinstaller-1.3.0/AndroidManifest.xml:21:5-44
MERGED from [androidx.profileinstaller:profileinstaller:1.3.0] /home/alfonso/.gradle/caches/transforms-3/944dd7286e61e5229e404ec4831130f9/transformed/jetified-profileinstaller-1.3.0/AndroidManifest.xml:21:5-44
MERGED from [androidx.startup:startup-runtime:1.1.1] /home/alfonso/.gradle/caches/transforms-3/c7a9c6623619f1dd977da03d5042e4d6/transformed/jetified-startup-runtime-1.1.1/AndroidManifest.xml:21:5-23:41
MERGED from [androidx.startup:startup-runtime:1.1.1] /home/alfonso/.gradle/caches/transforms-3/c7a9c6623619f1dd977da03d5042e4d6/transformed/jetified-startup-runtime-1.1.1/AndroidManifest.xml:21:5-23:41
MERGED from [androidx.tracing:tracing:1.0.0] /home/alfonso/.gradle/caches/transforms-3/2a5ae7bc1fe485d15cb7371532c3b957/transformed/jetified-tracing-1.0.0/AndroidManifest.xml:20:5-22:41
MERGED from [androidx.tracing:tracing:1.0.0] /home/alfonso/.gradle/caches/transforms-3/2a5ae7bc1fe485d15cb7371532c3b957/transformed/jetified-tracing-1.0.0/AndroidManifest.xml:20:5-22:41
MERGED from [androidx.cursoradapter:cursoradapter:1.0.0] /home/alfonso/.gradle/caches/transforms-3/62c37de77671fe1592b8503b43755d2f/transformed/cursoradapter-1.0.0/AndroidManifest.xml:20:5-44
MERGED from [androidx.cursoradapter:cursoradapter:1.0.0] /home/alfonso/.gradle/caches/transforms-3/62c37de77671fe1592b8503b43755d2f/transformed/cursoradapter-1.0.0/AndroidManifest.xml:20:5-44
MERGED from [androidx.interpolator:interpolator:1.0.0] /home/alfonso/.gradle/caches/transforms-3/9f68adf02329b3da2d4e3a77227a93aa/transformed/interpolator-1.0.0/AndroidManifest.xml:20:5-44
MERGED from [androidx.interpolator:interpolator:1.0.0] /home/alfonso/.gradle/caches/transforms-3/9f68adf02329b3da2d4e3a77227a93aa/transformed/interpolator-1.0.0/AndroidManifest.xml:20:5-44
MERGED from [androidx.versionedparcelable:versionedparcelable:1.1.1] /home/alfonso/.gradle/caches/transforms-3/3757e4ba9f7c57762e08b8a0c6c81bbe/transformed/versionedparcelable-1.1.1/AndroidManifest.xml:20:5-22:41
MERGED from [androidx.versionedparcelable:versionedparcelable:1.1.1] /home/alfonso/.gradle/caches/transforms-3/3757e4ba9f7c57762e08b8a0c6c81bbe/transformed/versionedparcelable-1.1.1/AndroidManifest.xml:20:5-22:41
MERGED from [androidx.arch.core:core-runtime:2.2.0] /home/alfonso/.gradle/caches/transforms-3/83423b23084a10a491581626c565712f/transformed/core-runtime-2.2.0/AndroidManifest.xml:20:5-44
MERGED from [androidx.arch.core:core-runtime:2.2.0] /home/alfonso/.gradle/caches/transforms-3/83423b23084a10a491581626c565712f/transformed/core-runtime-2.2.0/AndroidManifest.xml:20:5-44
MERGED from [androidx.annotation:annotation-experimental:1.3.0] /home/alfonso/.gradle/caches/transforms-3/44049b3042c2654fa25a6d78148e1e65/transformed/jetified-annotation-experimental-1.3.0/AndroidManifest.xml:20:5-44
MERGED from [androidx.annotation:annotation-experimental:1.3.0] /home/alfonso/.gradle/caches/transforms-3/44049b3042c2654fa25a6d78148e1e65/transformed/jetified-annotation-experimental-1.3.0/AndroidManifest.xml:20:5-44
MERGED from [com.github.mhiew:pdfium-android:1.9.2] /home/alfonso/.gradle/caches/transforms-3/efca1deafb878acfd338294094dcab34/transformed/jetified-pdfium-android-1.9.2/AndroidManifest.xml:5:5-7:41
MERGED from [com.github.mhiew:pdfium-android:1.9.2] /home/alfonso/.gradle/caches/transforms-3/efca1deafb878acfd338294094dcab34/transformed/jetified-pdfium-android-1.9.2/AndroidManifest.xml:5:5-7:41
INJECTED from /home/alfonso/Documentos/app2TaxiApp-main (otra copia)/android/app/src/main/AndroidManifest.xml
INJECTED from /home/alfonso/Documentos/app2TaxiApp-main (otra copia)/android/app/src/main/AndroidManifest.xml
	android:targetSdkVersion
		INJECTED from /home/alfonso/Documentos/app2TaxiApp-main (otra copia)/android/app/src/main/AndroidManifest.xml
		ADDED from /home/alfonso/Documentos/app2TaxiApp-main (otra copia)/android/app/src/main/AndroidManifest.xml
		INJECTED from /home/alfonso/Documentos/app2TaxiApp-main (otra copia)/android/app/src/main/AndroidManifest.xml
	android:minSdkVersion
		INJECTED from /home/alfonso/Documentos/app2TaxiApp-main (otra copia)/android/app/src/main/AndroidManifest.xml
		ADDED from /home/alfonso/Documentos/app2TaxiApp-main (otra copia)/android/app/src/main/AndroidManifest.xml
		INJECTED from /home/alfonso/Documentos/app2TaxiApp-main (otra copia)/android/app/src/main/AndroidManifest.xml
activity#com.example.admin_taxi_app.MainActivity
ADDED from /home/alfonso/Documentos/app2TaxiApp-main (otra copia)/android/app/src/main/AndroidManifest.xml:27:9-47:20
	android:launchMode
		ADDED from /home/alfonso/Documentos/app2TaxiApp-main (otra copia)/android/app/src/main/AndroidManifest.xml:30:13-43
	android:hardwareAccelerated
		ADDED from /home/alfonso/Documentos/app2TaxiApp-main (otra copia)/android/app/src/main/AndroidManifest.xml:33:13-47
	android:windowSoftInputMode
		ADDED from /home/alfonso/Documentos/app2TaxiApp-main (otra copia)/android/app/src/main/AndroidManifest.xml:34:13-55
	android:exported
		ADDED from /home/alfonso/Documentos/app2TaxiApp-main (otra copia)/android/app/src/main/AndroidManifest.xml:29:13-36
	android:configChanges
		ADDED from /home/alfonso/Documentos/app2TaxiApp-main (otra copia)/android/app/src/main/AndroidManifest.xml:32:13-163
	android:theme
		ADDED from /home/alfonso/Documentos/app2TaxiApp-main (otra copia)/android/app/src/main/AndroidManifest.xml:31:13-47
	android:name
		ADDED from /home/alfonso/Documentos/app2TaxiApp-main (otra copia)/android/app/src/main/AndroidManifest.xml:28:13-41
meta-data#io.flutter.embedding.android.NormalTheme
ADDED from /home/alfonso/Documentos/app2TaxiApp-main (otra copia)/android/app/src/main/AndroidManifest.xml:39:13-42:17
	android:resource
		ADDED from /home/alfonso/Documentos/app2TaxiApp-main (otra copia)/android/app/src/main/AndroidManifest.xml:41:15-52
	android:name
		ADDED from /home/alfonso/Documentos/app2TaxiApp-main (otra copia)/android/app/src/main/AndroidManifest.xml:40:15-70
intent-filter#action:name:android.intent.action.MAIN+category:name:android.intent.category.LAUNCHER
ADDED from /home/alfonso/Documentos/app2TaxiApp-main (otra copia)/android/app/src/main/AndroidManifest.xml:43:13-46:29
action#android.intent.action.MAIN
ADDED from /home/alfonso/Documentos/app2TaxiApp-main (otra copia)/android/app/src/main/AndroidManifest.xml:44:17-68
	android:name
		ADDED from /home/alfonso/Documentos/app2TaxiApp-main (otra copia)/android/app/src/main/AndroidManifest.xml:44:25-66
category#android.intent.category.LAUNCHER
ADDED from /home/alfonso/Documentos/app2TaxiApp-main (otra copia)/android/app/src/main/AndroidManifest.xml:45:17-76
	android:name
		ADDED from /home/alfonso/Documentos/app2TaxiApp-main (otra copia)/android/app/src/main/AndroidManifest.xml:45:27-74
meta-data#flutterEmbedding
ADDED from /home/alfonso/Documentos/app2TaxiApp-main (otra copia)/android/app/src/main/AndroidManifest.xml:50:9-52:33
	android:value
		ADDED from /home/alfonso/Documentos/app2TaxiApp-main (otra copia)/android/app/src/main/AndroidManifest.xml:52:13-30
	android:name
		ADDED from /home/alfonso/Documentos/app2TaxiApp-main (otra copia)/android/app/src/main/AndroidManifest.xml:51:13-44
provider#com.sidlatau.flutteremailsender.FlutterEmailSenderFileProvider
ADDED from [:flutter_email_sender] /home/alfonso/Documentos/app2TaxiApp-main (otra copia)/build/flutter_email_sender/intermediates/merged_manifest/release/AndroidManifest.xml:10:9-18:20
	android:grantUriPermissions
		ADDED from [:flutter_email_sender] /home/alfonso/Documentos/app2TaxiApp-main (otra copia)/build/flutter_email_sender/intermediates/merged_manifest/release/AndroidManifest.xml:14:13-47
	android:authorities
		ADDED from [:flutter_email_sender] /home/alfonso/Documentos/app2TaxiApp-main (otra copia)/build/flutter_email_sender/intermediates/merged_manifest/release/AndroidManifest.xml:12:13-65
	android:exported
		ADDED from [:flutter_email_sender] /home/alfonso/Documentos/app2TaxiApp-main (otra copia)/build/flutter_email_sender/intermediates/merged_manifest/release/AndroidManifest.xml:13:13-37
	android:name
		ADDED from [:flutter_email_sender] /home/alfonso/Documentos/app2TaxiApp-main (otra copia)/build/flutter_email_sender/intermediates/merged_manifest/release/AndroidManifest.xml:11:13-90
meta-data#android.support.FILE_PROVIDER_PATHS
ADDED from [:flutter_email_sender] /home/alfonso/Documentos/app2TaxiApp-main (otra copia)/build/flutter_email_sender/intermediates/merged_manifest/release/AndroidManifest.xml:15:13-17:61
	android:resource
		ADDED from [:flutter_email_sender] /home/alfonso/Documentos/app2TaxiApp-main (otra copia)/build/flutter_email_sender/intermediates/merged_manifest/release/AndroidManifest.xml:17:17-58
	android:name
		ADDED from [:flutter_email_sender] /home/alfonso/Documentos/app2TaxiApp-main (otra copia)/build/flutter_email_sender/intermediates/merged_manifest/release/AndroidManifest.xml:16:17-67
provider#io.flutter.plugins.imagepicker.ImagePickerFileProvider
ADDED from [:image_picker_android] /home/alfonso/Documentos/app2TaxiApp-main (otra copia)/build/image_picker_android/intermediates/merged_manifest/release/AndroidManifest.xml:10:9-18:20
	android:grantUriPermissions
		ADDED from [:image_picker_android] /home/alfonso/Documentos/app2TaxiApp-main (otra copia)/build/image_picker_android/intermediates/merged_manifest/release/AndroidManifest.xml:14:13-47
	android:authorities
		ADDED from [:image_picker_android] /home/alfonso/Documentos/app2TaxiApp-main (otra copia)/build/image_picker_android/intermediates/merged_manifest/release/AndroidManifest.xml:12:13-74
	android:exported
		ADDED from [:image_picker_android] /home/alfonso/Documentos/app2TaxiApp-main (otra copia)/build/image_picker_android/intermediates/merged_manifest/release/AndroidManifest.xml:13:13-37
	android:name
		ADDED from [:image_picker_android] /home/alfonso/Documentos/app2TaxiApp-main (otra copia)/build/image_picker_android/intermediates/merged_manifest/release/AndroidManifest.xml:11:13-82
activity#io.flutter.plugins.urllauncher.WebViewActivity
ADDED from [:url_launcher_android] /home/alfonso/Documentos/app2TaxiApp-main (otra copia)/build/url_launcher_android/intermediates/merged_manifest/release/AndroidManifest.xml:10:9-13:74
	android:exported
		ADDED from [:url_launcher_android] /home/alfonso/Documentos/app2TaxiApp-main (otra copia)/build/url_launcher_android/intermediates/merged_manifest/release/AndroidManifest.xml:12:13-37
	android:theme
		ADDED from [:url_launcher_android] /home/alfonso/Documentos/app2TaxiApp-main (otra copia)/build/url_launcher_android/intermediates/merged_manifest/release/AndroidManifest.xml:13:13-71
	android:name
		ADDED from [:url_launcher_android] /home/alfonso/Documentos/app2TaxiApp-main (otra copia)/build/url_launcher_android/intermediates/merged_manifest/release/AndroidManifest.xml:11:13-74
provider#dev.fluttercommunity.plus.share.ShareFileProvider
ADDED from [:share_plus] /home/alfonso/Documentos/app2TaxiApp-main (otra copia)/build/share_plus/intermediates/merged_manifest/release/AndroidManifest.xml:15:9-23:20
	android:grantUriPermissions
		ADDED from [:share_plus] /home/alfonso/Documentos/app2TaxiApp-main (otra copia)/build/share_plus/intermediates/merged_manifest/release/AndroidManifest.xml:19:13-47
	android:authorities
		ADDED from [:share_plus] /home/alfonso/Documentos/app2TaxiApp-main (otra copia)/build/share_plus/intermediates/merged_manifest/release/AndroidManifest.xml:17:13-74
	android:exported
		ADDED from [:share_plus] /home/alfonso/Documentos/app2TaxiApp-main (otra copia)/build/share_plus/intermediates/merged_manifest/release/AndroidManifest.xml:18:13-37
	android:name
		ADDED from [:share_plus] /home/alfonso/Documentos/app2TaxiApp-main (otra copia)/build/share_plus/intermediates/merged_manifest/release/AndroidManifest.xml:16:13-77
receiver#dev.fluttercommunity.plus.share.SharePlusPendingIntent
ADDED from [:share_plus] /home/alfonso/Documentos/app2TaxiApp-main (otra copia)/build/share_plus/intermediates/merged_manifest/release/AndroidManifest.xml:28:9-34:20
	android:exported
		ADDED from [:share_plus] /home/alfonso/Documentos/app2TaxiApp-main (otra copia)/build/share_plus/intermediates/merged_manifest/release/AndroidManifest.xml:30:13-37
	android:name
		ADDED from [:share_plus] /home/alfonso/Documentos/app2TaxiApp-main (otra copia)/build/share_plus/intermediates/merged_manifest/release/AndroidManifest.xml:29:13-82
intent-filter#action:name:EXTRA_CHOSEN_COMPONENT
ADDED from [:share_plus] /home/alfonso/Documentos/app2TaxiApp-main (otra copia)/build/share_plus/intermediates/merged_manifest/release/AndroidManifest.xml:31:13-33:29
action#EXTRA_CHOSEN_COMPONENT
ADDED from [:share_plus] /home/alfonso/Documentos/app2TaxiApp-main (otra copia)/build/share_plus/intermediates/merged_manifest/release/AndroidManifest.xml:32:17-65
	android:name
		ADDED from [:share_plus] /home/alfonso/Documentos/app2TaxiApp-main (otra copia)/build/share_plus/intermediates/merged_manifest/release/AndroidManifest.xml:32:25-62
provider#io.flutter.plugins.share.ShareFileProvider
ADDED from [:share] /home/alfonso/Documentos/app2TaxiApp-main (otra copia)/build/share/intermediates/merged_manifest/release/AndroidManifest.xml:10:9-18:20
	android:grantUriPermissions
		ADDED from [:share] /home/alfonso/Documentos/app2TaxiApp-main (otra copia)/build/share/intermediates/merged_manifest/release/AndroidManifest.xml:14:13-47
	android:authorities
		ADDED from [:share] /home/alfonso/Documentos/app2TaxiApp-main (otra copia)/build/share/intermediates/merged_manifest/release/AndroidManifest.xml:12:13-74
	android:exported
		ADDED from [:share] /home/alfonso/Documentos/app2TaxiApp-main (otra copia)/build/share/intermediates/merged_manifest/release/AndroidManifest.xml:13:13-37
	android:name
		ADDED from [:share] /home/alfonso/Documentos/app2TaxiApp-main (otra copia)/build/share/intermediates/merged_manifest/release/AndroidManifest.xml:11:13-70
provider#androidx.startup.InitializationProvider
ADDED from [androidx.emoji2:emoji2:1.2.0] /home/alfonso/.gradle/caches/transforms-3/3f4870f52e66a35beb5313c1c423bc49/transformed/jetified-emoji2-1.2.0/AndroidManifest.xml:24:9-32:20
MERGED from [androidx.lifecycle:lifecycle-process:2.6.1] /home/alfonso/.gradle/caches/transforms-3/6dc013a577521d6e7ca2fcdf9bbc8700/transformed/jetified-lifecycle-process-2.6.1/AndroidManifest.xml:24:9-32:20
MERGED from [androidx.lifecycle:lifecycle-process:2.6.1] /home/alfonso/.gradle/caches/transforms-3/6dc013a577521d6e7ca2fcdf9bbc8700/transformed/jetified-lifecycle-process-2.6.1/AndroidManifest.xml:24:9-32:20
MERGED from [androidx.profileinstaller:profileinstaller:1.3.0] /home/alfonso/.gradle/caches/transforms-3/944dd7286e61e5229e404ec4831130f9/transformed/jetified-profileinstaller-1.3.0/AndroidManifest.xml:24:9-32:20
MERGED from [androidx.profileinstaller:profileinstaller:1.3.0] /home/alfonso/.gradle/caches/transforms-3/944dd7286e61e5229e404ec4831130f9/transformed/jetified-profileinstaller-1.3.0/AndroidManifest.xml:24:9-32:20
MERGED from [androidx.startup:startup-runtime:1.1.1] /home/alfonso/.gradle/caches/transforms-3/c7a9c6623619f1dd977da03d5042e4d6/transformed/jetified-startup-runtime-1.1.1/AndroidManifest.xml:26:9-30:34
MERGED from [androidx.startup:startup-runtime:1.1.1] /home/alfonso/.gradle/caches/transforms-3/c7a9c6623619f1dd977da03d5042e4d6/transformed/jetified-startup-runtime-1.1.1/AndroidManifest.xml:26:9-30:34
	tools:node
		ADDED from [androidx.emoji2:emoji2:1.2.0] /home/alfonso/.gradle/caches/transforms-3/3f4870f52e66a35beb5313c1c423bc49/transformed/jetified-emoji2-1.2.0/AndroidManifest.xml:28:13-31
	android:authorities
		ADDED from [androidx.emoji2:emoji2:1.2.0] /home/alfonso/.gradle/caches/transforms-3/3f4870f52e66a35beb5313c1c423bc49/transformed/jetified-emoji2-1.2.0/AndroidManifest.xml:26:13-68
	android:exported
		ADDED from [androidx.emoji2:emoji2:1.2.0] /home/alfonso/.gradle/caches/transforms-3/3f4870f52e66a35beb5313c1c423bc49/transformed/jetified-emoji2-1.2.0/AndroidManifest.xml:27:13-37
	android:name
		ADDED from [androidx.emoji2:emoji2:1.2.0] /home/alfonso/.gradle/caches/transforms-3/3f4870f52e66a35beb5313c1c423bc49/transformed/jetified-emoji2-1.2.0/AndroidManifest.xml:25:13-67
meta-data#androidx.emoji2.text.EmojiCompatInitializer
ADDED from [androidx.emoji2:emoji2:1.2.0] /home/alfonso/.gradle/caches/transforms-3/3f4870f52e66a35beb5313c1c423bc49/transformed/jetified-emoji2-1.2.0/AndroidManifest.xml:29:13-31:52
	android:value
		ADDED from [androidx.emoji2:emoji2:1.2.0] /home/alfonso/.gradle/caches/transforms-3/3f4870f52e66a35beb5313c1c423bc49/transformed/jetified-emoji2-1.2.0/AndroidManifest.xml:31:17-49
	android:name
		ADDED from [androidx.emoji2:emoji2:1.2.0] /home/alfonso/.gradle/caches/transforms-3/3f4870f52e66a35beb5313c1c423bc49/transformed/jetified-emoji2-1.2.0/AndroidManifest.xml:30:17-75
uses-library#androidx.window.extensions
ADDED from [androidx.window:window:1.0.0-beta04] /home/alfonso/.gradle/caches/transforms-3/86a1a9f6804c8fc691a553244f0de821/transformed/jetified-window-1.0.0-beta04/AndroidManifest.xml:25:9-27:40
	android:required
		ADDED from [androidx.window:window:1.0.0-beta04] /home/alfonso/.gradle/caches/transforms-3/86a1a9f6804c8fc691a553244f0de821/transformed/jetified-window-1.0.0-beta04/AndroidManifest.xml:27:13-37
	android:name
		ADDED from [androidx.window:window:1.0.0-beta04] /home/alfonso/.gradle/caches/transforms-3/86a1a9f6804c8fc691a553244f0de821/transformed/jetified-window-1.0.0-beta04/AndroidManifest.xml:26:13-54
uses-library#androidx.window.sidecar
ADDED from [androidx.window:window:1.0.0-beta04] /home/alfonso/.gradle/caches/transforms-3/86a1a9f6804c8fc691a553244f0de821/transformed/jetified-window-1.0.0-beta04/AndroidManifest.xml:28:9-30:40
	android:required
		ADDED from [androidx.window:window:1.0.0-beta04] /home/alfonso/.gradle/caches/transforms-3/86a1a9f6804c8fc691a553244f0de821/transformed/jetified-window-1.0.0-beta04/AndroidManifest.xml:30:13-37
	android:name
		ADDED from [androidx.window:window:1.0.0-beta04] /home/alfonso/.gradle/caches/transforms-3/86a1a9f6804c8fc691a553244f0de821/transformed/jetified-window-1.0.0-beta04/AndroidManifest.xml:29:13-51
permission#${applicationId}.DYNAMIC_RECEIVER_NOT_EXPORTED_PERMISSION
ADDED from [androidx.core:core:1.10.1] /home/alfonso/.gradle/caches/transforms-3/4b92544d0249f0b3f3043d7256944654/transformed/core-1.10.1/AndroidManifest.xml:22:5-24:47
	android:protectionLevel
		ADDED from [androidx.core:core:1.10.1] /home/alfonso/.gradle/caches/transforms-3/4b92544d0249f0b3f3043d7256944654/transformed/core-1.10.1/AndroidManifest.xml:24:9-44
	android:name
		ADDED from [androidx.core:core:1.10.1] /home/alfonso/.gradle/caches/transforms-3/4b92544d0249f0b3f3043d7256944654/transformed/core-1.10.1/AndroidManifest.xml:23:9-81
permission#com.example.admin_taxi_app.DYNAMIC_RECEIVER_NOT_EXPORTED_PERMISSION
ADDED from [androidx.core:core:1.10.1] /home/alfonso/.gradle/caches/transforms-3/4b92544d0249f0b3f3043d7256944654/transformed/core-1.10.1/AndroidManifest.xml:22:5-24:47
	android:protectionLevel
		ADDED from [androidx.core:core:1.10.1] /home/alfonso/.gradle/caches/transforms-3/4b92544d0249f0b3f3043d7256944654/transformed/core-1.10.1/AndroidManifest.xml:24:9-44
	android:name
		ADDED from [androidx.core:core:1.10.1] /home/alfonso/.gradle/caches/transforms-3/4b92544d0249f0b3f3043d7256944654/transformed/core-1.10.1/AndroidManifest.xml:23:9-81
uses-permission#${applicationId}.DYNAMIC_RECEIVER_NOT_EXPORTED_PERMISSION
ADDED from [androidx.core:core:1.10.1] /home/alfonso/.gradle/caches/transforms-3/4b92544d0249f0b3f3043d7256944654/transformed/core-1.10.1/AndroidManifest.xml:26:5-97
	android:name
		ADDED from [androidx.core:core:1.10.1] /home/alfonso/.gradle/caches/transforms-3/4b92544d0249f0b3f3043d7256944654/transformed/core-1.10.1/AndroidManifest.xml:26:22-94
uses-permission#com.example.admin_taxi_app.DYNAMIC_RECEIVER_NOT_EXPORTED_PERMISSION
ADDED from [androidx.core:core:1.10.1] /home/alfonso/.gradle/caches/transforms-3/4b92544d0249f0b3f3043d7256944654/transformed/core-1.10.1/AndroidManifest.xml:26:5-97
	android:name
		ADDED from [androidx.core:core:1.10.1] /home/alfonso/.gradle/caches/transforms-3/4b92544d0249f0b3f3043d7256944654/transformed/core-1.10.1/AndroidManifest.xml:26:22-94
meta-data#androidx.lifecycle.ProcessLifecycleInitializer
ADDED from [androidx.lifecycle:lifecycle-process:2.6.1] /home/alfonso/.gradle/caches/transforms-3/6dc013a577521d6e7ca2fcdf9bbc8700/transformed/jetified-lifecycle-process-2.6.1/AndroidManifest.xml:29:13-31:52
	android:value
		ADDED from [androidx.lifecycle:lifecycle-process:2.6.1] /home/alfonso/.gradle/caches/transforms-3/6dc013a577521d6e7ca2fcdf9bbc8700/transformed/jetified-lifecycle-process-2.6.1/AndroidManifest.xml:31:17-49
	android:name
		ADDED from [androidx.lifecycle:lifecycle-process:2.6.1] /home/alfonso/.gradle/caches/transforms-3/6dc013a577521d6e7ca2fcdf9bbc8700/transformed/jetified-lifecycle-process-2.6.1/AndroidManifest.xml:30:17-78
meta-data#androidx.profileinstaller.ProfileInstallerInitializer
ADDED from [androidx.profileinstaller:profileinstaller:1.3.0] /home/alfonso/.gradle/caches/transforms-3/944dd7286e61e5229e404ec4831130f9/transformed/jetified-profileinstaller-1.3.0/AndroidManifest.xml:29:13-31:52
	android:value
		ADDED from [androidx.profileinstaller:profileinstaller:1.3.0] /home/alfonso/.gradle/caches/transforms-3/944dd7286e61e5229e404ec4831130f9/transformed/jetified-profileinstaller-1.3.0/AndroidManifest.xml:31:17-49
	android:name
		ADDED from [androidx.profileinstaller:profileinstaller:1.3.0] /home/alfonso/.gradle/caches/transforms-3/944dd7286e61e5229e404ec4831130f9/transformed/jetified-profileinstaller-1.3.0/AndroidManifest.xml:30:17-85
receiver#androidx.profileinstaller.ProfileInstallReceiver
ADDED from [androidx.profileinstaller:profileinstaller:1.3.0] /home/alfonso/.gradle/caches/transforms-3/944dd7286e61e5229e404ec4831130f9/transformed/jetified-profileinstaller-1.3.0/AndroidManifest.xml:34:9-52:20
	android:enabled
		ADDED from [androidx.profileinstaller:profileinstaller:1.3.0] /home/alfonso/.gradle/caches/transforms-3/944dd7286e61e5229e404ec4831130f9/transformed/jetified-profileinstaller-1.3.0/AndroidManifest.xml:37:13-35
	android:exported
		ADDED from [androidx.profileinstaller:profileinstaller:1.3.0] /home/alfonso/.gradle/caches/transforms-3/944dd7286e61e5229e404ec4831130f9/transformed/jetified-profileinstaller-1.3.0/AndroidManifest.xml:38:13-36
	android:permission
		ADDED from [androidx.profileinstaller:profileinstaller:1.3.0] /home/alfonso/.gradle/caches/transforms-3/944dd7286e61e5229e404ec4831130f9/transformed/jetified-profileinstaller-1.3.0/AndroidManifest.xml:39:13-57
	android:directBootAware
		ADDED from [androidx.profileinstaller:profileinstaller:1.3.0] /home/alfonso/.gradle/caches/transforms-3/944dd7286e61e5229e404ec4831130f9/transformed/jetified-profileinstaller-1.3.0/AndroidManifest.xml:36:13-44
	android:name
		ADDED from [androidx.profileinstaller:profileinstaller:1.3.0] /home/alfonso/.gradle/caches/transforms-3/944dd7286e61e5229e404ec4831130f9/transformed/jetified-profileinstaller-1.3.0/AndroidManifest.xml:35:13-76
intent-filter#action:name:androidx.profileinstaller.action.INSTALL_PROFILE
ADDED from [androidx.profileinstaller:profileinstaller:1.3.0] /home/alfonso/.gradle/caches/transforms-3/944dd7286e61e5229e404ec4831130f9/transformed/jetified-profileinstaller-1.3.0/AndroidManifest.xml:40:13-42:29
action#androidx.profileinstaller.action.INSTALL_PROFILE
ADDED from [androidx.profileinstaller:profileinstaller:1.3.0] /home/alfonso/.gradle/caches/transforms-3/944dd7286e61e5229e404ec4831130f9/transformed/jetified-profileinstaller-1.3.0/AndroidManifest.xml:41:17-91
	android:name
		ADDED from [androidx.profileinstaller:profileinstaller:1.3.0] /home/alfonso/.gradle/caches/transforms-3/944dd7286e61e5229e404ec4831130f9/transformed/jetified-profileinstaller-1.3.0/AndroidManifest.xml:41:25-88
intent-filter#action:name:androidx.profileinstaller.action.SKIP_FILE
ADDED from [androidx.profileinstaller:profileinstaller:1.3.0] /home/alfonso/.gradle/caches/transforms-3/944dd7286e61e5229e404ec4831130f9/transformed/jetified-profileinstaller-1.3.0/AndroidManifest.xml:43:13-45:29
action#androidx.profileinstaller.action.SKIP_FILE
ADDED from [androidx.profileinstaller:profileinstaller:1.3.0] /home/alfonso/.gradle/caches/transforms-3/944dd7286e61e5229e404ec4831130f9/transformed/jetified-profileinstaller-1.3.0/AndroidManifest.xml:44:17-85
	android:name
		ADDED from [androidx.profileinstaller:profileinstaller:1.3.0] /home/alfonso/.gradle/caches/transforms-3/944dd7286e61e5229e404ec4831130f9/transformed/jetified-profileinstaller-1.3.0/AndroidManifest.xml:44:25-82
intent-filter#action:name:androidx.profileinstaller.action.SAVE_PROFILE
ADDED from [androidx.profileinstaller:profileinstaller:1.3.0] /home/alfonso/.gradle/caches/transforms-3/944dd7286e61e5229e404ec4831130f9/transformed/jetified-profileinstaller-1.3.0/AndroidManifest.xml:46:13-48:29
action#androidx.profileinstaller.action.SAVE_PROFILE
ADDED from [androidx.profileinstaller:profileinstaller:1.3.0] /home/alfonso/.gradle/caches/transforms-3/944dd7286e61e5229e404ec4831130f9/transformed/jetified-profileinstaller-1.3.0/AndroidManifest.xml:47:17-88
	android:name
		ADDED from [androidx.profileinstaller:profileinstaller:1.3.0] /home/alfonso/.gradle/caches/transforms-3/944dd7286e61e5229e404ec4831130f9/transformed/jetified-profileinstaller-1.3.0/AndroidManifest.xml:47:25-85
intent-filter#action:name:androidx.profileinstaller.action.BENCHMARK_OPERATION
ADDED from [androidx.profileinstaller:profileinstaller:1.3.0] /home/alfonso/.gradle/caches/transforms-3/944dd7286e61e5229e404ec4831130f9/transformed/jetified-profileinstaller-1.3.0/AndroidManifest.xml:49:13-51:29
action#androidx.profileinstaller.action.BENCHMARK_OPERATION
ADDED from [androidx.profileinstaller:profileinstaller:1.3.0] /home/alfonso/.gradle/caches/transforms-3/944dd7286e61e5229e404ec4831130f9/transformed/jetified-profileinstaller-1.3.0/AndroidManifest.xml:50:17-95
	android:name
		ADDED from [androidx.profileinstaller:profileinstaller:1.3.0] /home/alfonso/.gradle/caches/transforms-3/944dd7286e61e5229e404ec4831130f9/transformed/jetified-profileinstaller-1.3.0/AndroidManifest.xml:50:25-92
