%YAML 1.1
%TAG !u! tag:unity3d.com,2011:
--- !u!162 &1
EditorUserSettings:
  m_ObjectHideFlags: 0
  serializedVersion: 4
  m_ConfigSettings:
    RecentlyUsedSceneGuid-0:
      value: 5a5757560101590a5d0c0e24427b5d44434e4c7a7b7a23677f2b4565b7b5353a
      flags: 0
    RecentlyUsedSceneGuid-1:
      value: 000151570700500f08565a234073084440161c7e752b7e6428701960e1b63260
      flags: 0
    RecentlyUsedScenePath-0:
      value: 22424703114646680e0b0227036c6c111b07142f1f2b233e2867083debf42d
      flags: 0
    RecentlyUsedScenePath-1:
      value: 22424703114646680c031c2e15105c1518120b651f2b233e283a5212ebf2372ae3e122c3e22e6d1d210bfc721130082beb
      flags: 0
    RecentlyUsedScenePath-2:
      value: 22424703114646680c031c2e15105c1518120b651f2b233e283a5210e3f27a2decee22f0
      flags: 0
    RecentlyUsedScenePath-3:
      value: 22424703114646680e0b0227036c6b1505032b292926237e38271427fb
      flags: 0
    RecentlyUsedScenePath-4:
      value: 22424703114646680c031c2e15105c1518120b651f2b233e283a5210eae12639e1f333fbd332362e3d32ea2e17310f1edb441c05ff1f13
      flags: 0
    RecentlyUsedScenePath-5:
      value: 22424703114646680c031c2e15105c1518120b651f2b233e283a5210eae12639e1f333fbd332362e3d32ea2e17310f71e704001fef
      flags: 0
    RecentlyUsedScenePath-6:
      value: 22424703114646680e0b0227036c791904040c06293e233c633c133af6f9
      flags: 0
    vcSharedLogLevel:
      value: 0d5e400f0650
      flags: 0
  m_VCAutomaticAdd: 1
  m_VCDebugCom: 0
  m_VCDebugCmd: 0
  m_VCDebugOut: 0
  m_SemanticMergeMode: 2
  m_DesiredImportWorkerCount: 3
  m_StandbyImportWorkerCount: 2
  m_IdleImportWorkerShutdownDelay: 60000
  m_VCShowFailedCheckout: 1
  m_VCOverwriteFailedCheckoutAssets: 1
  m_VCProjectOverlayIcons: 1
  m_VCHierarchyOverlayIcons: 1
  m_VCOtherOverlayIcons: 1
  m_VCAllowAsyncUpdate: 1
  m_ArtifactGarbageCollection: 1
